{"text_format":"1","workbook":"xlsx","n_sheets":11,"sheets":["Relatório 1","Plan2","LISTA DE GRUPOS DIVIDIDA","LISTA DE GRUPOS","Plan4","CLASSES","Orientações de preenchimento","Planilha","Lista de Grupos-Classes aberta","Lista","Formulas"],"not_rendered":{"charts":0,"images":0,"macros":0,"external_links":0,"defined_names":99,"comments":0,"pivot_tables":2},"unopened":[],"bounds":{"document_bytes":16777216,"sheet_cells":100000,"rows_first":2000,"rows_last":500,"rows_between":2000,"halvings":0,"cell_chars":16384,"cell_head_chars":4096},"cells_cut":0,"cells_raw":0,"read":"whole","date_system":"1900"}

{"sheet":"Relatório 1","index":0,"n_rows":830,"n_cols":7,"rows_kept":830,"cut":false,"hidden":true,"merged":[[1,2,1,6]]}
[]
[null,null,"Consulta Armazém   CATMAS"]
[]
[null,"Tipo Material/Serviço","Código Grupo Material/Serviço   Formatado","Grupo Material/Serviço","Tipo Material/Serviço","Código Classe Material/Serviço   Formatado","Classe Material/Serviço"]
[null,"MATERIAL","10","ARMAMENTO COMPONENTES EQUIPAMENTOS E APETRECHOS DE USO    POLICIAL","MATERIAL","1005","ARMAS DE FOGO"]
[null,"MATERIAL","10","ARMAMENTO COMPONENTES EQUIPAMENTOS E APETRECHOS DE USO    POLICIAL","MATERIAL","1010","PECAS E COMPONENTES PARA ARMAS DE FOGO"]
[null,"MATERIAL","10","ARMAMENTO COMPONENTES EQUIPAMENTOS E APETRECHOS DE USO    POLICIAL","MATERIAL","1015","FERRAMENTAS PARA ARMAMENTO"]
[null,"MATERIAL","10","ARMAMENTO COMPONENTES EQUIPAMENTOS E APETRECHOS DE USO    POLICIAL","MATERIAL","1020","EQUIPAMENTOS E APETRECHOS DE USO POLICIAL"]
[null,"MATERIAL","10","ARMAMENTO COMPONENTES EQUIPAMENTOS E APETRECHOS DE USO    POLICIAL","MATERIAL","1095","ARMAS DIVERSAS"]
[null,"MATERIAL","10","ARMAMENTO COMPONENTES EQUIPAMENTOS E APETRECHOS DE USO    POLICIAL","MATERIAL","1097","PECAS E COMPONENTES PARA ARMAS DIVERSAS"]
[null,"MATERIAL","13","EXPLOSIVOS MUNICOES E DISPOSITIVOS DE DISPERSAO","MATERIAL","1305","MUNICOES"]
[null,"MATERIAL","13","EXPLOSIVOS MUNICOES E DISPOSITIVOS DE DISPERSAO","MATERIAL","1370","ARTIGOS PIROTECNICOS E SINALIZADORES"]
[null,"MATERIAL","13","EXPLOSIVOS MUNICOES E DISPOSITIVOS DE DISPERSAO","MATERIAL","1375","EXPLOSIVOS E DISPOSITIVOS DE EXPLOSAO"]
[null,"MATERIAL","13","EXPLOSIVOS MUNICOES E DISPOSITIVOS DE DISPERSAO","MATERIAL","1380","DISPOSITOS DE DISPERSAO NAO EXPLOSIVOS"]
[null,"MATERIAL","15","AERONAVES E COMPONENTES ESTRUTURAIS","MATERIAL","1510","AERONAVES"]
[null,"MATERIAL","15","AERONAVES E COMPONENTES ESTRUTURAIS","MATERIAL","1560","COMPONENTES ESTRUTURAIS DE AERONAVES  "]
[null,"MATERIAL","16","COMPONENTES E ACESSORIOS DE AERONAVES","MATERIAL","1610","HELICES DE AERONAVES E COMPONENTES"]
[null,"MATERIAL","16","COMPONENTES E ACESSORIOS DE AERONAVES","MATERIAL","1615","INSTRUMENTOS PARA AERONAVES (AVIONICOS)"]
[null,"MATERIAL","16","COMPONENTES E ACESSORIOS DE AERONAVES","MATERIAL","1620","COMPONENTES DE TREM DE POUSO"]
[null,"MATERIAL","16","COMPONENTES E ACESSORIOS DE AERONAVES","MATERIAL","1625","ROTORES DE AERONAVES E COMPONENTES  "]
[null,"MATERIAL","16","COMPONENTES E ACESSORIOS DE AERONAVES","MATERIAL","1630","COMPONENTES DE SISTEMA DE FREIO E RODAS DE AERONAVES"]
[null,"MATERIAL","16","COMPONENTES E ACESSORIOS DE AERONAVES","MATERIAL","1635","COMPONENTES PARA SISTEMA DE EXTINCAO DE FOGO DE AERONAVES  "]
[null,"MATERIAL","16","COMPONENTES E ACESSORIOS DE AERONAVES","MATERIAL","1640","COMPONENTES PARA SISTEMA DE TRANSMISSAO DE AERONAVES  "]
[null,"MATERIAL","16","COMPONENTES E ACESSORIOS DE AERONAVES","MATERIAL","1645","COMPONENTES DO SISTEMA ELETRICO DE AERONAVES"]
[null,"MATERIAL","16","COMPONENTES E ACESSORIOS DE AERONAVES","MATERIAL","1650","COMPONENTES DE SISTEMA HIDRAULICODE VACUO E DEGELAMENTO DE AERONAVE"]
[null,"MATERIAL","16","COMPONENTES E ACESSORIOS DE AERONAVES","MATERIAL","1660","COMPONENTES DOS SISTEMAS DE CONDICIONAMENTO DE AR AQUECIMENTO E PRESSURIZACAO DE AERONAVE"]
[null,"MATERIAL","16","COMPONENTES E ACESSORIOS DE AERONAVES","MATERIAL","1665","COMPONENTES DE FIXACAO/VEDACAO E LUBRIFICACAO PARA AERONAVES"]
[null,"MATERIAL","16","COMPONENTES E ACESSORIOS DE AERONAVES","MATERIAL","1670","PARA QUEDASEQUIPAMENTO PARA COLETALANCAMENTO/ACONDICIONAMENTO CARGA AEREA"]
[null,"MATERIAL","16","COMPONENTES E ACESSORIOS DE AERONAVES","MATERIAL","1680","COMPONENTES E ACESSORIOS DIVERSOS DE AERONAVES"]
[null,"MATERIAL","16","COMPONENTES E ACESSORIOS DE AERONAVES","MATERIAL","1685","COMPONENTES E ACESSORIOS PARA AERONAVES PARA CONTRATACAO    MEDIANTE FORNECIMENTO PARCELADO"]
[null,"MATERIAL","16","COMPONENTES E ACESSORIOS DE AERONAVES","MATERIAL","1690","MOTORES DE AERONAVES E COMPONENTES"]
[null,"MATERIAL","16","COMPONENTES E ACESSORIOS DE AERONAVES","MATERIAL","1695","EQUIPAMENTOSPECASCOMPONENTES E ACESSORIOS PARA VANT  "]
[null,"MATERIAL","16","COMPONENTES E ACESSORIOS DE AERONAVES","MATERIAL","1696","EQUIPAMENTOS PARA REPARO E MANUTENCAO EM AERONAVE  "]
[null,"MATERIAL","16","COMPONENTES E ACESSORIOS DE AERONAVES","MATERIAL","1699","TINTAS VERNIZES E MATERIAIS CORRELATOS PARA AERONAVES"]
[null,"MATERIAL","17","EQUIPAMENTOS E VIATURAS PARA SERVICOS DE AERODROMO","MATERIAL","1730","EQUIPAMENTOS PARA SERVICOS DE AERODROMOS E AEROPORTOS"]
[null,"MATERIAL","19","EMBARCACOES PONTOES E DIQUES FLUTUANTES","MATERIAL","1910","EMBARCACOES PARA TRANSPORTE DE PASSAGEIROS"]
[null,"MATERIAL","19","EMBARCACOES PONTOES E DIQUES FLUTUANTES","MATERIAL","1940","PEQUENAS EMBARCACOES"]
[null,"MATERIAL","20","MATERIAIS E EQUIPAMENTOS PARA EMBARCACOES","MATERIAL","2040","FERRAGENS PARA EMBARCACOES E ITENS DO CASCO"]
[null,"MATERIAL","20","MATERIAIS E EQUIPAMENTOS PARA EMBARCACOES","MATERIAL","2090","EQUIPAMENTOS COMPONENTES E ACESSORIOS PARA EMBARCACOES"]
[null,"MATERIAL","21","MEDICAMENTO","MATERIAL","2101","PREPARADOS ESTOMATOLOGICOS (BOCA E DENTES)"]
[null,"MATERIAL","21","MEDICAMENTO","MATERIAL","2102","ANTIACIDOS INIBIDORES DA SECRECAO GASTRICA E TRATAMENTO DASULCERAS"]
[null,"MATERIAL","21","MEDICAMENTO","MATERIAL","2103","ANTIESPASMODICOS ANTICOLINERGICOS E PROPULSIVOS"]
[null,"MATERIAL","21","MEDICAMENTO","MATERIAL","2104","ANTIEMETICOS E ANTINAUSEANTES"]
[null,"MATERIAL","21","MEDICAMENTO","MATERIAL","2105","TRATAMENTO BILIAR E HEPATICO"]
[null,"MATERIAL","21","MEDICAMENTO","MATERIAL","2106","LAXATIVOS"]
[null,"MATERIAL","21","MEDICAMENTO","MATERIAL","2107","ANTIDIARREICOS ANTI INFLAMATORIOS ANTI INFECCIOSOS INTESTINAIS"]
[null,"MATERIAL","21","MEDICAMENTO","MATERIAL","2108","PREPARADOS ANTIOBESIDADE"]
[null,"MATERIAL","21","MEDICAMENTO","MATERIAL","2109","DIGESTIVOS E ENZIMAS DIGESTIVAS"]
[null,"MATERIAL","21","MEDICAMENTO","MATERIAL","2110","MEDICAMENTOS UTILIZADOS NO DIABETES"]
[null,"MATERIAL","21","MEDICAMENTO","MATERIAL","2111","VITAMINAS SUPLEMENTOS MINERAIS E ASSOCIACOES"]
[null,"MATERIAL","21","MEDICAMENTO","MATERIAL","2112","TONICOS E REPOSITORES HIDROELETROLITICOS ORAIS"]
[null,"MATERIAL","21","MEDICAMENTO","MATERIAL","2113","ANABOLIZANTES PARA USO SISTEMICO"]
[null,"MATERIAL","21","MEDICAMENTO","MATERIAL","2114","ESTIMULANTES DO APETITE"]
[null,"MATERIAL","21","MEDICAMENTO","MATERIAL","2115","OUTROS MEDICAMENTOS PARA O SISTEMA DIGESTIVO E O METABOLISMO"]
[null,"MATERIAL","21","MEDICAMENTO","MATERIAL","2116","ANTICOAGULANTES ANTITROMBOTICOS E TROMBOLITICOS"]
[null,"MATERIAL","21","MEDICAMENTO","MATERIAL","2117","ANTI HEMORRAGICOS FATORES DE COAGULACAO E CORRELATOS"]
[null,"MATERIAL","21","MEDICAMENTO","MATERIAL","2118","PREPARADOS ANTIANEMICOS"]
[null,"MATERIAL","21","MEDICAMENTO","MATERIAL","2119","HEMODIALISES DIALISES E SOLUCOES PARA PERFUSAO E IRRIGACAO"]
[null,"MATERIAL","21","MEDICAMENTO","MATERIAL","2120","NUTRICAO PARENTERAL"]
[null,"MATERIAL","21","MEDICAMENTO","MATERIAL","2121","OUTROS PREPARADOS HEMATOLOGICOS"]
[null,"MATERIAL","21","MEDICAMENTO","MATERIAL","2122","ESTIMULANTES CARDIACOS CARDIOTONICOS E GLICOSIDEOS"]
[null,"MATERIAL","21","MEDICAMENTO","MATERIAL","2123","ANTI HIPERTENSIVOS"]
[null,"MATERIAL","21","MEDICAMENTO","MATERIAL","2124","DIURETICOS"]
[null,"MATERIAL","21","MEDICAMENTO","MATERIAL","2125","VASODILATADORES PERIFERICOS"]
[null,"MATERIAL","21","MEDICAMENTO","MATERIAL","2126","VASOPROTETORES"]
[null,"MATERIAL","21","MEDICAMENTO","MATERIAL","2127","BETA BLOQUEADORES"]
[null,"MATERIAL","21","MEDICAMENTO","MATERIAL","2128","BLOQUEADORES DE CANAL DE CALCIO"]
[null,"MATERIAL","21","MEDICAMENTO","MATERIAL","2129","SISTEMA RENINA ANGIOTENSINA"]
[null,"MATERIAL","21","MEDICAMENTO","MATERIAL","2130","HIPOLIPEMIANTES"]
[null,"MATERIAL","21","MEDICAMENTO","MATERIAL","2131","ANTI INFECCIOSOS ANTIBIOTICOS E ANTI INFLAMATORIOS TOPICOS"]
[null,"MATERIAL","21","MEDICAMENTO","MATERIAL","2132","EMOLIENTES HIDRATANTES PROTETORES E FILTRO SOLAR"]
[null,"MATERIAL","21","MEDICAMENTO","MATERIAL","2133","TRATAMENTO DE FERIDAS E ULCERAS"]
[null,"MATERIAL","21","MEDICAMENTO","MATERIAL","2134","ANTIPRURIGINOSOS E ANTIPSORIATICOS"]
[null,"MATERIAL","21","MEDICAMENTO","MATERIAL","2135","ANTISSEPTICOS E DESINFETANTES"]
[null,"MATERIAL","21","MEDICAMENTO","MATERIAL","2136","ANTIACNEICOS"]
[null,"MATERIAL","21","MEDICAMENTO","MATERIAL","2137","OUTROS PREPARADOS DERMATOLOGICOS"]
[null,"MATERIAL","21","MEDICAMENTO","MATERIAL","2138","ANTI INFECCIOSOS E ANTISSEPTICOS GINECOLOGICOS"]
[null,"MATERIAL","21","MEDICAMENTO","MATERIAL","2139","OUTROS PREPARADOS GINECOLOGICOS"]
[null,"MATERIAL","21","MEDICAMENTO","MATERIAL","2140","ANTICONCEPCIONAIS HORMONIOS SEXUAIS E MODULADORES DO SISTEMA GENITAL"]
[null,"MATERIAL","21","MEDICAMENTO","MATERIAL","2141","MEDICAMENTOS UROLOGICOS"]
[null,"MATERIAL","21","MEDICAMENTO","MATERIAL","2142","HORMONIOS HIPOFISARIOS HIPOTALAMICOS E ANALOGOS"]
[null,"MATERIAL","21","MEDICAMENTO","MATERIAL","2143","CORTICOESTEROIDES SISTEMICOS"]
[null,"MATERIAL","21","MEDICAMENTO","MATERIAL","2144","TRATAMENTO DA TIREOIDE"]
[null,"MATERIAL","21","MEDICAMENTO","MATERIAL","2145","HORMONIOS PANCREATICOS"]
[null,"MATERIAL","21","MEDICAMENTO","MATERIAL","2146","MEDICAMENTOS RELACIONADOS A HOMEOSTASIA DO CALCIO"]
[null,"MATERIAL","21","MEDICAMENTO","MATERIAL","2147","ANTIBACTERIANOS SISTEMICOS"]
[null,"MATERIAL","21","MEDICAMENTO","MATERIAL","2148","ANTIFUNGICOS SISTEMICOS"]
[null,"MATERIAL","21","MEDICAMENTO","MATERIAL","2149","ANTIMICOBACTERIANOS SISTEMICOS"]
[null,"MATERIAL","21","MEDICAMENTO","MATERIAL","2150","ANTIVIRAIS SISTEMICOS"]
[null,"MATERIAL","21","MEDICAMENTO","MATERIAL","2151","IMUNOSOROS E IMUNOGLOBULINAS"]
[null,"MATERIAL","21","MEDICAMENTO","MATERIAL","2152","VACINAS"]
[null,"MATERIAL","21","MEDICAMENTO","MATERIAL","2153","ANTINEOPLASICOS"]
[null,"MATERIAL","21","MEDICAMENTO","MATERIAL","2154","TERAPIAS ENDOCRINAS"]
[null,"MATERIAL","21","MEDICAMENTO","MATERIAL","2155","IMUNOESTIMULANTES"]
[null,"MATERIAL","21","MEDICAMENTO","MATERIAL","2156","IMUNOSSUPRESSORES"]
[null,"MATERIAL","21","MEDICAMENTO","MATERIAL","2157","ANTI INFLAMATORIOS E ANTIRREUMATICOS"]
[null,"MATERIAL","21","MEDICAMENTO","MATERIAL","2159","RELAXANTES MUSCULARES"]
[null,"MATERIAL","21","MEDICAMENTO","MATERIAL","2160","ANTIGOTOSOS"]
[null,"MATERIAL","21","MEDICAMENTO","MATERIAL","2161","TRATAMENTO DE DOENCAS OSSEAS"]
[null,"MATERIAL","21","MEDICAMENTO","MATERIAL","2162","OUTROS MEDICAMENTOS PARA O SISTEMA MUSCULO ESQUELETICO"]
[null,"MATERIAL","21","MEDICAMENTO","MATERIAL","2163","ANESTESICOS"]
[null,"MATERIAL","21","MEDICAMENTO","MATERIAL","2164","ANALGESICOS E ANTIPIRETICOS"]
[null,"MATERIAL","21","MEDICAMENTO","MATERIAL","2165","ANTIEPILEPTICOS"]
[null,"MATERIAL","21","MEDICAMENTO","MATERIAL","2166","ANTIPARKINSONIANOS"]
[null,"MATERIAL","21","MEDICAMENTO","MATERIAL","2167","ANTIPSICICOTICOS"]
[null,"MATERIAL","21","MEDICAMENTO","MATERIAL","2168","ANSIOLITICOS"]
[null,"MATERIAL","21","MEDICAMENTO","MATERIAL","2169","HIPNOTICOS E SEDATIVOS"]
[null,"MATERIAL","21","MEDICAMENTO","MATERIAL","2170","ANTIDEPRESSIVOS"]
[null,"MATERIAL","21","MEDICAMENTO","MATERIAL","2171","PSICOESTIMULANTES"]
[null,"MATERIAL","21","MEDICAMENTO","MATERIAL","2172","PSICOLEPTICOS E PSICOANAPLETICOS EM ASSOCIACAO"]
[null,"MATERIAL","21","MEDICAMENTO","MATERIAL","2173","TRATAMENTO DO ALZHEIMER E DEMENCIA"]
[null,"MATERIAL","21","MEDICAMENTO","MATERIAL","2174","OUTROS MEDICAMENTOS PARA O SISTEMA NERVOSO"]
[null,"MATERIAL","21","MEDICAMENTO","MATERIAL","2175","ANTIPROTOZOARIOS"]
[null,"MATERIAL","21","MEDICAMENTO","MATERIAL","2176","ANTI HELMINTICOS"]
[null,"MATERIAL","21","MEDICAMENTO","MATERIAL","2177","INSETICIDAS REPELENTES ESCABICIDAS E ECTOPARASITOCIDAS"]
[null,"MATERIAL","21","MEDICAMENTO","MATERIAL","2180","PREPARADOS PARA USO NASAL"]
[null,"MATERIAL","21","MEDICAMENTO","MATERIAL","2182","ANTIASMATICOS"]
[null,"MATERIAL","21","MEDICAMENTO","MATERIAL","2183","MEDICAMENTOS PARA TOSSE E RESFRIADO"]
[null,"MATERIAL","21","MEDICAMENTO","MATERIAL","2184","ANTI HISTAMINICOS SISTEMICOS"]
[null,"MATERIAL","21","MEDICAMENTO","MATERIAL","2185","OUTROS MEDICAMENTOS PARA O SISTEMA RESPIRATORIO"]
[null,"MATERIAL","21","MEDICAMENTO","MATERIAL","2186","PRODUTOS OFTALMOLOGICOS"]
[null,"MATERIAL","21","MEDICAMENTO","MATERIAL","2187","PRODUTOS OTOLOGICOS"]
[null,"MATERIAL","21","MEDICAMENTO","MATERIAL","2188","ANTIDOTOS AGENTES DESINTOXICANTES E AGENTES QUELANTES"]
[null,"MATERIAL","21","MEDICAMENTO","MATERIAL","2189","GASES MEDICINAIS"]
[null,"MATERIAL","21","MEDICAMENTO","MATERIAL","2190","TESTES E AGENTES DE DIAGNOSTICO"]
[null,"MATERIAL","21","MEDICAMENTO","MATERIAL","2191","EQUIPAMENTOS REAGENTES SOLVENTES E OUTROS INSUMOS FARMACEUTICOS"]
[null,"MATERIAL","21","MEDICAMENTO","MATERIAL","2192","MEIOS DE CONTRASTE"]
[null,"MATERIAL","21","MEDICAMENTO","MATERIAL","2194","OUTROS PRODUTOS TERAPEUTICOS"]
[null,"MATERIAL","21","MEDICAMENTO","MATERIAL","2195","ANTROPOSOFICOS FITOTERAPICOS E HOMEOPATICOS"]
[null,"MATERIAL","21","MEDICAMENTO","MATERIAL","2196","FORMULAS OU ASSOCIACOES MANIPULADAS"]
[null,"MATERIAL","21","MEDICAMENTO","MATERIAL","2197","MEDICAMENTOS VETERINARIOS"]
[null,"MATERIAL","23","VEICULOS PARA TRANSPORTE RODOVIARIO DE PASSAGEIROS E  DE CARGA","MATERIAL","2301","VEICULOS MOTORIZADOS DE SERVICO PARA TRANSPORTE DE PASSAGEIROS"]
[null,"MATERIAL","23","VEICULOS PARA TRANSPORTE RODOVIARIO DE PASSAGEIROS E  DE CARGA","MATERIAL","2303","VEICULOS MOTORIZADOS DE SERVICO PARA TRANSPORTE DE CARGA"]
[null,"MATERIAL","23","VEICULOS PARA TRANSPORTE RODOVIARIO DE PASSAGEIROS E  DE CARGA","MATERIAL","2310","VEICULOS MOTORIZADOS PARA TRANSPORTE DE PASSAGEIRO"]
[null,"MATERIAL","23","VEICULOS PARA TRANSPORTE RODOVIARIO DE PASSAGEIROS E  DE CARGA","MATERIAL","2320","VEICULOS MOTORIZADOS PARA TRANSPORTE DE CARGA"]
[null,"MATERIAL","23","VEICULOS PARA TRANSPORTE RODOVIARIO DE PASSAGEIROS E  DE CARGA","MATERIAL","2330","REBOQUES"]
[null,"MATERIAL","23","VEICULOS PARA TRANSPORTE RODOVIARIO DE PASSAGEIROS E  DE CARGA","MATERIAL","2340","OUTROS VEICULOS DE 0203 OU 04 RODAS COMPONENTES E PECAS"]
[null,"MATERIAL","23","VEICULOS PARA TRANSPORTE RODOVIARIO DE PASSAGEIROS E  DE CARGA","MATERIAL","2360","VEICULOS ESPECIAIS"]
[null,"MATERIAL","23","VEICULOS PARA TRANSPORTE RODOVIARIO DE PASSAGEIROS E  DE CARGA","MATERIAL","2370","VIATURAS"]
[null,"MATERIAL","24","TRATORES","MATERIAL","2420","TRATORES DE RODA"]
[null,"MATERIAL","24","TRATORES","MATERIAL","2425","ACESSORIOS E COMPONENTES PARA TRATOR DE RODA"]
[null,"MATERIAL","25","COMPONENTES PARA VEICULOS","MATERIAL","2505","COMPONENTES E ACESSORIOS DE VEICULOS PARA CONTRATACAO MEDIANTE FORNECIMENTO PARCELADO"]
[null,"MATERIAL","25","COMPONENTES PARA VEICULOS","MATERIAL","2506","PECAS E COMPONENTES VEICULARES"]
[null,"MATERIAL","25","COMPONENTES PARA VEICULOS","MATERIAL","2510","COMPONENTES ESTRUTURAIS (CHASSIS CARROCERIA E CABINES E COMPONENTES) DE VEICULOS"]
[null,"MATERIAL","25","COMPONENTES PARA VEICULOS","MATERIAL","2520","COMPONENTES DO SISTEMA DE TRANSMISSAO DE FORCA DE VEICULOS"]
[null,"MATERIAL","25","COMPONENTES PARA VEICULOS","MATERIAL","2530","COMPONENTES DO SISTEMA DE FREIO DE VEICULOS"]
[null,"MATERIAL","25","COMPONENTES PARA VEICULOS","MATERIAL","2531","COMPONENTES DO SISTEMA DE DIRECAO DE VEICULOS"]
[null,"MATERIAL","25","COMPONENTES PARA VEICULOS","MATERIAL","2532","SISTEMA DE EIXO DE VEICULOS E COMPONENTES"]
[null,"MATERIAL","25","COMPONENTES PARA VEICULOS","MATERIAL","2533","COMPONENTES DE RODAS E ESTEIRAS DE VEICULOS"]
[null,"MATERIAL","25","COMPONENTES PARA VEICULOS","MATERIAL","2535","COMPONENTES DO SISTEMA ELETRICO DE VEICULOS"]
[null,"MATERIAL","25","COMPONENTES PARA VEICULOS","MATERIAL","2540","COMPONENTES DO SISTEMA DE CAPOTARIA DE VEICULOS"]
[null,"MATERIAL","25","COMPONENTES PARA VEICULOS","MATERIAL","2550","COMPONENTES DO SISTEMA DE SUSPENSAO DE VEICULOS"]
[null,"MATERIAL","25","COMPONENTES PARA VEICULOS","MATERIAL","2560","MOTORES AUTOMOTIVOS E COMPONENTES"]
[null,"MATERIAL","25","COMPONENTES PARA VEICULOS","MATERIAL","2590","COMPONENTES DIVERSOS E ACESSORIOS DE VEICULOS"]
[null,"MATERIAL","25","COMPONENTES PARA VEICULOS","MATERIAL","2595","COMPONENTES PARA VEICULOS ESPECIAIS"]
[null,"MATERIAL","25","COMPONENTES PARA VEICULOS","MATERIAL","2597","MATERIAL DE FIXACAO VEDACAO E LUBRIFICACAO PARA  USO  VEICULAR"]
[null,"MATERIAL","25","COMPONENTES PARA VEICULOS","MATERIAL","2599","TINTAS VERNIZES E PRODUTOS CORRELATOS USO AUTOMOTIVO"]
[null,"MATERIAL","26","PNEUS CAMARAS DE AR E MATERIAIS CORRELATOS","MATERIAL","2610","PNEUS E CAMARAS DE AR EXCETO DE AERONAVES"]
[null,"MATERIAL","26","PNEUS CAMARAS DE AR E MATERIAIS CORRELATOS","MATERIAL","2620","PNEUS E CAMARAS DE AR DE AERONAVES"]
[null,"MATERIAL","26","PNEUS CAMARAS DE AR E MATERIAIS CORRELATOS","MATERIAL","2640","MATERIAIS PARA RECONDICIONAMENTO E ACESSORIOS DE PNEUS  E CAMARAS DE AR"]
[null,"MATERIAL","28","MOTORES TURBINAS E COMPONENTES","MATERIAL","2805","MOTORES A GASOLINA ALCOOL GAS E COMPONENTESEXCETO DE AERONAVES E COMPONENTES"]
[null,"MATERIAL","28","MOTORES TURBINAS E COMPONENTES","MATERIAL","2815","MOTORES DIESEL E COMPONENTES"]
[null,"MATERIAL","29","ACESSORIOS DE MOTORES","MATERIAL","2910","COMPONENTES DE SISTEMA DE COMBUSTIVEL DE MOTORES EXCETO DE  AERONAVES"]
[null,"MATERIAL","29","ACESSORIOS DE MOTORES","MATERIAL","2915","COMPONENTES DO SISTEMA DE COMBUSTIVEL DE MOTORES DE AERONAVES"]
[null,"MATERIAL","29","ACESSORIOS DE MOTORES","MATERIAL","2920","COMPONENTES DO SISTEMA ELETRICO DE MOTORES EXCETO DE AERONAVES"]
[null,"MATERIAL","29","ACESSORIOS DE MOTORES","MATERIAL","2930","COMPONENTES DE SISTEMA DE ARREFECIMENTO DE MOTORES EXCETO  DE AERONAVES"]
[null,"MATERIAL","29","ACESSORIOS DE MOTORES","MATERIAL","2940","PURIFICADORES E FILTROS DE MOTORES EXCETO DE AERONAVES"]
[null,"MATERIAL","29","ACESSORIOS DE MOTORES","MATERIAL","2945","PURIFICADORES E FILTROS DE AR E DE OLEO DE MOTORES DE AERONAVES"]
[null,"MATERIAL","29","ACESSORIOS DE MOTORES","MATERIAL","2990","ACESSORIOS DIVERSOS DE MOTORES EXCETO DE AERONAVES"]
[null,"MATERIAL","29","ACESSORIOS DE MOTORES","MATERIAL","2995","ACESSORIOS DIVERSOS DE MOTORES DE AERONAVES"]
[null,"MATERIAL","30","EQUIPAMENTOS PARA TRANSMISSAO DE ENERGIA MECANICA","MATERIAL","3030","CORREIAS DE TRANSMISSAO E ACESSORIOS"]
[null,"MATERIAL","30","EQUIPAMENTOS PARA TRANSMISSAO DE ENERGIA MECANICA","MATERIAL","3040","EQUIPAMENTOS DIVERSOS PARA TRANSMISSAO DE FORCA"]
[null,"MATERIAL","31","ROLAMENTOS E MANCAIS","MATERIAL","3110","ROLAMENTOS E COMPONENTES"]
[null,"MATERIAL","31","ROLAMENTOS E MANCAIS","MATERIAL","3120","MANCAIS E COMPONENTES"]
[null,"MATERIAL","32","EQUIPAMENTOS E MAQUINARIA PARA TRABALHOS EM MADEIRA","MATERIAL","3210","SERRARIA E OFICINA DE APLAINAR"]
[null,"MATERIAL","32","EQUIPAMENTOS E MAQUINARIA PARA TRABALHOS EM MADEIRA","MATERIAL","3220","MAQUINARIA PARA TRABALHOS EM MADEIRA"]
[null,"MATERIAL","32","EQUIPAMENTOS E MAQUINARIA PARA TRABALHOS EM MADEIRA","MATERIAL","3230","FERRAMENTAS E IMPLEMENTOS DE MAQUINA PARA TRABALHO EM  MADEIRA"]
[null,"MATERIAL","32","EQUIPAMENTOS E MAQUINARIA PARA TRABALHOS EM MADEIRA","MATERIAL","3235","PECAS E COMPONENTES PARA EQUIPAMENTOS E MAQUINARIA PARA TRABALHOS EM MADEIRA"]
[null,"MATERIAL","34","EQUIPAMENTOS E MAQUINARIA PARA TRABALHOS EM METAL","MATERIAL","3405","SERRAS E MAQUINA DE LIMAR"]
[null,"MATERIAL","34","EQUIPAMENTOS E MAQUINARIA PARA TRABALHOS EM METAL","MATERIAL","3413","MAQUINA DE FURAR METAL"]
[null,"MATERIAL","34","EQUIPAMENTOS E MAQUINARIA PARA TRABALHOS EM METAL","MATERIAL","3415","MAQUINAS DE ESMERILHAR E RETIFICAR"]
[null,"MATERIAL","34","EQUIPAMENTOS E MAQUINARIA PARA TRABALHOS EM METAL","MATERIAL","3416","TORNOS"]
[null,"MATERIAL","34","EQUIPAMENTOS E MAQUINARIA PARA TRABALHOS EM METAL","MATERIAL","3417","MAQUINA DE FRESAR"]
[null,"MATERIAL","34","EQUIPAMENTOS E MAQUINARIA PARA TRABALHOS EM METAL","MATERIAL","3418","DESBASTADORAS E PLAINAS LIMADORAS"]
[null,"MATERIAL","34","EQUIPAMENTOS E MAQUINARIA PARA TRABALHOS EM METAL","MATERIAL","3419","MAQUINAS FERRAMENTA DIVERSAS"]
[null,"MATERIAL","34","EQUIPAMENTOS E MAQUINARIA PARA TRABALHOS EM METAL","MATERIAL","3424","EQUIPAMENTOS PARA TRATAMENTO TERMICO DE METAIS"]
[null,"MATERIAL","34","EQUIPAMENTOS E MAQUINARIA PARA TRABALHOS EM METAL","MATERIAL","3428","MATERIAIS E EQUIPAMENTOS PARA FUNDICAO EM GERAL"]
[null,"MATERIAL","34","EQUIPAMENTOS E MAQUINARIA PARA TRABALHOS EM METAL","MATERIAL","3431","EQUIPAMENTOS DE SOLDA A ARCO VOLTAICO"]
[null,"MATERIAL","34","EQUIPAMENTOS E MAQUINARIA PARA TRABALHOS EM METAL","MATERIAL","3432","EQUIPAMENTOS DE SOLDA A RESISTENCIA ELETRICA"]
[null,"MATERIAL","34","EQUIPAMENTOS E MAQUINARIA PARA TRABALHOS EM METAL","MATERIAL","3433","SOLDA A GAS CORTE A QUENTE E EQUIPAMENTO DE METALIZACAO"]
[null,"MATERIAL","34","EQUIPAMENTOS E MAQUINARIA PARA TRABALHOS EM METAL","MATERIAL","3438","EQUIPAMENTOS DE SOLDA DIVERSOS  (EM GERAL)"]
[null,"MATERIAL","34","EQUIPAMENTOS E MAQUINARIA PARA TRABALHOS EM METAL","MATERIAL","3439","ARTIGOS E ACESSORIOS PARA SOLDAGENS COMUM FRACA E POR CALDEAMENTO"]
[null,"MATERIAL","34","EQUIPAMENTOS E MAQUINARIA PARA TRABALHOS EM METAL","MATERIAL","3441","MAQUINAS DE DOBRAR E MOLDAR"]
[null,"MATERIAL","34","EQUIPAMENTOS E MAQUINARIA PARA TRABALHOS EM METAL","MATERIAL","3442","PRENSAS HIDRAULICAS/ELETRICAS/PNEUMATICAS A MOTOR"]
[null,"MATERIAL","34","EQUIPAMENTOS E MAQUINARIA PARA TRABALHOS EM METAL","MATERIAL","3444","PRENSA MANUAL"]
[null,"MATERIAL","34","EQUIPAMENTOS E MAQUINARIA PARA TRABALHOS EM METAL","MATERIAL","3445","MAQUINAS DE PUNCIONAR E TESOURAS MECANICAS"]
[null,"MATERIAL","34","EQUIPAMENTOS E MAQUINARIA PARA TRABALHOS EM METAL","MATERIAL","3448","MAQUINAS DE REBITAR"]
[null,"MATERIAL","34","EQUIPAMENTOS E MAQUINARIA PARA TRABALHOS EM METAL","MATERIAL","3449","MAQUINAS SECUNDARIAS PARA FORMA E CORTE DE METAL"]
[null,"MATERIAL","34","EQUIPAMENTOS E MAQUINARIA PARA TRABALHOS EM METAL","MATERIAL","3455","FERRAMENTAS DE CORTES PARA MAQUINAS FERRAMENTA"]
[null,"MATERIAL","34","EQUIPAMENTOS E MAQUINARIA PARA TRABALHOS EM METAL","MATERIAL","3460","ACESSORIOS PARA MAQUINAS FERRAMENTA"]
[null,"MATERIAL","34","EQUIPAMENTOS E MAQUINARIA PARA TRABALHOS EM METAL","MATERIAL","3465","GABARITOS PARA PRODUCAO FURACAO E COPIAS"]
[null,"MATERIAL","34","EQUIPAMENTOS E MAQUINARIA PARA TRABALHOS EM METAL","MATERIAL","3475","MATERIAL COMPONENTES E PECAS PARA EQUIPAMENTOS E MAQUINARIAPARA TRABALHOS EM METAL"]
[null,"MATERIAL","35","EQUIPAMENTOS COMERCIAIS E DE SERVICOS","MATERIAL","3510","EQUIPAMENTOS DE LAVANDERIA"]
[null,"MATERIAL","35","EQUIPAMENTOS COMERCIAIS E DE SERVICOS","MATERIAL","3520","EQUIPAMENTOS PARA MANUFATURA E CONSERTO DE CALCADOS"]
[null,"MATERIAL","35","EQUIPAMENTOS COMERCIAIS E DE SERVICOS","MATERIAL","3530","MAQUINAS E EQUIPAMENTOS INDUSTRIAIS DE COSTURA"]
[null,"MATERIAL","35","EQUIPAMENTOS COMERCIAIS E DE SERVICOS","MATERIAL","3540","EQUIPAMENTOS PARA ACONDICIONAMENTO E EMBALAGEM"]
[null,"MATERIAL","35","EQUIPAMENTOS COMERCIAIS E DE SERVICOS","MATERIAL","3560","EQUIPAMENTOS E COMPONENTES PARA AUTOMACAO E CONTROLE"]
[null,"MATERIAL","35","EQUIPAMENTOS COMERCIAIS E DE SERVICOS","MATERIAL","3590","EQUIPAMENTOS DIVERSOS COMERCIAIS E DE SERVICOS"]
[null,"MATERIAL","35","EQUIPAMENTOS COMERCIAIS E DE SERVICOS","MATERIAL","3595","COMPONENTES E PECAS PARA EQUIPAMENTOS COMERCIAIS E DE       SERVICOS"]
[null,"MATERIAL","35","EQUIPAMENTOS COMERCIAIS E DE SERVICOS","MATERIAL","3598","COMPONENTES E ACESSORIOS PARA EQUIPAMENTOS DE LAVANDERIA    PARA CONTRATOS DE MANUTENCAO CORRETIVA/PREVENTIVA"]
[null,"MATERIAL","36","MAQUINARIAEQUIPAMENTOSCOMPONENTES E SUPRIMENTOS PARA A  INDUSTRIA ESPECIALIZADA","MATERIAL","3605","MAQUINAS EQUIPAMENTOS COMPONENTES E SUPRIMENTOS PARA INDUSTRIA DE PRODUTOS ALIMENTICIOS"]
[null,"MATERIAL","36","MAQUINARIAEQUIPAMENTOSCOMPONENTES E SUPRIMENTOS PARA A  INDUSTRIA ESPECIALIZADA","MATERIAL","3610","MAQUINAS EQUIPAMENTOS COMPONENTES E SUPRIMENTOS PARA INDUSTRIA GRAFICA"]
[null,"MATERIAL","36","MAQUINARIAEQUIPAMENTOSCOMPONENTES E SUPRIMENTOS PARA A  INDUSTRIA ESPECIALIZADA","MATERIAL","3615","MAQUINAS EQUIPAMETOS COMPONENTES E SUPRIMENTOS PARA INDUSTRIA DE POLPA E DE PAPEL"]
[null,"MATERIAL","36","MAQUINARIAEQUIPAMENTOSCOMPONENTES E SUPRIMENTOS PARA A  INDUSTRIA ESPECIALIZADA","MATERIAL","3620","MAQUINAS EQUIPAMENTOS COMPONENTES E SUPRIMENTOS PARA INDUSTRIA DE BORRACHA PLASTICO E PRODUTOS SINTETICOS"]
[null,"MATERIAL","36","MAQUINARIAEQUIPAMENTOSCOMPONENTES E SUPRIMENTOS PARA A  INDUSTRIA ESPECIALIZADA","MATERIAL","3625","MAQUINAS EQUIPAMENTOS COMPONENTES E SUPRIMENTOS PARA INDUSTRIAS TEXTEIS"]
[null,"MATERIAL","36","MAQUINARIAEQUIPAMENTOSCOMPONENTES E SUPRIMENTOS PARA A  INDUSTRIA ESPECIALIZADA","MATERIAL","3630","MAQUINAS EQUIPAMENTOS COMPONENTES E SUPRIMENTOS PARA INDUSTRIA DE PRODUTOS DE ARGILA E CONCRETO"]
[null,"MATERIAL","36","MAQUINARIAEQUIPAMENTOSCOMPONENTES E SUPRIMENTOS PARA A  INDUSTRIA ESPECIALIZADA","MATERIAL","3650","MAQUINAS EQUIPAMENTOS E COMPONENTES DE MANUFATURA DE  PRODUTOS QUIMICOS E FARMACEUTICOS"]
[null,"MATERIAL","36","MAQUINARIAEQUIPAMENTOSCOMPONENTES E SUPRIMENTOS PARA A  INDUSTRIA ESPECIALIZADA","MATERIAL","3655","EQUIPAMENTO PARA PRODUCAO E RECICLAGEM DE GASES  "]
[null,"MATERIAL","36","MAQUINARIAEQUIPAMENTOSCOMPONENTES E SUPRIMENTOS PARA A  INDUSTRIA ESPECIALIZADA","MATERIAL","3693","MAQUINAS INDUSTRIAIS DE MONTAGEM"]
[null,"MATERIAL","36","MAQUINARIAEQUIPAMENTOSCOMPONENTES E SUPRIMENTOS PARA A  INDUSTRIA ESPECIALIZADA","MATERIAL","3695","EQUIPAMENTOS COMPONENTES E SUPRIMENTOS PARA INDUSTRIAS DI  VERSAS"]
[null,"MATERIAL","36","MAQUINARIAEQUIPAMENTOSCOMPONENTES E SUPRIMENTOS PARA A  INDUSTRIA ESPECIALIZADA","MATERIAL","3699","PECAS E COMPONENTES PARA MAQUINARIA E EQUIPAMENTOS P/INDUS  TRIA ESPECIALIZADA"]
[null,"MATERIAL","37","MAQUINARIA E EQUIPAMENTOS AGRICOLAS","MATERIAL","3710","EQUIPAMENTOS AGRICOLAS"]
[null,"MATERIAL","37","MAQUINARIA E EQUIPAMENTOS AGRICOLAS","MATERIAL","3720","EQUIPAMENTOS DE COLHEITA"]
[null,"MATERIAL","37","MAQUINARIA E EQUIPAMENTOS AGRICOLAS","MATERIAL","3730","EQUIPAMENTOS PARA AGRO PECUARIA"]
[null,"MATERIAL","37","MAQUINARIA E EQUIPAMENTOS AGRICOLAS","MATERIAL","3740","EQUIPAMENTOS PARA COMBATE A PRAGAS"]
[null,"MATERIAL","37","MAQUINARIA E EQUIPAMENTOS AGRICOLAS","MATERIAL","3750","FERRAMENTAS PARA JARDINAGEM E HORTICULTURA"]
[null,"MATERIAL","37","MAQUINARIA E EQUIPAMENTOS AGRICOLAS","MATERIAL","3760","EQUIPAMENTOS DE TRACAO ANIMAL"]
[null,"MATERIAL","37","MAQUINARIA E EQUIPAMENTOS AGRICOLAS","MATERIAL","3770","MATERIAIS DIVERSOS PARA ANIMAIS"]
[null,"MATERIAL","37","MAQUINARIA E EQUIPAMENTOS AGRICOLAS","MATERIAL","3775","COMPONENTES E PECAS PARA MAQUINA E EQUIPAMENTOS AGRICOLAS"]
[null,"MATERIAL","37","MAQUINARIA E EQUIPAMENTOS AGRICOLAS","MATERIAL","3777","PECAS E COMPONENTES PARA EQUIPAMENTOS AGRICOLAS  CONTRATACAOMEDIANTE FORNECIMENTO PARCELADO"]
[null,"MATERIAL","38","EQUIPAMENTOS PARA CONSTRUCAO MINERACAO ESCAVACAO E  CONSERVACAO DE ESTRADAS","MATERIAL","3805","EQUIPAMENTOS PARA MOVIMENTACAO E ESCAVACAO DE TERRA"]
[null,"MATERIAL","38","EQUIPAMENTOS PARA CONSTRUCAO MINERACAO ESCAVACAO E  CONSERVACAO DE ESTRADAS","MATERIAL","3807","ACESSORIOS E COMPONENTES PARA EQUIPAMENTOS PARA MOVIMENTACAO E ESCAVACAO DE TERRA"]
[null,"MATERIAL","38","EQUIPAMENTOS PARA CONSTRUCAO MINERACAO ESCAVACAO E  CONSERVACAO DE ESTRADAS","MATERIAL","3810","GUINDASTES E GUINDASTES ESCAVADEIRAS"]
[null,"MATERIAL","38","EQUIPAMENTOS PARA CONSTRUCAO MINERACAO ESCAVACAO E  CONSERVACAO DE ESTRADAS","MATERIAL","3815","ACESSORIOS E PECAS DE GUINDASTE E DE GUINDASTES ESCAVADEIRAS"]
[null,"MATERIAL","38","EQUIPAMENTOS PARA CONSTRUCAO MINERACAO ESCAVACAO E  CONSERVACAO DE ESTRADAS","MATERIAL","3820","EQUIPAMENTOS PARA  MINERACAO PERFURACAO  DE  ROCHA TERRA ECORRELATOS"]
[null,"MATERIAL","38","EQUIPAMENTOS PARA CONSTRUCAO MINERACAO ESCAVACAO E  CONSERVACAO DE ESTRADAS","MATERIAL","3822","ACESSORIOS E COMPONENTES PARA EQUIPAMENTOS PARA MINERACAO PERFURACAO DE ROCHA TERRA E CORRELATOS"]
[null,"MATERIAL","38","EQUIPAMENTOS PARA CONSTRUCAO MINERACAO ESCAVACAO E  CONSERVACAO DE ESTRADAS","MATERIAL","3830","IMPLEMENTOS PARA CAMINHOES E TRATORES"]
[null,"MATERIAL","38","EQUIPAMENTOS PARA CONSTRUCAO MINERACAO ESCAVACAO E  CONSERVACAO DE ESTRADAS","MATERIAL","3850","COMPONENTES E ACESSORIOS PARA EQUIPAMENTOS DE MOVIMENTACAO EESCAVACAO DE TERRA   CONTRATACAO MEDIANTE FORN. PARCELADO"]
[null,"MATERIAL","38","EQUIPAMENTOS PARA CONSTRUCAO MINERACAO ESCAVACAO E  CONSERVACAO DE ESTRADAS","MATERIAL","3895","EQUIPAMENTOS DIVERSOS PARA CONSTRUCAO"]
[null,"MATERIAL","38","EQUIPAMENTOS PARA CONSTRUCAO MINERACAO ESCAVACAO E  CONSERVACAO DE ESTRADAS","MATERIAL","3897","ACESSORIOS E COMPONENTES PARA EQUIPAMENTOS DIVERSOS PARA CONSTRUCAO"]
[null,"MATERIAL","38","EQUIPAMENTOS PARA CONSTRUCAO MINERACAO ESCAVACAO E  CONSERVACAO DE ESTRADAS","MATERIAL","3899","MATERIAL DE FIXACAOVEDACAO E LUBRIFICACAO EQUIPAMENTOS CONSTRUCAO/MINERACAO/ESCAVACAO/CONSTRUCAO ESTRADAS"]
[null,"MATERIAL","39","VIATURAS EQUIPAMENTOS PARA MOVIMENTACAO DE MATERIAL","MATERIAL","3910","TRANSPORTADORES PECAS E COMPONENTES"]
[null,"MATERIAL","39","VIATURAS EQUIPAMENTOS PARA MOVIMENTACAO DE MATERIAL","MATERIAL","3920","VIATURAS P/MOVIMENTACAO DE MATERIAIS NAO MOTORIZADAS PECASE COMPONENTES"]
[null,"MATERIAL","39","VIATURAS EQUIPAMENTOS PARA MOVIMENTACAO DE MATERIAL","MATERIAL","3930","VIATURAS PARA  MOVIMENTACAO DE MATERIAIS MOTORIZADAS PECAS E COMPONENTES"]
[null,"MATERIAL","39","VIATURAS EQUIPAMENTOS PARA MOVIMENTACAO DE MATERIAL","MATERIAL","3940","BLOCOS MOITOES ARTICULACOES E ESTROPOSPECAS E COMPONENTES"]
[null,"MATERIAL","39","VIATURAS EQUIPAMENTOS PARA MOVIMENTACAO DE MATERIAL","MATERIAL","3950","GUINCHOS TALHAS GUINDASTES E CABREAS PECAS E COMPONENTES"]
[null,"MATERIAL","39","VIATURAS EQUIPAMENTOS PARA MOVIMENTACAO DE MATERIAL","MATERIAL","3960","ELEVADORES E ESCADAS ROLANTES PECAS E COMPONENTES"]
[null,"MATERIAL","39","VIATURAS EQUIPAMENTOS PARA MOVIMENTACAO DE MATERIAL","MATERIAL","3968","COMPONENTES E ACESSORIOS DE  ELEVADORES P/ CONTRATOS DE MANUTENCAO PREVENTIVA/CORRETIVA"]
[null,"MATERIAL","39","VIATURAS EQUIPAMENTOS PARA MOVIMENTACAO DE MATERIAL","MATERIAL","3990","EQUIPAMENTOS E ARTIGOS DIVERSOS PARA MOVIMENTACAO DE MATERIAIS PECAS E COMPONENTES"]
[null,"MATERIAL","40","CABOS DE ACO CORDAS CORRENTES CORDOALHAS E ACESSORIOS","MATERIAL","4010","CABOS DE ACO E CORRENTES"]
[null,"MATERIAL","40","CABOS DE ACO CORDAS CORRENTES CORDOALHAS E ACESSORIOS","MATERIAL","4020","CABOS DE FIBRA CORDOALHAS E BARBANTES"]
[null,"MATERIAL","40","CABOS DE ACO CORDAS CORRENTES CORDOALHAS E ACESSORIOS","MATERIAL","4030","ACESSORIOS PARA CORDAS CABOS DE ACO E CORRENTES"]
[null,"MATERIAL","41","EQUIPAMENTOS DE REFRIGERACAO CONDICIONAMENTO DE AR E VENTI LACAO","MATERIAL","4110","UNIDADES COMPLETAS DE REFRIGERACAO E ACESSORIOS"]
[null,"MATERIAL","41","EQUIPAMENTOS DE REFRIGERACAO CONDICIONAMENTO DE AR E VENTI LACAO","MATERIAL","4120","UNIDADES COMPLETAS DE CONDICIONAMENTO DE AR E ACESSORIOS"]
[null,"MATERIAL","41","EQUIPAMENTOS DE REFRIGERACAO CONDICIONAMENTO DE AR E VENTI LACAO","MATERIAL","4130","USINAS DE CONDICIONAMENTO DE AR DE REFRIGERACAO  E COMPONENTES"]
[null,"MATERIAL","41","EQUIPAMENTOS DE REFRIGERACAO CONDICIONAMENTO DE AR E VENTI LACAO","MATERIAL","4140","VENTILADORCIRCULADORCLIMATIZADOR(DES)UMIDIFICADOR DE AR"]
[null,"MATERIAL","41","EQUIPAMENTOS DE REFRIGERACAO CONDICIONAMENTO DE AR E VENTI LACAO","MATERIAL","4150","EQUIP.INDUSTRIAL DE CLIMATIZACAO VENTILACAO E CIRCULACAO  "]
[null,"MATERIAL","41","EQUIPAMENTOS DE REFRIGERACAO CONDICIONAMENTO DE AR E VENTI LACAO","MATERIAL","4160","PECAS ACESSORIOS E COMPONENTES PARA EQUIPAMENTOS DE REFRIGERACAO E CONDICIONAMENTO DE AR"]
[null,"MATERIAL","41","EQUIPAMENTOS DE REFRIGERACAO CONDICIONAMENTO DE AR E VENTI LACAO","MATERIAL","4168","COMPONENTES E ACES.DE UNIDADES  DE REFRIGERACAO E CONDICIONAMENTO DE AR P/ CONTRATOS DE MANUTENCAO PREVENTIVA/CORRETIVA"]
[null,"MATERIAL","42","EQUIPAMENTOS PARA SEGURANCA PESSOAL E INDUSTRIAL","MATERIAL","4210","EQUIP.COMPONENTES E ACESSORIOS COMBATE A INCENDIO"]
[null,"MATERIAL","42","EQUIPAMENTOS PARA SEGURANCA PESSOAL E INDUSTRIAL","MATERIAL","4220","EQUIPAMENTO E ACESSORIO MARITIMO PARA MERGULHO E SALVAMENTO "]
[null,"MATERIAL","42","EQUIPAMENTOS PARA SEGURANCA PESSOAL E INDUSTRIAL","MATERIAL","4230","EQUIPAMENTOS PARA IMPREGNACAO E DESCONTAMINACAO"]
[null,"MATERIAL","42","EQUIPAMENTOS PARA SEGURANCA PESSOAL E INDUSTRIAL","MATERIAL","4240","EQUIPAMENTOCOMPONENTE E SUPRIMENTOS PARA BUSCA E SEGURANCA"]
[null,"MATERIAL","43","BOMBAS E COMPRESSORES","MATERIAL","4310","COMPRESSOR BOMBA DE VACUO E RESERVATORIO  "]
[null,"MATERIAL","43","BOMBAS E COMPRESSORES","MATERIAL","4320","BOMBAS MANUAIS MECANICAS ELETRONICAS E MOTO BOMBAS"]
[null,"MATERIAL","43","BOMBAS E COMPRESSORES","MATERIAL","4330","CENTRIFUGAS SEPARADORES E FILTROS A PRESSAO E A VACUO"]
[null,"MATERIAL","43","BOMBAS E COMPRESSORES","MATERIAL","4340","COMPONENTES E PECAS PARA BOMBAS E COMPRESSORES"]
[null,"MATERIAL","43","BOMBAS E COMPRESSORES","MATERIAL","4348","COMPONENTES E ACESSORIOS PARA BOMBAS E COMPRESSORES         PARA CONTRATOS DE MANUTENCAO PREVENTIVA/CORRETIVA"]
[null,"MATERIAL","44","FORNOS CENTRAIS DE VAPOR E EQUIPAMENTOS PARA SECAGEM","MATERIAL","4410","CALDEIRAS INDUSTRIAIS"]
[null,"MATERIAL","44","FORNOS CENTRAIS DE VAPOR E EQUIPAMENTOS PARA SECAGEM","MATERIAL","4430","FORNALHAS E FORNOS INDUSTRIAIS FORNOS TUNEIS E ESTUFAS"]
[null,"MATERIAL","44","FORNOS CENTRAIS DE VAPOR E EQUIPAMENTOS PARA SECAGEM","MATERIAL","4440","SECADORES DESIDRATADORES E ANTI HIDRATADORES"]
[null,"MATERIAL","44","FORNOS CENTRAIS DE VAPOR E EQUIPAMENTOS PARA SECAGEM","MATERIAL","4475","COMPONENTES E PECAS PARA CALDEIRASFORNOSCENTRAIS DE VAPOR E EQUIPAMENTOS DE SECAGEM"]
[null,"MATERIAL","45","EQUIPAMENTOS DE CALEFACAO AQUECIMENTO E INSTALACOES SANITARIAS","MATERIAL","4510","APARELHOS HIDRAULICOS SANITARIOS E ACESSORIOS"]
[null,"MATERIAL","45","EQUIPAMENTOS DE CALEFACAO AQUECIMENTO E INSTALACOES SANITARIAS","MATERIAL","4520","EQUIPAMENTOS P/ CALEFACAO DE AMBIENTES/AQUECEDORES DE AGUA DOMESTICOS"]
[null,"MATERIAL","45","EQUIPAMENTOS DE CALEFACAO AQUECIMENTO E INSTALACOES SANITARIAS","MATERIAL","4525","TANQUES E RESERVATORIOS DE AGUA E COMPONENTES"]
[null,"MATERIAL","45","EQUIPAMENTOS DE CALEFACAO AQUECIMENTO E INSTALACOES SANITARIAS","MATERIAL","4530","EQUIPAMENTOS PARA QUEIMA DE COMBUSTIVEL"]
[null,"MATERIAL","45","EQUIPAMENTOS DE CALEFACAO AQUECIMENTO E INSTALACOES SANITARIAS","MATERIAL","4540","EQUIPAMENTOS DIVERSOS HIDRAULICOS SANITARIOS E DE CALEFACAO"]
[null,"MATERIAL","46","EQUIPAMENTOS PARA PURIFICACAO  E TRATAMENTO DE AGUA  E TRATAMENTO DE ESGOTOS","MATERIAL","4610","EQUIPAMENTOS PARA PURIFICACAO DE AGUA E COMPONENTES"]
[null,"MATERIAL","46","EQUIPAMENTOS PARA PURIFICACAO  E TRATAMENTO DE AGUA  E TRATAMENTO DE ESGOTOS","MATERIAL","4630","EQUIPAMENTOS PARA TRATAMENTO DE ESGOTOS"]
[null,"MATERIAL","47","TUBOS TUBULACOES MANGUEIRAS E CONEXOES","MATERIAL","4710","TUBO RIGIDO"]
[null,"MATERIAL","47","TUBOS TUBULACOES MANGUEIRAS E CONEXOES","MATERIAL","4720","MANGUEIRAS E TUBULACOES FLEXIVEIS"]
[null,"MATERIAL","47","TUBOS TUBULACOES MANGUEIRAS E CONEXOES","MATERIAL","4730","CONEXOES E ACESSORIOS PARA TUBOS E MANGUEIRAS"]
[null,"MATERIAL","48","VALVULAS E REGISTROS","MATERIAL","4810","VALVULAS MOTORIZADAS"]
[null,"MATERIAL","48","VALVULAS E REGISTROS","MATERIAL","4820","VALVULAS E REGISTROS"]
[null,"MATERIAL","48","VALVULAS E REGISTROS","MATERIAL","4830","COMPONENTES E PECAS PARA VALVULAS E REGISTROS"]
[null,"MATERIAL","49","EQUIPAMENTOS ESPECIALIZADOS PARA MANUTENCAO E REPAROS","MATERIAL","4910","EQUIPAMENTOS ESPECIAIS PARA MANUTENCAO E REPAROS DE VEICULOS E EQUIPAMENTOS"]
[null,"MATERIAL","49","EQUIPAMENTOS ESPECIALIZADOS PARA MANUTENCAO E REPAROS","MATERIAL","4925","EQUIPAMENTOS ESPECIAIS DE REPARO VERIFICACAO E MANUTENCAO DE MUNICOES E COMPONENTES"]
[null,"MATERIAL","49","EQUIPAMENTOS ESPECIALIZADOS PARA MANUTENCAO E REPAROS","MATERIAL","4930","EQUIPAMENTOS  PARA ABASTECIMENTO DE COMBUSTIVEIS  E  LUBRIFICANTES"]
[null,"MATERIAL","49","EQUIPAMENTOS ESPECIALIZADOS PARA MANUTENCAO E REPAROS","MATERIAL","4940","EQUIPAMENTOS ESPECIAIS DIVERSOS PARA MANUTENCAO E REPAROS"]
[null,"MATERIAL","49","EQUIPAMENTOS ESPECIALIZADOS PARA MANUTENCAO E REPAROS","MATERIAL","4970","COMPONENTES ACESSORIOS E PECAS PARA EQUIPAMENTOS ESPECIALI ZADOS PARA MANUTENCAO E REPAROS"]
[null,"MATERIAL","51","FERRAMENTAS MANUAIS E COMPONENTES","MATERIAL","5105","FERRAMENTAS ESPECIAIS MANUTENCAO E REPAROS"]
[null,"MATERIAL","51","FERRAMENTAS MANUAIS E COMPONENTES","MATERIAL","5110","FERRAMENTAS MANUAIS COM CORTE NAO MOTORIZADAS"]
[null,"MATERIAL","51","FERRAMENTAS MANUAIS E COMPONENTES","MATERIAL","5120","FERRAMENTAS MANUAIS SEM CORTE NAO MOTORIZADAS"]
[null,"MATERIAL","51","FERRAMENTAS MANUAIS E COMPONENTES","MATERIAL","5125","FERRAMENTAS PARA MANUTENCAO EM EQUIPAMENTOS DE INFORMATICA"]
[null,"MATERIAL","51","FERRAMENTAS MANUAIS E COMPONENTES","MATERIAL","5130","FERRAMENTAS MANUAIS MOTORIZADAS/ELETRICAS/PNEUMATICAS TIPO EMPUNHAVEL"]
[null,"MATERIAL","51","FERRAMENTAS MANUAIS E COMPONENTES","MATERIAL","5132","COMPONENTES E PECAS PARA FERRAMENTAS MANUAIS MOTORIZADAS/  ELETRICAS TIPO EMPUNHAVEL"]
[null,"MATERIAL","51","FERRAMENTAS MANUAIS E COMPONENTES","MATERIAL","5133","BROCAS REBAIXADORES E ESCARIADORES"]
[null,"MATERIAL","51","FERRAMENTAS MANUAIS E COMPONENTES","MATERIAL","5136","MACHOS COSSINETES E COLETORES"]
[null,"MATERIAL","51","FERRAMENTAS MANUAIS E COMPONENTES","MATERIAL","5140","RECIPIENTE PARA FERRAMENTAS"]
[null,"MATERIAL","51","FERRAMENTAS MANUAIS E COMPONENTES","MATERIAL","5180","JOGOS E CONJUNTOS DE FERRAMENTAS MANUAIS"]
[null,"MATERIAL","52","APARELHOS E UTENSILIOS PARA MEDICAO E INSPECAO","MATERIAL","5210","APARELHOS E UTENSILIOS DE MEDICAO"]
[null,"MATERIAL","52","APARELHOS E UTENSILIOS PARA MEDICAO E INSPECAO","MATERIAL","5220","CALIBRES DE INSPECAO"]
[null,"MATERIAL","52","APARELHOS E UTENSILIOS PARA MEDICAO E INSPECAO","MATERIAL","5230","EQUIPAMENTO PARA INSPECAO"]
[null,"MATERIAL","52","APARELHOS E UTENSILIOS PARA MEDICAO E INSPECAO","MATERIAL","5280","JOGOS E ESTOJOS DE APARELHOS E UTENSILIOS PARA MEDICAO E INSPECAO"]
[null,"MATERIAL","53","FERRAGENS ABRASIVOS E MATERIAIS PARA VEDACAO","MATERIAL","5305","PARAFUSOS COM FENDAS"]
[null,"MATERIAL","53","FERRAGENS ABRASIVOS E MATERIAIS PARA VEDACAO","MATERIAL","5306","PARAFUSOS SEM FENDAS"]
[null,"MATERIAL","53","FERRAGENS ABRASIVOS E MATERIAIS PARA VEDACAO","MATERIAL","5307","PRISIONEIROS"]
[null,"MATERIAL","53","FERRAGENS ABRASIVOS E MATERIAIS PARA VEDACAO","MATERIAL","5310","PORCAS E ARRUELAS PARA PARAFUSOS"]
[null,"MATERIAL","53","FERRAGENS ABRASIVOS E MATERIAIS PARA VEDACAO","MATERIAL","5315","PREGOS CHAVETAS E PINOS"]
[null,"MATERIAL","53","FERRAGENS ABRASIVOS E MATERIAIS PARA VEDACAO","MATERIAL","5320","REBITES"]
[null,"MATERIAL","53","FERRAGENS ABRASIVOS E MATERIAIS PARA VEDACAO","MATERIAL","5325","DISPOSITIVOS DE FIXACAO"]
[null,"MATERIAL","53","FERRAGENS ABRASIVOS E MATERIAIS PARA VEDACAO","MATERIAL","5330","MATERIAIS PARA VEDACAO"]
[null,"MATERIAL","53","FERRAGENS ABRASIVOS E MATERIAIS PARA VEDACAO","MATERIAL","5335","TELAS E TECIDOS METALICOS"]
[null,"MATERIAL","53","FERRAGENS ABRASIVOS E MATERIAIS PARA VEDACAO","MATERIAL","5340","FERRAGENS DIVERSAS"]
[null,"MATERIAL","53","FERRAGENS ABRASIVOS E MATERIAIS PARA VEDACAO","MATERIAL","5345","DISCOS PEDRAS E CORREIAS ABRASIVAS"]
[null,"MATERIAL","53","FERRAGENS ABRASIVOS E MATERIAIS PARA VEDACAO","MATERIAL","5350","MATERIAIS ABRASIVOS"]
[null,"MATERIAL","53","FERRAGENS ABRASIVOS E MATERIAIS PARA VEDACAO","MATERIAL","5355","MOSTRADORES PONTEIROS E BOTOES DE CONTROLE"]
[null,"MATERIAL","53","FERRAGENS ABRASIVOS E MATERIAIS PARA VEDACAO","MATERIAL","5360","MOLAS DE FIO CHATA E ESPECIAL"]
[null,"MATERIAL","53","FERRAGENS ABRASIVOS E MATERIAIS PARA VEDACAO","MATERIAL","5365","ARRUELA CALCO E ESPACADOR"]
[null,"MATERIAL","54","ESTRUTURAS E ANDAIMES PRE FABRICADOS","MATERIAL","5410","EDIFICIOS PRE FABRICADOS E PORTATEIS"]
[null,"MATERIAL","54","ESTRUTURAS E ANDAIMES PRE FABRICADOS","MATERIAL","5411","ABRIGOS DE PAREDE RIGIDA"]
[null,"MATERIAL","54","ESTRUTURAS E ANDAIMES PRE FABRICADOS","MATERIAL","5420","PONTES FIXAS MOVEIS E FLUTUANTES"]
[null,"MATERIAL","54","ESTRUTURAS E ANDAIMES PRE FABRICADOS","MATERIAL","5430","TANQUES DE ARMAZENAGEM COMPONENTES E PECAS"]
[null,"MATERIAL","54","ESTRUTURAS E ANDAIMES PRE FABRICADOS","MATERIAL","5440","ANDAIMES ESCADAS E FORMAS DE CONCRETO"]
[null,"MATERIAL","54","ESTRUTURAS E ANDAIMES PRE FABRICADOS","MATERIAL","5445","ESTRUTURAS DE TORRES PRE FABRICADAS"]
[null,"MATERIAL","54","ESTRUTURAS E ANDAIMES PRE FABRICADOS","MATERIAL","5450","ESTRUTURAS DIVERSAS PRE FABRICADAS"]
[null,"MATERIAL","55","MADEIRAS  ESQUADRIAS  COMPENSADOS E FOLHEADOS","MATERIAL","5510","MADEIRAS E PRODUTOS DERIVADOS"]
[null,"MATERIAL","55","MADEIRAS  ESQUADRIAS  COMPENSADOS E FOLHEADOS","MATERIAL","5520","ESQUADRIA DE MADEIRA"]
[null,"MATERIAL","55","MADEIRAS  ESQUADRIAS  COMPENSADOS E FOLHEADOS","MATERIAL","5530","COMPENSADOS FOLHEADOS  E AGLOMERADOS"]
[null,"MATERIAL","56","MATERIAIS PARA CONSTRUCAO","MATERIAL","5610","MATERIAL PARA CONSTRUCAO A GRANEL DE ORIGEM MINERAL"]
[null,"MATERIAL","56","MATERIAIS PARA CONSTRUCAO","MATERIAL","5620","MATERIAL PARA CONSTRUCAO DIMENSIONADOS NAO METALICOS"]
[null,"MATERIAL","56","MATERIAIS PARA CONSTRUCAO","MATERIAL","5630","TUBOS CONDUTOS E CORRELATOS NAO METALICOS"]
[null,"MATERIAL","56","MATERIAIS PARA CONSTRUCAO","MATERIAL","5640","MATERIAL PARA ISOLAMENTOS TERMICO E ACUSTICO E PAINEIS DIVI SORIOS"]
[null,"MATERIAL","56","MATERIAIS PARA CONSTRUCAO","MATERIAL","5650","MATERIAIS PARA COBERTURAS"]
[null,"MATERIAL","56","MATERIAIS PARA CONSTRUCAO","MATERIAL","5660","CERCADOS TELAS E PORTOES"]
[null,"MATERIAL","56","MATERIAIS PARA CONSTRUCAO","MATERIAL","5670","PRODUTOS METALICOS PARA ARQUITETURA"]
[null,"MATERIAL","56","MATERIAIS PARA CONSTRUCAO","MATERIAL","5680","MATERIAIS DIVERSOS PARA CONSTRUCAO"]
[null,"MATERIAL","58","EQUIPAMENTOS DE COMUNICACOES","MATERIAL","5805","EQUIPAMENTOS TELEFONICOS E TELEGRAFICOS"]
[null,"MATERIAL","58","EQUIPAMENTOS DE COMUNICACOES","MATERIAL","5810","EQUIPAMENTOS DE COMUNICACAOSEGURANCA E COMPONENTES  "]
[null,"MATERIAL","58","EQUIPAMENTOS DE COMUNICACOES","MATERIAL","5815","TELEIMPRESSORAS E EQUIPAMENTOS FAC SIMILES"]
[null,"MATERIAL","58","EQUIPAMENTOS DE COMUNICACOES","MATERIAL","5820","EQUIPAMENTOS DE COMUNICACAO DE RADIO E DE TELEVISAO"]
[null,"MATERIAL","58","EQUIPAMENTOS DE COMUNICACOES","MATERIAL","5830","EQUIPAMENTOS INTERCOMUNICADORES/SISTEMA ALTO FALANTESEXCETO AEROTRANSPORTAVEL"]
[null,"MATERIAL","58","EQUIPAMENTOS DE COMUNICACOES","MATERIAL","5835","EQUIPAMENTOS PARA GRAVACAO E REPRODUCAO DE SOM"]
[null,"MATERIAL","58","EQUIPAMENTOS DE COMUNICACOES","MATERIAL","5836","EQUIPAMENTOS PARA GRAVACAO E REPRODUCAO DE VIDEO"]
[null,"MATERIAL","58","EQUIPAMENTOS DE COMUNICACOES","MATERIAL","5840","EQUIPAMENTOS DE RADAR EXCETO OS AEROTRANSPORTAVEIS"]
[null,"MATERIAL","58","EQUIPAMENTOS DE COMUNICACOES","MATERIAL","5855","EQUIPAMENTO DE RADIACAO EMITIDAREFLETIDA E VISAO NOTURNA"]
[null,"MATERIAL","58","EQUIPAMENTOS DE COMUNICACOES","MATERIAL","5895","EQUIPAMENTOS DIVERSOS DE COMUNICACOES"]
[null,"MATERIAL","58","EQUIPAMENTOS DE COMUNICACOES","MATERIAL","5897","PECAACESSORIO E COMPONENTE P/EQUIPAMENTO DE COMUNICACAO      EXCETO INFORMATICA"]
[null,"MATERIAL","59","COMPONENTES DE EQUIPAMENTOS ELETRICOS E ELETRONICOS","MATERIAL","5905","RESISTORES"]
[null,"MATERIAL","59","COMPONENTES DE EQUIPAMENTOS ELETRICOS E ELETRONICOS","MATERIAL","5910","CAPACITORES"]
[null,"MATERIAL","59","COMPONENTES DE EQUIPAMENTOS ELETRICOS E ELETRONICOS","MATERIAL","5915","FILTROS E MALHAS DE FILTRO"]
[null,"MATERIAL","59","COMPONENTES DE EQUIPAMENTOS ELETRICOS E ELETRONICOS","MATERIAL","5920","FUSIVEIS E PARA RAIOS"]
[null,"MATERIAL","59","COMPONENTES DE EQUIPAMENTOS ELETRICOS E ELETRONICOS","MATERIAL","5925","DISJUNTORES"]
[null,"MATERIAL","59","COMPONENTES DE EQUIPAMENTOS ELETRICOS E ELETRONICOS","MATERIAL","5930","CHAVES E INTERRUPTORES"]
[null,"MATERIAL","59","COMPONENTES DE EQUIPAMENTOS ELETRICOS E ELETRONICOS","MATERIAL","5935","CONECTORES ELETRICOS"]
[null,"MATERIAL","59","COMPONENTES DE EQUIPAMENTOS ELETRICOS E ELETRONICOS","MATERIAL","5940","TERMINAIS TIPO ORELHA JOGO DE TERMINAIS"]
[null,"MATERIAL","59","COMPONENTES DE EQUIPAMENTOS ELETRICOS E ELETRONICOS","MATERIAL","5945","RELES CONTACTORES E SOLENOIDES"]
[null,"MATERIAL","59","COMPONENTES DE EQUIPAMENTOS ELETRICOS E ELETRONICOS","MATERIAL","5950","BOBINAS E TRANSFORMADORES"]
[null,"MATERIAL","59","COMPONENTES DE EQUIPAMENTOS ELETRICOS E ELETRONICOS","MATERIAL","5960","VALVULAS ELETRONICAS E FERRAGENS ASSOCIADAS"]
[null,"MATERIAL","59","COMPONENTES DE EQUIPAMENTOS ELETRICOS E ELETRONICOS","MATERIAL","5961","DISPOSITIVOS A SEMICONDUTOR E PLACAS ASSOCIADAS (FOTOCELULA)"]
[null,"MATERIAL","59","COMPONENTES DE EQUIPAMENTOS ELETRICOS E ELETRONICOS","MATERIAL","5962","DISPOSITIVOS COM CIRCUITOS MICROELETRONICOS"]
[null,"MATERIAL","59","COMPONENTES DE EQUIPAMENTOS ELETRICOS E ELETRONICOS","MATERIAL","5963","MODULOS ELETRONICOS"]
[null,"MATERIAL","59","COMPONENTES DE EQUIPAMENTOS ELETRICOS E ELETRONICOS","MATERIAL","5965","FONES MONOFONES MICROFONES E ALTO FALANTES"]
[null,"MATERIAL","59","COMPONENTES DE EQUIPAMENTOS ELETRICOS E ELETRONICOS","MATERIAL","5970","ISOLANTES ELETRICOS E MATERIAL ISOLANTE"]
[null,"MATERIAL","59","COMPONENTES DE EQUIPAMENTOS ELETRICOS E ELETRONICOS","MATERIAL","5975","FERRAGENS E ACESSORIOS ELETRICOS"]
[null,"MATERIAL","59","COMPONENTES DE EQUIPAMENTOS ELETRICOS E ELETRONICOS","MATERIAL","5977","ESCOVA DE CONTATO ELETRICO E ELETRODOS"]
[null,"MATERIAL","59","COMPONENTES DE EQUIPAMENTOS ELETRICOS E ELETRONICOS","MATERIAL","5980","DISPOSITIVOS OPTRONICOS E ITENS CORRELATOS"]
[null,"MATERIAL","59","COMPONENTES DE EQUIPAMENTOS ELETRICOS E ELETRONICOS","MATERIAL","5985","ANTENAS GUIAS DE ONDAS E EQUIPAMENTOS CORRELATOS"]
[null,"MATERIAL","59","COMPONENTES DE EQUIPAMENTOS ELETRICOS E ELETRONICOS","MATERIAL","5998","CONJUNTOS ELETRICOS E ELETRONICOS PLACAS CARTOES E  CORRELATOS"]
[null,"MATERIAL","59","COMPONENTES DE EQUIPAMENTOS ELETRICOS E ELETRONICOS","MATERIAL","5999","COMPONENTES DIVERSOS ELETRICOS E ELETRONICOS"]
[null,"MATERIAL","60","CABO FIBRA OPTICA","MATERIAL","6006","INSTRUMENTOS DE TESTES FIBRA OPTICA"]
[null,"MATERIAL","60","CABO FIBRA OPTICA","MATERIAL","6010","EQUIPAMENTOS PARA FIBRA OPTICA  "]
[null,"MATERIAL","60","CABO FIBRA OPTICA","MATERIAL","6015","CABO PARA FIBRA OPTICA  "]
[null,"MATERIAL","60","CABO FIBRA OPTICA","MATERIAL","6070","ACESSORIOS E ARTIGOS PARA FIBRA OPTICA"]
[null,"MATERIAL","60","CABO FIBRA OPTICA","MATERIAL","6099","COMPONENTES ACESSORIOS E ARTIGOS FIBRA OPTICA"]
[null,"MATERIAL","61","FIOS CABOS TELEFONICOS CONDUITES ELETRICOS EQUIPAMENTO P/GERACAO/DISTRIBUICAO ENERGIA","MATERIAL","6105","MOTORES ELETRICOS E COMPONENTES"]
[null,"MATERIAL","61","FIOS CABOS TELEFONICOS CONDUITES ELETRICOS EQUIPAMENTO P/GERACAO/DISTRIBUICAO ENERGIA","MATERIAL","6110","EQUIPAMENTOS PARA CONTROLE ELETRICO"]
[null,"MATERIAL","61","FIOS CABOS TELEFONICOS CONDUITES ELETRICOS EQUIPAMENTO P/GERACAO/DISTRIBUICAO ENERGIA","MATERIAL","6115","GERADORES ELETRICOS PECAS E COMPONENTES"]
[null,"MATERIAL","61","FIOS CABOS TELEFONICOS CONDUITES ELETRICOS EQUIPAMENTO P/GERACAO/DISTRIBUICAO ENERGIA","MATERIAL","6116","CELULA COMBUSTIVEL COMPONENTES E ACESSORIOS"]
[null,"MATERIAL","61","FIOS CABOS TELEFONICOS CONDUITES ELETRICOS EQUIPAMENTO P/GERACAO/DISTRIBUICAO ENERGIA","MATERIAL","6117","SISTEMAS DE ENERGIA ELETRICA SOLAR"]
[null,"MATERIAL","61","FIOS CABOS TELEFONICOS CONDUITES ELETRICOS EQUIPAMENTO P/GERACAO/DISTRIBUICAO ENERGIA","MATERIAL","6125","CONVERSORES ELETRICOS ROTATIVOS"]
[null,"MATERIAL","61","FIOS CABOS TELEFONICOS CONDUITES ELETRICOS EQUIPAMENTO P/GERACAO/DISTRIBUICAO ENERGIA","MATERIAL","6130","CONVERSORES ELETRICOS NAO ROTATIVOS"]
[null,"MATERIAL","61","FIOS CABOS TELEFONICOS CONDUITES ELETRICOS EQUIPAMENTO P/GERACAO/DISTRIBUICAO ENERGIA","MATERIAL","6135","BATERIAS PRIMARIAS (PILHAS)"]
[null,"MATERIAL","61","FIOS CABOS TELEFONICOS CONDUITES ELETRICOS EQUIPAMENTO P/GERACAO/DISTRIBUICAO ENERGIA","MATERIAL","6140","BATERIA E PILHA RECARREGAVEL E NAO RECARREGAVEL"]
[null,"MATERIAL","61","FIOS CABOS TELEFONICOS CONDUITES ELETRICOS EQUIPAMENTO P/GERACAO/DISTRIBUICAO ENERGIA","MATERIAL","6145","FIOS CABOS ELETRICOS E TELEFONICOS"]
[null,"MATERIAL","61","FIOS CABOS TELEFONICOS CONDUITES ELETRICOS EQUIPAMENTO P/GERACAO/DISTRIBUICAO ENERGIA","MATERIAL","6150","MATERIAIS E EQUIPAMENTOS DIVERSOS PARA GERACAO/DISTRIBUICAO ENERGIA ELETRICA"]
[null,"MATERIAL","61","FIOS CABOS TELEFONICOS CONDUITES ELETRICOS EQUIPAMENTO P/GERACAO/DISTRIBUICAO ENERGIA","MATERIAL","6160","ACESSORIOS E REVESTIMENTOS DIVERSOS PARA BATERIAS"]
[null,"MATERIAL","61","FIOS CABOS TELEFONICOS CONDUITES ELETRICOS EQUIPAMENTO P/GERACAO/DISTRIBUICAO ENERGIA","MATERIAL","6167","COMPONENTES E ACESSORIOS PARA GRUPOS GERADORES PARA         CONTRATOS DE MANUTENCAO PREVENTIVA/CORRETIVA"]
[null,"MATERIAL","62","LAMPADAS E APARELHOS DE ILUMINACAO","MATERIAL","6210","APARELHOS E ARTIGOS DE ILUMINACAO ELETRICA INTERNOS E EXTERNOS"]
[null,"MATERIAL","62","LAMPADAS E APARELHOS DE ILUMINACAO","MATERIAL","6220","APARELHOS  E ARTIGOS DE ILUMINACAO ELETRICA VEICULAR"]
[null,"MATERIAL","62","LAMPADAS E APARELHOS DE ILUMINACAO","MATERIAL","6230","APARELHOS E ARTIGOS DE ILUMINACAO ELETRICA PORTATEIS E MANUAIS"]
[null,"MATERIAL","62","LAMPADAS E APARELHOS DE ILUMINACAO","MATERIAL","6240","LAMPADAS ELETRICAS"]
[null,"MATERIAL","62","LAMPADAS E APARELHOS DE ILUMINACAO","MATERIAL","6250","REATORES(COMPENSADOS) ELEMENTOS DE PARTIDA E PORTA LAMPADAS"]
[null,"MATERIAL","62","LAMPADAS E APARELHOS DE ILUMINACAO","MATERIAL","6260","MATERIAIS E APARELHOS DE ILUMINACAO NAO ELETRICOS"]
[null,"MATERIAL","62","LAMPADAS E APARELHOS DE ILUMINACAO","MATERIAL","6270","EQUIPAMENTO DE INFRAESTRUTURA PARA ILUMINACAO"]
[null,"MATERIAL","63","EQUIPAMENTOS DE SINALIZACAO E ALARME","MATERIAL","6310","SISTEMA DE SINALIZACAO DE TRAFEGO E TRANSITO"]
[null,"MATERIAL","63","EQUIPAMENTOS DE SINALIZACAO E ALARME","MATERIAL","6350","SISTEMAS DIVERSOS DE SINALIZACAO E ALARME"]
[null,"MATERIAL","63","EQUIPAMENTOS DE SINALIZACAO E ALARME","MATERIAL","6355","PECAS E COMPONENTES PARA EQUIPAMENTOS DE SINALIZACAO E  ALARME"]
[null,"MATERIAL","64","MEDICAMENTOS","MATERIAL","6401","ACAO ENDOCRINA/CORTICOSTEROIDES"]
[null,"MATERIAL","64","MEDICAMENTOS","MATERIAL","6402","ACAO ENDOCRINA/HIPERGLICEMIANTES"]
[null,"MATERIAL","64","MEDICAMENTOS","MATERIAL","6403","ACAO ENDOCRINA/HORMONIOS ESTROGENICOS"]
[null,"MATERIAL","64","MEDICAMENTOS","MATERIAL","6404","ACAO ENDOCRINA/HORMONIOS HOPIFISARIOS E AFINS"]
[null,"MATERIAL","64","MEDICAMENTOS","MATERIAL","6405","ACAO ENDOCRINA/HORMONIOS PROGESTAGENICOS"]
[null,"MATERIAL","64","MEDICAMENTOS","MATERIAL","6406","ACAO ENDOCRINA/HORMONIOS TIREOIDEANOS E INIBIDORES DA FUNCAO TIREOIDEANA"]
[null,"MATERIAL","64","MEDICAMENTOS","MATERIAL","6407","ACAO ENDOCRINA/INIBIDORES DA SECRECAO DE PROLACTINA"]
[null,"MATERIAL","64","MEDICAMENTOS","MATERIAL","6408","ACAO ENDOCRINA/INSULINA"]
[null,"MATERIAL","64","MEDICAMENTOS","MATERIAL","6409","ACAO ENDOCRINA/HIPOGLICEMIANTES ORAIS"]
[null,"MATERIAL","64","MEDICAMENTOS","MATERIAL","6410","AGENTES DIAGNOSTICOS/CONTRASTES RADIOLOGICOS"]
[null,"MATERIAL","64","MEDICAMENTOS","MATERIAL","6411","AGENTES DIAGNOSTICOS/AUXILIARES DE DIAGNOSTICOS"]
[null,"MATERIAL","64","MEDICAMENTOS","MATERIAL","6412","ANTIDOTOS"]
[null,"MATERIAL","64","MEDICAMENTOS","MATERIAL","6413","ANTIINFECCIOSOS/ANTIBIOTICOS"]
[null,"MATERIAL","64","MEDICAMENTOS","MATERIAL","6414","ANTIINFECCIOSOS/ANTIFUNGICOS"]
[null,"MATERIAL","64","MEDICAMENTOS","MATERIAL","6415","ANTIINFECCIOSOS/ANTIVIRAIS"]
[null,"MATERIAL","64","MEDICAMENTOS","MATERIAL","6416","ANTIINFECCIOSOS/HANSENOSTATICOS E TUBERCULOSTATICOS"]
[null,"MATERIAL","64","MEDICAMENTOS","MATERIAL","6417","ANTIINFECCIOSOS/NITROFURANOS QUINOLONAS E SULFONAMIDAS"]
[null,"MATERIAL","64","MEDICAMENTOS","MATERIAL","6418","ANTIPARASITARIOS"]
[null,"MATERIAL","64","MEDICAMENTOS","MATERIAL","6419","ANTINEOPLASICOS/ALCALOIDES"]
[null,"MATERIAL","64","MEDICAMENTOS","MATERIAL","6420","ANTINEOPLASICOS/AGENTES ALQUILANTES"]
[null,"MATERIAL","64","MEDICAMENTOS","MATERIAL","6421","ANTINEOPLASICOS/ANTIMETABOLICOS"]
[null,"MATERIAL","64","MEDICAMENTOS","MATERIAL","6422","ANTINEOPLASICOS/ANTIBIOTICOS CITOTOXICOS"]
[null,"MATERIAL","64","MEDICAMENTOS","MATERIAL","6423","ANTINEOPLASICOS/COMPOSTOS DE PLATINA"]
[null,"MATERIAL","64","MEDICAMENTOS","MATERIAL","6424","ANTINEOPLASICOS/HORMONIOS INIBIDORES ENZIMATICOS E DA ACAO HORMONAL"]
[null,"MATERIAL","64","MEDICAMENTOS","MATERIAL","6425","ANTIMEOPLASICOS/PRODUTOS NATURAIS"]
[null,"MATERIAL","64","MEDICAMENTOS","MATERIAL","6426","APARELHO DIGESTIVO/ADSORVENTES ANTIFISETICOS E ANTIFLATULENTOS"]
[null,"MATERIAL","64","MEDICAMENTOS","MATERIAL","6427","APARELHO DIGESTIVO/ANTIACIDOS E INIBIDORES DA SECRECAO GAS  TRICA"]
[null,"MATERIAL","64","MEDICAMENTOS","MATERIAL","6428","APARELHO DIGESTIVO/ANTIEMETICOS E PRO CINETICOS"]
[null,"MATERIAL","64","MEDICAMENTOS","MATERIAL","6429","APARELHO DIGESTIVO/CONSTIPANTES"]
[null,"MATERIAL","64","MEDICAMENTOS","MATERIAL","6430","APARELHO DIGESTIVO/DIGESTIVOS E ANTIINFLAMATORIOS"]
[null,"MATERIAL","64","MEDICAMENTOS","MATERIAL","6431","APARELHO DIGESTIVO/LAXATIVOS"]
[null,"MATERIAL","64","MEDICAMENTOS","MATERIAL","6432","APARELHO GENITURINARIO/ANTISSEPTICOS"]
[null,"MATERIAL","64","MEDICAMENTOS","MATERIAL","6433","APARELHO GENITURINARIO/DIURETICOS E TERAPEUTIICA DA INCONTI NENCIA URINARIA"]
[null,"MATERIAL","64","MEDICAMENTOS","MATERIAL","6434","APARELHO GENITURINARIO/OXITOCITOS"]
[null,"MATERIAL","64","MEDICAMENTOS","MATERIAL","6435","APARELHO RESPIRATORIO/AGENTES TENSOATIVO PULMONAR"]
[null,"MATERIAL","64","MEDICAMENTOS","MATERIAL","6436","APARELHO RESPIRATORIO/ANTITUSSIGENOS"]
[null,"MATERIAL","64","MEDICAMENTOS","MATERIAL","6437","APARELHO RESPIRATORIO/BRONCODILATADORES"]
[null,"MATERIAL","64","MEDICAMENTOS","MATERIAL","6438","APARELHO RESPIRATORIO/EXPECTORANTES FLUIDIFICANTES E       DESCONGESTIONANTES"]
[null,"MATERIAL","64","MEDICAMENTOS","MATERIAL","6439","IMUNOTERAPICOS/IMUNOGLOBULINAS"]
[null,"MATERIAL","64","MEDICAMENTOS","MATERIAL","6440","IMUNOTERAPICOS/VACINAS E TOXOIDES"]
[null,"MATERIAL","64","MEDICAMENTOS","MATERIAL","6441","IMUNOTERAPICOS/IMUNOSSUPRESSORES"]
[null,"MATERIAL","64","MEDICAMENTOS","MATERIAL","6442","IMUNOTERAPICOS/SOROS"]
[null,"MATERIAL","64","MEDICAMENTOS","MATERIAL","6443","METABOLISMO E NUTRICAO/AGENTES PARA REPOSICAO HIDROELETROLI TICA"]
[null,"MATERIAL","64","MEDICAMENTOS","MATERIAL","6444","METABOLISMO E NUTRICAO/HIPOLIPEMIANTES"]
[null,"MATERIAL","64","MEDICAMENTOS","MATERIAL","6445","METABOLISMO E NUTRICAO/NUTRIENTES DE USO PARENTERAL E       DIETAS ENTERAIS"]
[null,"MATERIAL","64","MEDICAMENTOS","MATERIAL","6446","METABOLISMO E NUTRICAO/SUPLEMENTOS DIETETICOS"]
[null,"MATERIAL","64","MEDICAMENTOS","MATERIAL","6447","METABOLISMO E NUTRICAO/REGULADORES DO METABOLISMO OSSEO VI TAMINAS SUPLEMENTOS MINERAIS E ENZIMATICOS"]
[null,"MATERIAL","64","MEDICAMENTOS","MATERIAL","6448","OFTALMICOS/AGENTES DIAGNOSTICOS E AUXILIARES CIRURGICOS"]
[null,"MATERIAL","64","MEDICAMENTOS","MATERIAL","6449","OFTALMICOS/ANESTESICOS"]
[null,"MATERIAL","64","MEDICAMENTOS","MATERIAL","6450","OFTALMICOS/ANTIINFECCIOSOS E ANTIINFLAMATORIOS"]
[null,"MATERIAL","64","MEDICAMENTOS","MATERIAL","6451","OFTALMICOS/MIOTICOS MEDRIATICOS CICLOPLEGICOS E ANTIGLAUCOMATOSOS"]
[null,"MATERIAL","64","MEDICAMENTOS","MATERIAL","6452","OFTALMICOS/UMECTANTES"]
[null,"MATERIAL","64","MEDICAMENTOS","MATERIAL","6453","ORGAOS HEMATOPOIETICOS E SANGUE/ANTIANEMICOS"]
[null,"MATERIAL","64","MEDICAMENTOS","MATERIAL","6454","ORGAOS HEMATOPOIETICOS E SANGUE/ANTIAGREGANTE PLAQUETARIO"]
[null,"MATERIAL","64","MEDICAMENTOS","MATERIAL","6455","ORGAOS HEMATOPOIETICOS E SANGUE/ANTICOAGULANTES"]
[null,"MATERIAL","64","MEDICAMENTOS","MATERIAL","6456","ORGAOS HEMATOPOIETICOS E SANGUE/ANTI HEMORRAGICOS"]
[null,"MATERIAL","64","MEDICAMENTOS","MATERIAL","6457","ORGAOS HEMATOPOIETICOS E SANGUE/ESTIMULANTES E INIBIDORES"]
[null,"MATERIAL","64","MEDICAMENTOS","MATERIAL","6458","ORGAOS HEMATOPOIETICOS E SANGUE/EXPANSORES E PLASMATICOS"]
[null,"MATERIAL","64","MEDICAMENTOS","MATERIAL","6459","ORGAOS HEMATOPOIETICOS E SANGUE/FATORES E COAGULACAO E CORRELATOS"]
[null,"MATERIAL","64","MEDICAMENTOS","MATERIAL","6460","ORGAOS HEMATOPOIETICOS E SANGUE/FIBRINOLITICOS"]
[null,"MATERIAL","64","MEDICAMENTOS","MATERIAL","6461","SISTEMA CIRCULATORIO/ANTIANGINOSOS"]
[null,"MATERIAL","64","MEDICAMENTOS","MATERIAL","6462","SISTEMA CIRCULATORIO/ANTIARRITMICOS"]
[null,"MATERIAL","64","MEDICAMENTOS","MATERIAL","6463","SISTEMA CIRCULATORIO/ANTI HIPERTENSIVOS"]
[null,"MATERIAL","64","MEDICAMENTOS","MATERIAL","6464","SISTEMA CIRCULATORIO/BLOQUEADORES DOS CANAIS DE CALCIO"]
[null,"MATERIAL","64","MEDICAMENTOS","MATERIAL","6465","SISTEMA CIRCULARORIO/CARDIOTONICOS"]
[null,"MATERIAL","64","MEDICAMENTOS","MATERIAL","6466","SISTEMA CIRCULATORIO/VASODILATADORES E ESCLEROSANTES"]
[null,"MATERIAL","64","MEDICAMENTOS","MATERIAL","6467","SISTEMA NERVOSO AUTONOMO/ADRENERGICOS"]
[null,"MATERIAL","64","MEDICAMENTOS","MATERIAL","6468","SISTEMA NERVOSO AUTONOMO/ANTI HISTAMINICOS"]
[null,"MATERIAL","64","MEDICAMENTOS","MATERIAL","6470","SISTEMA NERVOSO AUTONOMO/BLOQUEADORES COLINERGICOS E ANTIES PASMODICOS"]
[null,"MATERIAL","64","MEDICAMENTOS","MATERIAL","6471","SISTEMA NERVOSO AUTONOMO/COLINERGICOS"]
[null,"MATERIAL","64","MEDICAMENTOS","MATERIAL","6472","SISTEMA NERVOSO CENTRAL E PERIFERICO/ANALGESICOS ANTIINFLA MATORIOS E ANTIPIRETICOS"]
[null,"MATERIAL","64","MEDICAMENTOS","MATERIAL","6473","SISTEMA NERVOSO CENTRAL E PERIFERICO/ANESTESICOS GERAIS"]
[null,"MATERIAL","64","MEDICAMENTOS","MATERIAL","6474","SISTEMA NERVOSO CENTRAL E PERIFERICO/ANESTESICOS LOCAIS"]
[null,"MATERIAL","64","MEDICAMENTOS","MATERIAL","6475","SISTEMA NERVOSO CENTRAL E PERIFERICO/ANSIOLITICOS"]
[null,"MATERIAL","64","MEDICAMENTOS","MATERIAL","6476","SISTEMA NERVOSO CENTRAL E PERIFERICO/ANTICONVULSIVANTES"]
[null,"MATERIAL","64","MEDICAMENTOS","MATERIAL","6477","SISTEMA NERVOSO CENTRAL E PERIFERICO/ANTIDEPRESSIVOS E ESTA BILIZADORES DO HUMOR"]
[null,"MATERIAL","64","MEDICAMENTOS","MATERIAL","6478","SISTEMA NERVOSO CENTRAL E PERIFERICO/ANTIPARKINSONIANOS"]
[null,"MATERIAL","64","MEDICAMENTOS","MATERIAL","6479","SISTEMA NERVOSO CENTRAL E PERIFERICO/ANTIVERTIGINOSOS"]
[null,"MATERIAL","64","MEDICAMENTOS","MATERIAL","6480","SISTEMA NERVOSO CENTRAL E PERIFERICO/BLOQUADORES MUSCULARES"]
[null,"MATERIAL","64","MEDICAMENTOS","MATERIAL","6481","SISTEMA NERVOSO CENTRAL E PERIFERICO/HIPOANALGESICOS"]
[null,"MATERIAL","64","MEDICAMENTOS","MATERIAL","6482","SISTEMA NERVOSO CENTRAL E PERIFERICO/HIPNOTICOS E SEDATIVOS"]
[null,"MATERIAL","64","MEDICAMENTOS","MATERIAL","6483","SISTEMA NERVOSO CENTRAL E PERIFERICO/NEUROLEPTICOS/ANTIPSICOTICOS"]
[null,"MATERIAL","64","MEDICAMENTOS","MATERIAL","6484","SISTEMA NERVOSO CENTRAL E PERIFERICO/TERAPEUTICA DA DOENCA  DE ALZHEIMER"]
[null,"MATERIAL","64","MEDICAMENTOS","MATERIAL","6485","SISTEMA MUSCULO ESQUELETICO/ANTIGOTOSOS"]
[null,"MATERIAL","64","MEDICAMENTOS","MATERIAL","6486","SISTEMA MUSCULO ESQUELETICO/RELAXANTES MUSCULARES"]
[null,"MATERIAL","64","MEDICAMENTOS","MATERIAL","6487","USO EXTERNO/ANTIINFECCIOSOS ANTIINFLAMATORIOS E ANTI HEMOR ROIDARIOS"]
[null,"MATERIAL","64","MEDICAMENTOS","MATERIAL","6488","USO EXTERNO/ANTIPARASITARIOS E FUNGICIDAS"]
[null,"MATERIAL","64","MEDICAMENTOS","MATERIAL","6489","USO EXTERNO/ANTISSEPTICOS"]
[null,"MATERIAL","64","MEDICAMENTOS","MATERIAL","6490","FITOTERAPICOS"]
[null,"MATERIAL","64","MEDICAMENTOS","MATERIAL","6491","USO EXTERNO/PROTETORES E REDUTORES"]
[null,"MATERIAL","64","MEDICAMENTOS","MATERIAL","6493","USO TOPICO UTILIZADOS EM OTORRINOLARINGOLOGIA/ANTIINFECCIO  SOS E ANTIINFLAMATORIOS"]
[null,"MATERIAL","64","MEDICAMENTOS","MATERIAL","6494","USO TOPICO UTILIZADOS EM OTORRINOLARINGOLOGIA/DESCONGESTIO  NANTES"]
[null,"MATERIAL","64","MEDICAMENTOS","MATERIAL","6495","USO TOPICO UTILIZADOS EM OTORRINOLARINGOLOGIA/EMOLIENTES"]
[null,"MATERIAL","64","MEDICAMENTOS","MATERIAL","6496","SOLUCOES PARA DIALISE HEMODIALISE E IRRIGACAO"]
[null,"MATERIAL","64","MEDICAMENTOS","MATERIAL","6497","APARELHO GENITURINARIO/ANTICONCEPCIONAIS E ANOVULATORIOS"]
[null,"MATERIAL","64","MEDICAMENTOS","MATERIAL","6498","MEDICAMENTOS DECISAO JUDICIAL DE USO EXCLUSIVO DA SES"]
[null,"MATERIAL","64","MEDICAMENTOS","MATERIAL","6499","VETERINARIOS"]
[null,"MATERIAL","65","MATERIAIS E EQUIPAMENTOS PARA USOS MEDICOS ODONTOLOGICOS  E VETERINARIOS","MATERIAL","6505","DROGAS PRODUTOS BIOLOGICOS E REAGENTES OFICINAIS (PADRONIZADOS)"]
[null,"MATERIAL","65","MATERIAIS E EQUIPAMENTOS PARA USOS MEDICOS ODONTOLOGICOS  E VETERINARIOS","MATERIAL","6508","COSMETICOS E PRODUTOS DE TOALETES PARA PACIENTES HOSPITALIZADOS"]
[null,"MATERIAL","65","MATERIAIS E EQUIPAMENTOS PARA USOS MEDICOS ODONTOLOGICOS  E VETERINARIOS","MATERIAL","6510","MATERIAIS CIRURGICOS PARA CURATIVOS"]
[null,"MATERIAL","65","MATERIAIS E EQUIPAMENTOS PARA USOS MEDICOS ODONTOLOGICOS  E VETERINARIOS","MATERIAL","6515","SUPRIMENTOS PARA USO MEDICO E CIRURGICO"]
[null,"MATERIAL","65","MATERIAIS E EQUIPAMENTOS PARA USOS MEDICOS ODONTOLOGICOS  E VETERINARIOS","MATERIAL","6517","PECAS E COMPONENTES PARA EQUIPAMENTOS MEDICOS CIRURGICOS E HOSPITALARES"]
[null,"MATERIAL","65","MATERIAIS E EQUIPAMENTOS PARA USOS MEDICOS ODONTOLOGICOS  E VETERINARIOS","MATERIAL","6518","EQUIPAMENTOS APARELHOS E UTENSILIOS MEDICOS HOSPITALARES"]
[null,"MATERIAL","65","MATERIAIS E EQUIPAMENTOS PARA USOS MEDICOS ODONTOLOGICOS  E VETERINARIOS","MATERIAL","6519","INSTRUMENTOS MEDICOS HOSPITALARES"]
[null,"MATERIAL","65","MATERIAIS E EQUIPAMENTOS PARA USOS MEDICOS ODONTOLOGICOS  E VETERINARIOS","MATERIAL","6520","SUPRIMENTOS PARA USO ODONTOLOGICO"]
[null,"MATERIAL","65","MATERIAIS E EQUIPAMENTOS PARA USOS MEDICOS ODONTOLOGICOS  E VETERINARIOS","MATERIAL","6521","EQUIPAMENTOS E APARELHOS ODONTOLOGICOS"]
[null,"MATERIAL","65","MATERIAIS E EQUIPAMENTOS PARA USOS MEDICOS ODONTOLOGICOS  E VETERINARIOS","MATERIAL","6522","PECAS E COMPONENTES DE EQUIPAMENTOS PARA USO ODONTOLOGICO"]
[null,"MATERIAL","65","MATERIAIS E EQUIPAMENTOS PARA USOS MEDICOS ODONTOLOGICOS  E VETERINARIOS","MATERIAL","6523","INSTRUMENTOS E UTENSILIOS ODONTOLOGICOS"]
[null,"MATERIAL","65","MATERIAIS E EQUIPAMENTOS PARA USOS MEDICOS ODONTOLOGICOS  E VETERINARIOS","MATERIAL","6525","EQUIPAMENTOS E SUPRIMENTOS PARA  RAIO X USO MEDICO/ODONTOLOGICO/VETERINARIO"]
[null,"MATERIAL","65","MATERIAIS E EQUIPAMENTOS PARA USOS MEDICOS ODONTOLOGICOS  E VETERINARIOS","MATERIAL","6527","PECAS E COMPONENTES PARA EQUIPAMENTOS DE RAIO X USO MEDICO ODONTOLOGICO E VETERINARIO"]
[null,"MATERIAL","65","MATERIAIS E EQUIPAMENTOS PARA USOS MEDICOS ODONTOLOGICOS  E VETERINARIOS","MATERIAL","6530","MOBILIARIO PARA USO MEDICO HOSPITALAR REABILITACAO E      LABORATORIO"]
[null,"MATERIAL","65","MATERIAIS E EQUIPAMENTOS PARA USOS MEDICOS ODONTOLOGICOS  E VETERINARIOS","MATERIAL","6531","COMPONENTES E PECAS DE MOBILIARIO PARA USO MEDICO HOSPITALAR E REABILITACAO"]
[null,"MATERIAL","65","MATERIAIS E EQUIPAMENTOS PARA USOS MEDICOS ODONTOLOGICOS  E VETERINARIOS","MATERIAL","6532","VESTUARIO DESCARTAVEL DE USO MEDICO ODONTOLOGICO E HOSPITA LAR"]
[null,"MATERIAL","65","MATERIAIS E EQUIPAMENTOS PARA USOS MEDICOS ODONTOLOGICOS  E VETERINARIOS","MATERIAL","6533","VESTUARIO DE USO MEDICO E ODONTOLOGICO NAO DESCARTAVEL"]
[null,"MATERIAL","65","MATERIAIS E EQUIPAMENTOS PARA USOS MEDICOS ODONTOLOGICOS  E VETERINARIOS","MATERIAL","6535","INSTRUMENTOS EQUIPAMENTOS E ARTIGOS VETERINARIOS"]
[null,"MATERIAL","65","MATERIAIS E EQUIPAMENTOS PARA USOS MEDICOS ODONTOLOGICOS  E VETERINARIOS","MATERIAL","6538","COMPONENTES E ACESSORIOS PARA EQUIPAMENTOS ODONTOLOGICOS    PARA CONTRATOS DE MANUTENCAO PREVENTIVA/CORRETIVA"]
[null,"MATERIAL","65","MATERIAIS E EQUIPAMENTOS PARA USOS MEDICOS ODONTOLOGICOS  E VETERINARIOS","MATERIAL","6539","COMPONENTES E ACESSORIOS PARA EQUIPAMENTOS MEDICOS HOSPITALARES PARA CONTRATOS DE MANUTENCAO PREVENTIVA/CORRETIVA"]
[null,"MATERIAL","65","MATERIAIS E EQUIPAMENTOS PARA USOS MEDICOS ODONTOLOGICOS  E VETERINARIOS","MATERIAL","6540","EQUIPAMENTOS INSTRUMENTOS  E  SUPRIMENTOS DE OFTALMOLOGIA  (OPTOMETRIA)"]
[null,"MATERIAL","65","MATERIAIS E EQUIPAMENTOS PARA USOS MEDICOS ODONTOLOGICOS  E VETERINARIOS","MATERIAL","6542","PECAS E COMPONENTES PARA EQUIPAMENTOS E INSTRUMENTOS DE OFTALMOLOGIA (OPTOMETRIA)"]
[null,"MATERIAL","65","MATERIAIS E EQUIPAMENTOS PARA USOS MEDICOS ODONTOLOGICOS  E VETERINARIOS","MATERIAL","6550","SUPRIMENTOS PARA TECNOLOGIA ASSISTIVA"]
[null,"MATERIAL","65","MATERIAIS E EQUIPAMENTOS PARA USOS MEDICOS ODONTOLOGICOS  E VETERINARIOS","MATERIAL","6555","EQUIPAMENTOS PARA TECNOLOGIA ASSISTIVA"]
[null,"MATERIAL","66","EQUIPAMENTOS DE LABORATORIO E INSTRUMENTOS DE MEDICAO","MATERIAL","6605","INSTRUMENTOS DE NAVEGACAO"]
[null,"MATERIAL","66","EQUIPAMENTOS DE LABORATORIO E INSTRUMENTOS DE MEDICAO","MATERIAL","6610","INSTRUMENTOS DE VOO"]
[null,"MATERIAL","66","EQUIPAMENTOS DE LABORATORIO E INSTRUMENTOS DE MEDICAO","MATERIAL","6625","INSTRUMENTOS DE VERIFICACAO ENSAIO E MEDICAO DE APARELHAGEM ELETRICA E ELETRONICA"]
[null,"MATERIAL","66","EQUIPAMENTOS DE LABORATORIO E INSTRUMENTOS DE MEDICAO","MATERIAL","6627","PECAS E COMPONENTES P/INSTRUMENTOS DE VERIFICACAOENSAIO E MEDICAO DE ELETRICA E ELETRONICA"]
[null,"MATERIAL","66","EQUIPAMENTOS DE LABORATORIO E INSTRUMENTOS DE MEDICAO","MATERIAL","6630","EQUIPAMENTOS E INSTRUMENTOS PARA ANALISE QUIMICA"]
[null,"MATERIAL","66","EQUIPAMENTOS DE LABORATORIO E INSTRUMENTOS DE MEDICAO","MATERIAL","6632","PECAS E COMPONENTES PARA EQUIPAMENTOS E INSTRUMENTOS  PARA  ANALISE QUIMICA"]
[null,"MATERIAL","66","EQUIPAMENTOS DE LABORATORIO E INSTRUMENTOS DE MEDICAO","MATERIAL","6634","PECAS E COMPONENTES PARA EQUIPAMENTOS PARA ENSAIO E VERIFICACAO DE PROPRIEDADES FISICAS"]
[null,"MATERIAL","66","EQUIPAMENTOS DE LABORATORIO E INSTRUMENTOS DE MEDICAO","MATERIAL","6635","EQUIPAMENTOS E ACESSORIOS PARA ENSAIO E VERIFICACAO DE PRO  PRIEDADES FISICAS"]
[null,"MATERIAL","66","EQUIPAMENTOS DE LABORATORIO E INSTRUMENTOS DE MEDICAO","MATERIAL","6636","CAMARAS AMBIENTAIS E EQUIPAMENTOS CORRELATOS"]
[null,"MATERIAL","66","EQUIPAMENTOS DE LABORATORIO E INSTRUMENTOS DE MEDICAO","MATERIAL","6638","PECAS E COMPONENTES PARA CAMARAS AMBIENTAIS E EQUIPAMENTOS  CORRELATOS"]
[null,"MATERIAL","66","EQUIPAMENTOS DE LABORATORIO E INSTRUMENTOS DE MEDICAO","MATERIAL","6640","SUPRIMENTOS PARA LABORATORIO"]
[null,"MATERIAL","66","EQUIPAMENTOS DE LABORATORIO E INSTRUMENTOS DE MEDICAO","MATERIAL","6641","EQUIPAMENTOS DE LABORATORIO"]
[null,"MATERIAL","66","EQUIPAMENTOS DE LABORATORIO E INSTRUMENTOS DE MEDICAO","MATERIAL","6642","PECAS E COMPONENTES PARA EQUIPAMENTOS DE LABORATORIO"]
[null,"MATERIAL","66","EQUIPAMENTOS DE LABORATORIO E INSTRUMENTOS DE MEDICAO","MATERIAL","6643","INSTRUMENTOS DE LABORATORIO"]
[null,"MATERIAL","66","EQUIPAMENTOS DE LABORATORIO E INSTRUMENTOS DE MEDICAO","MATERIAL","6645","INSTRUMENTOS PARA MEDICAO DE TEMPO"]
[null,"MATERIAL","66","EQUIPAMENTOS DE LABORATORIO E INSTRUMENTOS DE MEDICAO","MATERIAL","6647","PECAS E COMPONENTES PARA INSTRUMENTOS PARA MEDICAO DE TEMPO"]
[null,"MATERIAL","66","EQUIPAMENTOS DE LABORATORIO E INSTRUMENTOS DE MEDICAO","MATERIAL","6650","INSTRUMENTOS OPTICOS"]
[null,"MATERIAL","66","EQUIPAMENTOS DE LABORATORIO E INSTRUMENTOS DE MEDICAO","MATERIAL","6652","PECAS E COMPONENTES PARA INSTRUMENTOS OPTICOS"]
[null,"MATERIAL","66","EQUIPAMENTOS DE LABORATORIO E INSTRUMENTOS DE MEDICAO","MATERIAL","6660","INSTRUMENTOS E APARELHOS DE METEOROLOGIA"]
[null,"MATERIAL","66","EQUIPAMENTOS DE LABORATORIO E INSTRUMENTOS DE MEDICAO","MATERIAL","6661","SISTEMAS DE MONITORAMENTO CLIMATICOS"]
[null,"MATERIAL","66","EQUIPAMENTOS DE LABORATORIO E INSTRUMENTOS DE MEDICAO","MATERIAL","6662","PECAS E COMPONENTES PARA INSTRUMENTOS E APARELHOS DE METEREOLOGIA"]
[null,"MATERIAL","66","EQUIPAMENTOS DE LABORATORIO E INSTRUMENTOS DE MEDICAO","MATERIAL","6665","INSTRUMENTOS E APARELHOS PARA DETECCAO DE PERIGOS"]
[null,"MATERIAL","66","EQUIPAMENTOS DE LABORATORIO E INSTRUMENTOS DE MEDICAO","MATERIAL","6667","PECAS E COMPONENTES PARA INSTRUMENTOS E APARELHOS PARA DETECCAO DE PERIGOS"]
[null,"MATERIAL","66","EQUIPAMENTOS DE LABORATORIO E INSTRUMENTOS DE MEDICAO","MATERIAL","6670","ESCALAS E BALANCAS"]
[null,"MATERIAL","66","EQUIPAMENTOS DE LABORATORIO E INSTRUMENTOS DE MEDICAO","MATERIAL","6672","COMPONENTES E ACESSORIOS PARA ESCALAS E BALANCAS"]
[null,"MATERIAL","66","EQUIPAMENTOS DE LABORATORIO E INSTRUMENTOS DE MEDICAO","MATERIAL","6675","INSTRUMENTOS PARA DESENHO TOPOGRAFIA E CARTOGRAFIA"]
[null,"MATERIAL","66","EQUIPAMENTOS DE LABORATORIO E INSTRUMENTOS DE MEDICAO","MATERIAL","6680","INSTRUMENTOS PARA MEDICAO FLUXOS GAS/LIQUIDOS/NIVEL  E  MOVIMENTOS MECANICOS"]
[null,"MATERIAL","66","EQUIPAMENTOS DE LABORATORIO E INSTRUMENTOS DE MEDICAO","MATERIAL","6682","PECAS E COMPONENTES PARA INSTRUMENTOS PARA MEDICAO DE FLUXOS GAS/LIQUIDOS/NIVEL E MOVIMENTOS MECANICOS"]
[null,"MATERIAL","66","EQUIPAMENTOS DE LABORATORIO E INSTRUMENTOS DE MEDICAO","MATERIAL","6685","INSTRUMENTOS PARA CONTROLE E MEDICAO DE PRESSAO TEMPERATURA E UMIDADE"]
[null,"MATERIAL","66","EQUIPAMENTOS DE LABORATORIO E INSTRUMENTOS DE MEDICAO","MATERIAL","6687","PECAS E COMPONENTES PARA INSTRUMENTOS PARA CONTROLE E MEDICAO DE PRESSAO TEMPERATURA E UMIDADE"]
[null,"MATERIAL","66","EQUIPAMENTOS DE LABORATORIO E INSTRUMENTOS DE MEDICAO","MATERIAL","6695","INSTRUMENTOS COMBINADOS E INSTRUMENTOS DIVERSOS"]
[null,"MATERIAL","66","EQUIPAMENTOS DE LABORATORIO E INSTRUMENTOS DE MEDICAO","MATERIAL","6697","PECAS E COMPONENTES PARA INSTRUMENTOS COMBINADOS E INSTRUMENTOS DIVERSOS"]
[null,"MATERIAL","66","EQUIPAMENTOS DE LABORATORIO E INSTRUMENTOS DE MEDICAO","MATERIAL","6698","COMPONENTES E ACESSORIOS PARA EQUIPAMENTOS DE LABORATORIO   PARA CONTRATOS DE MANUTENCAO PREVENTIVA/CORRETIVA"]
[null,"MATERIAL","67","MATERIAIS E EQUIPAMENTOS FOTOGRAFICOS E CINEMATOGRAFICOS","MATERIAL","6710","CAMERAS CINEMATOGRAFICAS E DE ESTUDIO DE TV"]
[null,"MATERIAL","67","MATERIAIS E EQUIPAMENTOS FOTOGRAFICOS E CINEMATOGRAFICOS","MATERIAL","6720","CAMERA E EQUIPAMENTOS FOTOGRAFICOS  "]
[null,"MATERIAL","67","MATERIAIS E EQUIPAMENTOS FOTOGRAFICOS E CINEMATOGRAFICOS","MATERIAL","6730","EQUIPAMENTOS PARA PROJECAO FOTOGRAFICA E CINEMATOGRAFICA"]
[null,"MATERIAL","67","MATERIAIS E EQUIPAMENTOS FOTOGRAFICOS E CINEMATOGRAFICOS","MATERIAL","6740","EQUIPAMENTOS PARA REVELACAO E ACABAMENTOS FOTOGRAFICOS"]
[null,"MATERIAL","67","MATERIAIS E EQUIPAMENTOS FOTOGRAFICOS E CINEMATOGRAFICOS","MATERIAL","6750","MATERIAIS FOTOGRAFICOS E CINEMATOGRAFICOS"]
[null,"MATERIAL","67","MATERIAIS E EQUIPAMENTOS FOTOGRAFICOS E CINEMATOGRAFICOS","MATERIAL","6760","PECAS E ACESSORIOS PARA EQUIPAMENTOS FOTOGRAFICOS CINEMATO GRAFICOS E DE PROJECAO"]
[null,"MATERIAL","67","MATERIAIS E EQUIPAMENTOS FOTOGRAFICOS E CINEMATOGRAFICOS","MATERIAL","6780","JOGOS E ESTOJOS DE MATERIAL FOTOGRAFICO  E CINEMATOGRAFICO"]
[null,"MATERIAL","68","SUBSTANCIAS E PRODUTOS QUIMICOS","MATERIAL","6810","REAGENTES QUIMICOS"]
[null,"MATERIAL","68","SUBSTANCIAS E PRODUTOS QUIMICOS","MATERIAL","6820","REAGENTES QUIMICOS CORANTES E INDICADORES"]
[null,"MATERIAL","68","SUBSTANCIAS E PRODUTOS QUIMICOS","MATERIAL","6830","GASES: COMPRIMIDOS E LIQUIFEITOS"]
[null,"MATERIAL","68","SUBSTANCIAS E PRODUTOS QUIMICOS","MATERIAL","6840","DESINFETANTES E AGENTES PARA COMBATE A PRAGAS"]
[null,"MATERIAL","68","SUBSTANCIAS E PRODUTOS QUIMICOS","MATERIAL","6850","ESPECIALIDADES QUIMICAS"]
[null,"MATERIAL","68","SUBSTANCIAS E PRODUTOS QUIMICOS","MATERIAL","6860","COMPOSTOS QUIMICOS PRODUTOS QUIMICOS E REAGENTES PARA INDUSTRIA FARMACEUTICA"]
[null,"MATERIAL","69","APARELHOS E MEIOS AUXILIARES PARA TREINAMENTO","MATERIAL","6910","MEIOS AUXILIARES PARA TESTES DE SELECAO E TREINAMENTO"]
[null,"MATERIAL","69","APARELHOS E MEIOS AUXILIARES PARA TREINAMENTO","MATERIAL","6920","APARELHAGEM DE INSTRUCAO DE ARMAMENTO"]
[null,"MATERIAL","69","APARELHOS E MEIOS AUXILIARES PARA TREINAMENTO","MATERIAL","6940","APARELHAGEM PARA TREINAMENTO E INSTRUCAO"]
[null,"MATERIAL","69","APARELHOS E MEIOS AUXILIARES PARA TREINAMENTO","MATERIAL","6950","EQUIPAMENTOS E MEIOS AUXILIARES DIDATICOS/PEDAGOGICOS"]
[null,"MATERIAL","70","EQUIPAMENTOS PERIFERICOS ACESSORIOS  E SUPRIMENTOS  DE PROCESSAMENTO DE DADOS EM GERAL","MATERIAL","7010","EQUIPAMENTOS DE INFORMATICA  "]
[null,"MATERIAL","70","EQUIPAMENTOS PERIFERICOS ACESSORIOS  E SUPRIMENTOS  DE PROCESSAMENTO DE DADOS EM GERAL","MATERIAL","7015","ATIVOS DE REDE"]
[null,"MATERIAL","70","EQUIPAMENTOS PERIFERICOS ACESSORIOS  E SUPRIMENTOS  DE PROCESSAMENTO DE DADOS EM GERAL","MATERIAL","7020","UNIDADE CENTRAL DE  PROCESSAMENTO  ANALOGICO (CPU) COMPONENTES E PERIFERICOS"]
[null,"MATERIAL","70","EQUIPAMENTOS PERIFERICOS ACESSORIOS  E SUPRIMENTOS  DE PROCESSAMENTO DE DADOS EM GERAL","MATERIAL","7022","UNIDADE CENTRAL DE PROCESSAMENTO HIBRIDA (CPU)"]
[null,"MATERIAL","70","EQUIPAMENTOS PERIFERICOS ACESSORIOS  E SUPRIMENTOS  DE PROCESSAMENTO DE DADOS EM GERAL","MATERIAL","7025","ARMAZENAMENTO   INFORMATICA  "]
[null,"MATERIAL","70","EQUIPAMENTOS PERIFERICOS ACESSORIOS  E SUPRIMENTOS  DE PROCESSAMENTO DE DADOS EM GERAL","MATERIAL","7035","COMPONENTES PERIFERICOS E ACESSORIOS DE INFORMATICA  "]
[null,"MATERIAL","70","EQUIPAMENTOS PERIFERICOS ACESSORIOS  E SUPRIMENTOS  DE PROCESSAMENTO DE DADOS EM GERAL","MATERIAL","7042","DISPOSITIVO DE CONTROLE PARA COMPUTADOR E MICRO"]
[null,"MATERIAL","70","EQUIPAMENTOS PERIFERICOS ACESSORIOS  E SUPRIMENTOS  DE PROCESSAMENTO DE DADOS EM GERAL","MATERIAL","7045","EQUIPAMENTOS DE APOIO E MATERIAL DE CONSUMO PARA INFORMATICA"]
[null,"MATERIAL","70","EQUIPAMENTOS PERIFERICOS ACESSORIOS  E SUPRIMENTOS  DE PROCESSAMENTO DE DADOS EM GERAL","MATERIAL","7050","COMPONENTES DE PROCESSAMENTO DE DADOS"]
[null,"MATERIAL","70","EQUIPAMENTOS PERIFERICOS ACESSORIOS  E SUPRIMENTOS  DE PROCESSAMENTO DE DADOS EM GERAL","MATERIAL","7055","EQUIPAMENTOS COMBINADOS PARA INFORMATIZACAO E PROCESSAMENTO DE DADOS"]
[null,"MATERIAL","70","EQUIPAMENTOS PERIFERICOS ACESSORIOS  E SUPRIMENTOS  DE PROCESSAMENTO DE DADOS EM GERAL","MATERIAL","7060","EQUIPAMENTOS E DISPOSITIVOS DE SEGURANCA  PARA  EQUIPAMENTOSDE INFORMATICA"]
[null,"MATERIAL","71","MOBILIARIO","MATERIAL","7105","MOBILIARIO DE USO GERAL"]
[null,"MATERIAL","71","MOBILIARIO","MATERIAL","7110","MOBILIARIO DE ESCRITORIO"]
[null,"MATERIAL","71","MOBILIARIO","MATERIAL","7115","MOBILIARIO ESCOLAR E DE AUDITORIO"]
[null,"MATERIAL","71","MOBILIARIO","MATERIAL","7125","ESTANTES E ARMACOES PARA ALMOXARIFADOS"]
[null,"MATERIAL","71","MOBILIARIO","MATERIAL","7135","MOBILIARIO PARA AREA DE INFORMATICA"]
[null,"MATERIAL","71","MOBILIARIO","MATERIAL","7195","MOBILIARIO DIVERSO E ESPECIAL"]
[null,"MATERIAL","71","MOBILIARIO","MATERIAL","7197","COMPONENTES E PECAS PARA MOBILIARIO"]
[null,"MATERIAL","72","ARTIGOS DOMESTICOS E COMERCIAIS","MATERIAL","7210","GUARNICOES DE USO DOMESTICO (ROUPAS DE CAMA MESA BANHO    ETC)"]
[null,"MATERIAL","72","ARTIGOS DOMESTICOS E COMERCIAIS","MATERIAL","7220","REVESTIMENTOS PARA PISOS"]
[null,"MATERIAL","72","ARTIGOS DOMESTICOS E COMERCIAIS","MATERIAL","7230","CORTINAS TOLDOS PERSIANAS E COMPONENTES"]
[null,"MATERIAL","72","ARTIGOS DOMESTICOS E COMERCIAIS","MATERIAL","7240","RECIPIENTES DE USO DOMESTICO E COMERCIAL"]
[null,"MATERIAL","72","ARTIGOS DOMESTICOS E COMERCIAIS","MATERIAL","7290","EQUIPAMENTOS E ARTIGOS DOMESTICOS E COMERCIAIS DIVERSOS"]
[null,"MATERIAL","73","EQUIPAMENTOS PARA  REFEITORIO COPA E COZINHA","MATERIAL","7310","EQUIPAMENTOS ACESSORIOS E PECAS PARA PREPARAR ALIMENTOS"]
[null,"MATERIAL","73","EQUIPAMENTOS PARA  REFEITORIO COPA E COZINHA","MATERIAL","7320","EQUIPAMENTOS AUXILIARES DE COZINHA"]
[null,"MATERIAL","73","EQUIPAMENTOS PARA  REFEITORIO COPA E COZINHA","MATERIAL","7330","UTENSILIOS DE COZINHA MANUAIS"]
[null,"MATERIAL","73","EQUIPAMENTOS PARA  REFEITORIO COPA E COZINHA","MATERIAL","7340","TALHERES DE MESA E CUTELARIA"]
[null,"MATERIAL","73","EQUIPAMENTOS PARA  REFEITORIO COPA E COZINHA","MATERIAL","7350","ARTIGOS PARA SERVICOS DE MESAS"]
[null,"MATERIAL","73","EQUIPAMENTOS PARA  REFEITORIO COPA E COZINHA","MATERIAL","7360","JOGOS E ESTOJOS DE ARTIGOS PARA REFEITORIOCOPA E COZINHA"]
[null,"MATERIAL","74","MAQUINAS DE ESCRITORIO E EQUIPAMENTO DE REGISTRO VISUAL","MATERIAL","7420","MAQUINAS CALCULADORAS E DE CONTABILIDADE"]
[null,"MATERIAL","74","MAQUINAS DE ESCRITORIO E EQUIPAMENTO DE REGISTRO VISUAL","MATERIAL","7430","MAQUINA DE DATILOGRAFIA E MAQUINA DE COMPOSICAO DE TIPOS  PARA ESCRITORIO"]
[null,"MATERIAL","74","MAQUINAS DE ESCRITORIO E EQUIPAMENTO DE REGISTRO VISUAL","MATERIAL","7435","EQUIPAMENTOS DE SISTEMAS DE INFORMACAO PARA ESCRITORIO"]
[null,"MATERIAL","74","MAQUINAS DE ESCRITORIO E EQUIPAMENTO DE REGISTRO VISUAL","MATERIAL","7490","MAQUINAS DIVERSAS DE ESCRITORIO"]
[null,"MATERIAL","74","MAQUINAS DE ESCRITORIO E EQUIPAMENTO DE REGISTRO VISUAL","MATERIAL","7495","PECASACESSORIOS E COMPONENTES PARA MAQUINAS DE ESCRITORIO E EQUIPAMENTOS DE REGISTRO VISUAL"]
[null,"MATERIAL","75","ARTIGOS DE ESCRITORIO","MATERIAL","7510","ARTIGOS DE ESCRITORIO"]
[null,"MATERIAL","75","ARTIGOS DE ESCRITORIO","MATERIAL","7520","UTENSILIOS DE ESCRITORIO"]
[null,"MATERIAL","75","ARTIGOS DE ESCRITORIO","MATERIAL","7530","PAPELARIA E FORMULARIOS EXCETO FORMULARIOS PADRONIZADOS"]
[null,"MATERIAL","75","ARTIGOS DE ESCRITORIO","MATERIAL","7535","COMPONENTES E PECAS PARA UTENSILIOS DE ESCRITORIO"]
[null,"MATERIAL","75","ARTIGOS DE ESCRITORIO","MATERIAL","7540","FORMULARIOS (MODELOS) PADROES"]
[null,"MATERIAL","76","LIVROS MAPAS E OUTRAS PUBLICACOES","MATERIAL","7610","LIVROS E FOLHETOS"]
[null,"MATERIAL","76","LIVROS MAPAS E OUTRAS PUBLICACOES","MATERIAL","7630","JORNAIS E PERIODICOS"]
[null,"MATERIAL","76","LIVROS MAPAS E OUTRAS PUBLICACOES","MATERIAL","7640","MAPAS ATLAS CARTAS ORTO E AEROFOTOS IMAGEM ORBITAL      E GLOBOS"]
[null,"MATERIAL","76","LIVROS MAPAS E OUTRAS PUBLICACOES","MATERIAL","7650","NORMAS E DESENHOS TECNICOS"]
[null,"MATERIAL","76","LIVROS MAPAS E OUTRAS PUBLICACOES","MATERIAL","7660","LIVROS E FOLHETOS DE MUSICA"]
[null,"MATERIAL","76","LIVROS MAPAS E OUTRAS PUBLICACOES","MATERIAL","7690","IMPRESSOS DIVERSOS"]
[null,"MATERIAL","77","INSTRUMENTOS MUSICAIS RADIOS FONOGRAFOS TELEVISOR VIDEO AUDIO/SONORIZACAO E ACESSORIOS","MATERIAL","7710","INSTRUMENTOS MUSICAIS"]
[null,"MATERIAL","77","INSTRUMENTOS MUSICAIS RADIOS FONOGRAFOS TELEVISOR VIDEO AUDIO/SONORIZACAO E ACESSORIOS","MATERIAL","7720","ACESSORIOS E PARTES DE INSTRUMENTOS MUSICAIS"]
[null,"MATERIAL","77","INSTRUMENTOS MUSICAIS RADIOS FONOGRAFOS TELEVISOR VIDEO AUDIO/SONORIZACAO E ACESSORIOS","MATERIAL","7730","RADIOS FONOGRAFOS TELEVISORES TIPO DOMESTICO E ACESSORIOS"]
[null,"MATERIAL","77","INSTRUMENTOS MUSICAIS RADIOS FONOGRAFOS TELEVISOR VIDEO AUDIO/SONORIZACAO E ACESSORIOS","MATERIAL","7740","GRAVACAO FONOGRAFICACINEMATOGRAFICA E FITA VIRGEM"]
[null,"MATERIAL","78","MATERIAIS E EQUIPAMENTOS PARA RECREACAO E DESPORTO","MATERIAL","7810","MATERIAIS E EQUIPAMENTOS PARA ATLETISMO E DESPORTO"]
[null,"MATERIAL","78","MATERIAIS E EQUIPAMENTOS PARA RECREACAO E DESPORTO","MATERIAL","7820","JOGOS E BRINQUEDOS"]
[null,"MATERIAL","78","MATERIAIS E EQUIPAMENTOS PARA RECREACAO E DESPORTO","MATERIAL","7830","MATERIAIS E EQUIPAMENTOS PARA GINASTICA E RECREACAO"]
[null,"MATERIAL","78","MATERIAIS E EQUIPAMENTOS PARA RECREACAO E DESPORTO","MATERIAL","7835","PECAS E COMPONENTES"]
[null,"MATERIAL","79","MATERIAIS E EQUIPAMENTOS PARA LIMPEZA","MATERIAL","7910","ASPIRADORES DE PO E ENCERADEIRA E SEUS COMPONENTES"]
[null,"MATERIAL","79","MATERIAIS E EQUIPAMENTOS PARA LIMPEZA","MATERIAL","7920","EQUIPAMENTOS AUXILIARES E MATERIAIS PARA LIMPEZA"]
[null,"MATERIAL","79","MATERIAIS E EQUIPAMENTOS PARA LIMPEZA","MATERIAL","7930","COMPOSTOS E PREPARADOS PARA LIMPEZA E POLIMENTO"]
[null,"MATERIAL","80","TINTAS EQUIPAMENTOS PARA PINTURA SECANTES E ADESIVOS","MATERIAL","8010","TINTAS VERNIZES E PRODUTOS CORRELATOS"]
[null,"MATERIAL","80","TINTAS EQUIPAMENTOS PARA PINTURA SECANTES E ADESIVOS","MATERIAL","8020","EQUIPAMENTOS E UTENSILIOS PARA PINTURA"]
[null,"MATERIAL","80","TINTAS EQUIPAMENTOS PARA PINTURA SECANTES E ADESIVOS","MATERIAL","8030","COMPOSTOS PRESERVATIVOS E SELANTES"]
[null,"MATERIAL","80","TINTAS EQUIPAMENTOS PARA PINTURA SECANTES E ADESIVOS","MATERIAL","8040","ADESIVOS"]
[null,"MATERIAL","81","RECIPIENTES E MATERIAIS PARA ACONDICIONAMENTO E EMBALAGEM","MATERIAL","8105","BOLSAS E SACOS"]
[null,"MATERIAL","81","RECIPIENTES E MATERIAIS PARA ACONDICIONAMENTO E EMBALAGEM","MATERIAL","8110","TAMBORES E LATAS"]
[null,"MATERIAL","81","RECIPIENTES E MATERIAIS PARA ACONDICIONAMENTO E EMBALAGEM","MATERIAL","8115","CAIXAS E ENGRADADOS"]
[null,"MATERIAL","81","RECIPIENTES E MATERIAIS PARA ACONDICIONAMENTO E EMBALAGEM","MATERIAL","8120","CILINDROS PARA GASES PECAS E COMPONENTES"]
[null,"MATERIAL","81","RECIPIENTES E MATERIAIS PARA ACONDICIONAMENTO E EMBALAGEM","MATERIAL","8125","GARRAFAS E GARRAFOES"]
[null,"MATERIAL","81","RECIPIENTES E MATERIAIS PARA ACONDICIONAMENTO E EMBALAGEM","MATERIAL","8135","MATERIAIS DIVERSOS PARA ACONDICIONAMENTO E EMBALAGEM"]
[null,"MATERIAL","81","RECIPIENTES E MATERIAIS PARA ACONDICIONAMENTO E EMBALAGEM","MATERIAL","8140","RECIPIENTES PARA MUNICOES E EXPLOSIVOS"]
[null,"MATERIAL","82","MEDICAMENTOS (GRUPO AUXILIAR)","MATERIAL","8205","MEDICAMENTOS DE URGENCIA"]
[null,"MATERIAL","83","TECIDOS COUROS MATERIAIS CORRELATOS E MIUDEZAS AVIAMENTOS PARA COSTURA EM GERAL","MATERIAL","8305","TECIDOS"]
[null,"MATERIAL","83","TECIDOS COUROS MATERIAIS CORRELATOS E MIUDEZAS AVIAMENTOS PARA COSTURA EM GERAL","MATERIAL","8310","FIOS E LINHAS PARA COSTURA"]
[null,"MATERIAL","83","TECIDOS COUROS MATERIAIS CORRELATOS E MIUDEZAS AVIAMENTOS PARA COSTURA EM GERAL","MATERIAL","8315","MIUDEZAS E AVIAMENTOS DE COSTURA"]
[null,"MATERIAL","83","TECIDOS COUROS MATERIAIS CORRELATOS E MIUDEZAS AVIAMENTOS PARA COSTURA EM GERAL","MATERIAL","8320","MATERIAL PARA ESTOFAMENTO E ACOLCHOAMENTO"]
[null,"MATERIAL","83","TECIDOS COUROS MATERIAIS CORRELATOS E MIUDEZAS AVIAMENTOS PARA COSTURA EM GERAL","MATERIAL","8330","COUROS"]
[null,"MATERIAL","83","TECIDOS COUROS MATERIAIS CORRELATOS E MIUDEZAS AVIAMENTOS PARA COSTURA EM GERAL","MATERIAL","8335","ARTIGOS PARA CALCADOS"]
[null,"MATERIAL","83","TECIDOS COUROS MATERIAIS CORRELATOS E MIUDEZAS AVIAMENTOS PARA COSTURA EM GERAL","MATERIAL","8340","BARRACAS E ENCERADOS"]
[null,"MATERIAL","83","TECIDOS COUROS MATERIAIS CORRELATOS E MIUDEZAS AVIAMENTOS PARA COSTURA EM GERAL","MATERIAL","8345","BANDEIRAS E GALHARDETES"]
[null,"MATERIAL","84","VESTUARIOS E EQUIPAMENTOS INDIVIDUAIS DE USO COMUM E  ESPECIAL","MATERIAL","8405","VESTUARIOS EXTERIORES PARA HOMEM"]
[null,"MATERIAL","84","VESTUARIOS E EQUIPAMENTOS INDIVIDUAIS DE USO COMUM E  ESPECIAL","MATERIAL","8410","VESTUARIOS EXTERIORES PARA MULHER"]
[null,"MATERIAL","84","VESTUARIOS E EQUIPAMENTOS INDIVIDUAIS DE USO COMUM E  ESPECIAL","MATERIAL","8415","VESTUARIO ESPECIAL"]
[null,"MATERIAL","84","VESTUARIOS E EQUIPAMENTOS INDIVIDUAIS DE USO COMUM E  ESPECIAL","MATERIAL","8420","ROUPAS DE BAIXO E DE DORMIR PARA HOMEM"]
[null,"MATERIAL","84","VESTUARIOS E EQUIPAMENTOS INDIVIDUAIS DE USO COMUM E  ESPECIAL","MATERIAL","8425","ROUPAS DE BAIXO E DE DORMIR PARA MULHER"]
[null,"MATERIAL","84","VESTUARIOS E EQUIPAMENTOS INDIVIDUAIS DE USO COMUM E  ESPECIAL","MATERIAL","8430","CALCADOS PARA HOMEM"]
[null,"MATERIAL","84","VESTUARIOS E EQUIPAMENTOS INDIVIDUAIS DE USO COMUM E  ESPECIAL","MATERIAL","8435","CALCADOS PARA MULHER"]
[null,"MATERIAL","84","VESTUARIOS E EQUIPAMENTOS INDIVIDUAIS DE USO COMUM E  ESPECIAL","MATERIAL","8440","MEIAS LUVAS E COMPLEMENTOS DE VESTUARIO PARA HOMEM"]
[null,"MATERIAL","84","VESTUARIOS E EQUIPAMENTOS INDIVIDUAIS DE USO COMUM E  ESPECIAL","MATERIAL","8445","MEIAS LUVAS E COMPLEMENTOS DE VESTUARIO PARA MULHER"]
[null,"MATERIAL","84","VESTUARIOS E EQUIPAMENTOS INDIVIDUAIS DE USO COMUM E  ESPECIAL","MATERIAL","8450","ARTIGOS E ACESSORIOS PARA CRIANCA E ADOLESCENTE"]
[null,"MATERIAL","84","VESTUARIOS E EQUIPAMENTOS INDIVIDUAIS DE USO COMUM E  ESPECIAL","MATERIAL","8455","DISTINTIVOS E INSIGNIAS"]
[null,"MATERIAL","84","VESTUARIOS E EQUIPAMENTOS INDIVIDUAIS DE USO COMUM E  ESPECIAL","MATERIAL","8460","MALARIA"]
[null,"MATERIAL","84","VESTUARIOS E EQUIPAMENTOS INDIVIDUAIS DE USO COMUM E  ESPECIAL","MATERIAL","8465","EQUIPAMENTOS INDIVIDUAIS DE USOS DIVERSOS"]
[null,"MATERIAL","84","VESTUARIOS E EQUIPAMENTOS INDIVIDUAIS DE USO COMUM E  ESPECIAL","MATERIAL","8480","FARDAMENTO POLICIAL"]
[null,"MATERIAL","84","VESTUARIOS E EQUIPAMENTOS INDIVIDUAIS DE USO COMUM E  ESPECIAL","MATERIAL","8485","FARDAMENTO BOMBEIRO MILITAR"]
[null,"MATERIAL","84","VESTUARIOS E EQUIPAMENTOS INDIVIDUAIS DE USO COMUM E  ESPECIAL","MATERIAL","8490","VESTUARIOS UNISSEX"]
[null,"MATERIAL","85","ARTIGOS PARA TOUCADOR E HIGIENE PESSOAL","MATERIAL","8510","PREPARADOS PARA TOUCADOR E HIGIENE PESSOAL"]
[null,"MATERIAL","85","ARTIGOS PARA TOUCADOR E HIGIENE PESSOAL","MATERIAL","8520","PRODUTOS PARA HIGIENE PESSOAL"]
[null,"MATERIAL","85","ARTIGOS PARA TOUCADOR E HIGIENE PESSOAL","MATERIAL","8530","ARTIGOS DE USO INDIVIDUAL PARA TOUCADOR E HIGIENE PESSOAL"]
[null,"MATERIAL","85","ARTIGOS PARA TOUCADOR E HIGIENE PESSOAL","MATERIAL","8540","PRODUTOS DE PAPEL PARA HIGIENE PESSOAL"]
[null,"MATERIAL","87","FORRAGENS FERTILIZANTES SEMENTES E MUDAS","MATERIAL","8710","FORRAGENS E ALIMENTOS PARA ANIMAIS"]
[null,"MATERIAL","87","FORRAGENS FERTILIZANTES SEMENTES E MUDAS","MATERIAL","8720","FERTILIZANTES"]
[null,"MATERIAL","87","FORRAGENS FERTILIZANTES SEMENTES E MUDAS","MATERIAL","8730","SEMENTES E VIVEIROS PARA PLANTAS"]
[null,"MATERIAL","87","FORRAGENS FERTILIZANTES SEMENTES E MUDAS","MATERIAL","8740","AGROTOXICOS"]
[null,"MATERIAL","87","FORRAGENS FERTILIZANTES SEMENTES E MUDAS","MATERIAL","8750","INOCULANTES"]
[null,"MATERIAL","88","ANIMAIS VIVOS E MATERIAIS GENETICOS","MATERIAL","8810","ANIMAIS VIVOS DE CORTE E DE ABATE"]
[null,"MATERIAL","88","ANIMAIS VIVOS E MATERIAIS GENETICOS","MATERIAL","8820","ANIMAIS DE TRACAO POLICIAMENTO REPRODUCAO ESTUDOS"]
[null,"MATERIAL","88","ANIMAIS VIVOS E MATERIAIS GENETICOS","MATERIAL","8830","MATERIAIS GENETICOS"]
[null,"MATERIAL","89","GENEROS ALIMENTICIOS E BEBIDAS","MATERIAL","8905","CARNES AVES ABATIDAS E PEIXES"]
[null,"MATERIAL","89","GENEROS ALIMENTICIOS E BEBIDAS","MATERIAL","8910","OVOS E LATICINIOS"]
[null,"MATERIAL","89","GENEROS ALIMENTICIOS E BEBIDAS","MATERIAL","8915","SEMENTES E CEREAIS BENEFICIADOS FRUTAS LEGUMES E HORTALICAS"]
[null,"MATERIAL","89","GENEROS ALIMENTICIOS E BEBIDAS","MATERIAL","8920","FARINHAS E PRODUTOS DE PANIFICACAO"]
[null,"MATERIAL","89","GENEROS ALIMENTICIOS E BEBIDAS","MATERIAL","8925","ACUCAR E PRODUTOS DE CONFEITARIA"]
[null,"MATERIAL","89","GENEROS ALIMENTICIOS E BEBIDAS","MATERIAL","8930","DOCES GELEIAS E COMPOTAS"]
[null,"MATERIAL","89","GENEROS ALIMENTICIOS E BEBIDAS","MATERIAL","8935","SOPAS E CALDOS"]
[null,"MATERIAL","89","GENEROS ALIMENTICIOS E BEBIDAS","MATERIAL","8940","ALIMENTOS PREPARADOS E ALIMENTOS DIETETICOS"]
[null,"MATERIAL","89","GENEROS ALIMENTICIOS E BEBIDAS","MATERIAL","8945","OLEOS E GORDURAS COMESTIVEIS"]
[null,"MATERIAL","89","GENEROS ALIMENTICIOS E BEBIDAS","MATERIAL","8950","CONDIMENTOS E PRODUTOS CORRELATOS"]
[null,"MATERIAL","89","GENEROS ALIMENTICIOS E BEBIDAS","MATERIAL","8955","PRODUTOS E PREPARADOS SOLUVEIS"]
[null,"MATERIAL","89","GENEROS ALIMENTICIOS E BEBIDAS","MATERIAL","8960","BEBIDAS NAO ALCOOLICAS"]
[null,"MATERIAL","89","GENEROS ALIMENTICIOS E BEBIDAS","MATERIAL","8965","BEBIDAS ALCOOLICAS"]
[null,"MATERIAL","89","GENEROS ALIMENTICIOS E BEBIDAS","MATERIAL","8970","RACAO OPERACIONAL DE EMERGENCIA"]
[null,"MATERIAL","89","GENEROS ALIMENTICIOS E BEBIDAS","MATERIAL","8975","SORVETES SUCOS REFRESCOS E BEBIDAS LACTEAS"]
[null,"MATERIAL","89","GENEROS ALIMENTICIOS E BEBIDAS","MATERIAL","8980","PRODUTOS ALIMENTICIOS DE DISTRIBUICAO GRATUITA  "]
[null,"MATERIAL","89","GENEROS ALIMENTICIOS E BEBIDAS","MATERIAL","8990","DIETAS ENTERAIS SUPLEMENTOS E MODULOS NUTRICIONAIS   "]
[null,"MATERIAL","91","COMBUSTIVEIS LUBRIFICANTES OLEOS GRAXAS E CERAS","MATERIAL","9110","COMBUSTIVEIS SOLIDOS"]
[null,"MATERIAL","91","COMBUSTIVEIS LUBRIFICANTES OLEOS GRAXAS E CERAS","MATERIAL","9130","COMBUSTIVEIS LIQUIDOS E GASOSOS"]
[null,"MATERIAL","91","COMBUSTIVEIS LUBRIFICANTES OLEOS GRAXAS E CERAS","MATERIAL","9135","COMBUSTIVEIS PROPELENTES LIQUIDOS E OXIGENADORES"]
[null,"MATERIAL","91","COMBUSTIVEIS LUBRIFICANTES OLEOS GRAXAS E CERAS","MATERIAL","9140","OLEOS COMBUSTIVEIS"]
[null,"MATERIAL","91","COMBUSTIVEIS LUBRIFICANTES OLEOS GRAXAS E CERAS","MATERIAL","9150","OLEOS E GRAXAS PARA CORTE LUBRIFICACAO E SISTEMA HIDRAULICO"]
[null,"MATERIAL","91","COMBUSTIVEIS LUBRIFICANTES OLEOS GRAXAS E CERAS","MATERIAL","9160","CERAS OLEOS E GORDURAS DIVERSAS"]
[null,"MATERIAL","93","MATERIAIS MANUFATURADOS NAO METALICOS","MATERIAL","9310","PAPEL E PAPELAO"]
[null,"MATERIAL","93","MATERIAIS MANUFATURADOS NAO METALICOS","MATERIAL","9320","PRODUTOS ACABADOS DE BORRACHA"]
[null,"MATERIAL","93","MATERIAIS MANUFATURADOS NAO METALICOS","MATERIAL","9330","PRODUTOS ACABADOS DE PLASTICO"]
[null,"MATERIAL","93","MATERIAIS MANUFATURADOS NAO METALICOS","MATERIAL","9340","PRODUTOS ACABADOS DE VIDRO"]
[null,"MATERIAL","93","MATERIAIS MANUFATURADOS NAO METALICOS","MATERIAL","9350","PRODUTOS ACABADOS DE REFRATARIOS"]
[null,"MATERIAL","93","MATERIAIS MANUFATURADOS NAO METALICOS","MATERIAL","9390","MATERIAIS DIVERSOS NAO METALICOS ACABADOS"]
[null,"MATERIAL","94","MATERIAS PRIMAS NAO METALICAS","MATERIAL","9420","FIBRAS VEGETAIS ANIMAIS E SINTETICAS"]
[null,"MATERIAL","94","MATERIAS PRIMAS NAO METALICAS","MATERIAL","9440","MATERIA PRIMA DE ORIGEM MINERAL E SINTETICA"]
[null,"MATERIAL","95","ARAMES LAMINADOS PLANOS E PERFILADOS METALICOS","MATERIAL","9505","ARAMES DE ACO"]
[null,"MATERIAL","95","ARAMES LAMINADOS PLANOS E PERFILADOS METALICOS","MATERIAL","9510","BARRAS DE ACO/FERRO"]
[null,"MATERIAL","95","ARAMES LAMINADOS PLANOS E PERFILADOS METALICOS","MATERIAL","9515","FOLHAS CHAPAS E TIRAS DE ACO/FERRO"]
[null,"MATERIAL","95","ARAMES LAMINADOS PLANOS E PERFILADOS METALICOS","MATERIAL","9520","PERFIS ESTRUTURAIS DE ACO/FERRO"]
[null,"MATERIAL","95","ARAMES LAMINADOS PLANOS E PERFILADOS METALICOS","MATERIAL","9530","BARRAS/PERFIS/VERGALHOES DE METAIS NAO FERROSOS"]
[null,"MATERIAL","95","ARAMES LAMINADOS PLANOS E PERFILADOS METALICOS","MATERIAL","9535","FOLHAS CHAPAS E TIRAS DE METAIS NAO FERROSOS"]
[null,"MATERIAL","95","ARAMES LAMINADOS PLANOS E PERFILADOS METALICOS","MATERIAL","9540","PERFIS ESTRUTURAIS DE METAIS NAO FERROSOS"]
[null,"MATERIAL","96","MINERIOS MINERAIS E SEUS PRODUTOS PRIMARIOS SEMIACABADOS","MATERIAL","9620","MINERAIS NATURAIS E SINTETICOS"]
[null,"MATERIAL","96","MINERIOS MINERAIS E SEUS PRODUTOS PRIMARIOS SEMIACABADOS","MATERIAL","9640","PRODUTOS PRIMARIOS E SEMIACABADOS DE FERRO E DE ACO"]
[null,"MATERIAL","96","MINERIOS MINERAIS E SEUS PRODUTOS PRIMARIOS SEMIACABADOS","MATERIAL","9650","PRODUTOS PRIMARIOS E SEMIACABADOS DE METAIS NAO FERROSOS"]
[null,"MATERIAL","96","MINERIOS MINERAIS E SEUS PRODUTOS PRIMARIOS SEMIACABADOS","MATERIAL","9670","SUCATA DE FERRO E DE ACO"]
[null,"MATERIAL","96","MINERIOS MINERAIS E SEUS PRODUTOS PRIMARIOS SEMIACABADOS","MATERIAL","9680","SUCATA DE METAIS NAO FERROSOS"]
[null,"MATERIAL","98","MATERIAIS PARA EXECUCAO DE OBRAS","MATERIAL","9810","MATERIAL A GRANEL DE ORIGEM MINERAL"]
[null,"MATERIAL","98","MATERIAIS PARA EXECUCAO DE OBRAS","MATERIAL","9815","MATERIAL DIMENSIONADO NAO METALICO"]
[null,"MATERIAL","98","MATERIAIS PARA EXECUCAO DE OBRAS","MATERIAL","9820","TUBOS CONDUTOS E CORRELATOS E CONEXOES  METALICOS E NAO METALICOS"]
[null,"MATERIAL","98","MATERIAIS PARA EXECUCAO DE OBRAS","MATERIAL","9825","TINTAS SECANTES ADESIVOS E PRODUTOS CORRELATOS"]
[null,"MATERIAL","98","MATERIAIS PARA EXECUCAO DE OBRAS","MATERIAL","9835","MATERIAL PARA COBERTURA"]
[null,"MATERIAL","98","MATERIAIS PARA EXECUCAO DE OBRAS","MATERIAL","9840","CERCAS TELAS ARAMES E PORTOES"]
[null,"MATERIAL","98","MATERIAIS PARA EXECUCAO DE OBRAS","MATERIAL","9845","FERRAGENS E PRODUTOS METALICOS E PERFILADOS"]
[null,"MATERIAL","98","MATERIAIS PARA EXECUCAO DE OBRAS","MATERIAL","9850","MADEIRAS ESQUADRIAS E FOLHEADOS"]
[null,"MATERIAL","98","MATERIAIS PARA EXECUCAO DE OBRAS","MATERIAL","9855","MATERIAIS PARA INSTALACOES INCORPORAVEIS A OBRAS"]
[null,"MATERIAL","98","MATERIAIS PARA EXECUCAO DE OBRAS","MATERIAL","9860","MATERIAIS DIVERSOS PARA OBRAS"]
[null,"MATERIAL","99","MATERIAIS DIVERSOS","MATERIAL","9905","LETREIROS MOSTRUARIOS DISPOSITIVOS DE AVISOS E CHAPAS DE IDENTIFICACAO"]
[null,"MATERIAL","99","MATERIAIS DIVERSOS","MATERIAL","9906","MATERIAIS PROMOCIONAIS"]
[null,"MATERIAL","99","MATERIAIS DIVERSOS","MATERIAL","9910","ACESSORIOS E PECAS PARA ARTESANATO E BIJUTERIA"]
[null,"MATERIAL","99","MATERIAIS DIVERSOS","MATERIAL","9915","PECAS PARA ACERVO E OBRAS DE ARTE   ITENS COLECIONADORES"]
[null,"MATERIAL","99","MATERIAIS DIVERSOS","MATERIAL","9920","ARTIGOS PARA FUMANTES E PRODUTOS DE TABACO (FUMO)"]
[null,"MATERIAL","99","MATERIAIS DIVERSOS","MATERIAL","9925","EQUIPAMENTOS MOBILIARIOS E SUPRIMENTOS ECLESIASTICOS"]
[null,"MATERIAL","99","MATERIAIS DIVERSOS","MATERIAL","9935","MATERIAIS DIVERSOS PARA ALIENACAO"]
[null,"MATERIAL","99","MATERIAIS DIVERSOS","MATERIAL","9940","MATERIAL PARA CONSERVACAO E RESTAURACAO"]
[null,"MATERIAL","99","MATERIAIS DIVERSOS","MATERIAL","9998","PATRIMONIO ANTIGO   MATERIAIS NAO CLASSIFICADOS             EM OUTROS GRUPOS"]
[null,"MATERIAL","99","MATERIAIS DIVERSOS","MATERIAL","9999","ITENS DIVERSOS"]
[null,"SERVICO","07","SERVICO DE MANUTENCAO REPAROS E ADAPTACOES EM EQUIPAMENTOSMAQUINAS APARELHOS FERRAMENTAS E INSTRUMENTAL","SERVICO","0710","MANUTENCAO E REPAROS EM APARELHOS EQUIPAMENTOS E UTENSILIOSDE COPA E COZINHA"]
[null,"SERVICO","08","LOCACOES","SERVICO","0802","SERVICO DE LOCACAO DE EQUIPAMENTOS MAQUINAS APARELHOS INSTRUMENTAL FERRAMENTAL MATERIAL E INSTALACOES"]
[null,"SERVICO","09","ADMINISTRACAO GERAL","SERVICO","0916","SOFTWARES"]
[null,"SERVICO","1.","SERVICOS DE ESTUDOS E PROJETOS","SERVICO","0101","SERVICOS TECNICOS ESTUDOS E PROJETOS"]
[null,"SERVICO","2.","SERVICOS TECNICOS ESPECIALIZADOS NA AREA DE CONSTRUCAO CIVIL","SERVICO","0201","ESTUDOS E PROJETOS PARA OBRAS E INSTALACOES"]
[null,"SERVICO","3.","OBRAS CIVIS ADAPTACOES REPAROS E MONTAGENS","SERVICO","0301","SERVICOS DE DEMOLICOES ADAPTACAO E REPAROS DE BENS IMOVEIS"]
[null,"SERVICO","3.","OBRAS CIVIS ADAPTACOES REPAROS E MONTAGENS","SERVICO","0302","INSTALACOES INCORPORAVEIS A OBRAS"]
[null,"SERVICO","3.","OBRAS CIVIS ADAPTACOES REPAROS E MONTAGENS","SERVICO","0303","SERVICOS DE EXECUCAO DE OBRAS DIRETAS"]
[null,"SERVICO","3.","OBRAS CIVIS ADAPTACOES REPAROS E MONTAGENS","SERVICO","0304","SERVICOS DE EXECUCAO DE OBRAS POR CONTRATO"]
[null,"SERVICO","3.","OBRAS CIVIS ADAPTACOES REPAROS E MONTAGENS","SERVICO","0305","OUTRAS ATIVIDADES NECESSARIAS DE OBRAS E INSTALACOES POR CONTRATO"]
[null,"SERVICO","3.","OBRAS CIVIS ADAPTACOES REPAROS E MONTAGENS","SERVICO","0306","AQUISICAO DE IMOVEIS NECESSARIOS A REALIZACAO DE OBRAS"]
[null,"SERVICO","3.","OBRAS CIVIS ADAPTACOES REPAROS E MONTAGENS","SERVICO","0307","DESAPROPRIACOES DE IMOVEIS PARA OBRAS E INSTALACOES"]
[null,"SERVICO","4.","SERVICOS DE INSTALACOES E MONTAGENS","SERVICO","0401","SERVICOS DE ADMINISTRACAO DE EDIFICACOES"]
[null,"SERVICO","4.","SERVICOS DE INSTALACOES E MONTAGENS","SERVICO","0402","SERVICOS DE INSTALACAO E MONTAGEM  DE  EQUIPAMENTOS  ACESSORIOS COMPONENTES E BENS DE SERVICOS"]
[null,"SERVICO","5.","SERVICOS DE TECNOLOGIA DA INFORMACAO E COMUNICACAO   TIC","SERVICO","0501","DATACENTER"]
[null,"SERVICO","5.","SERVICOS DE TECNOLOGIA DA INFORMACAO E COMUNICACAO   TIC","SERVICO","0502","SISTEMAS DE INFORMACAO"]
[null,"SERVICO","5.","SERVICOS DE TECNOLOGIA DA INFORMACAO E COMUNICACAO   TIC","SERVICO","0503","ARMAZEM DE INFORMACAO"]
[null,"SERVICO","5.","SERVICOS DE TECNOLOGIA DA INFORMACAO E COMUNICACAO   TIC","SERVICO","0504","SERVICOS DE INFRAESTRUTURA"]
[null,"SERVICO","5.","SERVICOS DE TECNOLOGIA DA INFORMACAO E COMUNICACAO   TIC","SERVICO","0505","SERVICOS DE REDE"]
[null,"SERVICO","5.","SERVICOS DE TECNOLOGIA DA INFORMACAO E COMUNICACAO   TIC","SERVICO","0506","CERTIFICACAO DIGITAL"]
[null,"SERVICO","5.","SERVICOS DE TECNOLOGIA DA INFORMACAO E COMUNICACAO   TIC","SERVICO","0507","GESTAO DE CONTEUDO"]
[null,"SERVICO","5.","SERVICOS DE TECNOLOGIA DA INFORMACAO E COMUNICACAO   TIC","SERVICO","0508","BUSINESS INTELLIGENCE"]
[null,"SERVICO","5.","SERVICOS DE TECNOLOGIA DA INFORMACAO E COMUNICACAO   TIC","SERVICO","0510","DESENVOLVIMENTO DE SOLUCAO DE EDUCACAO A DISTANCIA"]
[null,"SERVICO","5.","SERVICOS DE TECNOLOGIA DA INFORMACAO E COMUNICACAO   TIC","SERVICO","0511","SOLUCOES CORPORATIVAS"]
[null,"SERVICO","6.","TRANSPORTE","SERVICO","0601","SERVICO DE FORNECIMENTO DE PASSAGEM"]
[null,"SERVICO","6.","TRANSPORTE","SERVICO","0602","SERVICO TRANSPORTE E ACONDICIONAMENTO DE MATERIAIS E ANIMAIS"]
[null,"SERVICO","6.","TRANSPORTE","SERVICO","0603","FORNECIMENTO DE COMBUSTIVEL E LUBRIFICANTE"]
[null,"SERVICO","6.","TRANSPORTE","SERVICO","0604","SERVICOS DE TRANSPORTES DE DOCUMENTOS DE BENS E DE VALORES"]
[null,"SERVICO","6.","TRANSPORTE","SERVICO","0605","OUTROS SERVICOS COM TRANSPORTE/DESLOCAMENTOS"]
[null,"SERVICO","7.","SERVICO DE MANUTENCAO REPAROS E ADAPTACOES EM EQUIPAMENTOSMAQUINAS APARELHOS FERRAMENTAS E INSTRUMENTAL","SERVICO","0701","MANUTENCAO REPAROS E ADAPTACOES EM EQUIPAMENTOS INSTRUMEN TOS MEDICOS ODONTOLOGICOS E HOSPITALARES"]
[null,"SERVICO","7.","SERVICO DE MANUTENCAO REPAROS E ADAPTACOES EM EQUIPAMENTOSMAQUINAS APARELHOS FERRAMENTAS E INSTRUMENTAL","SERVICO","0702","MANUTENCAO E REPAROS EM EQUIPAMENTOS E UTENSILIOS DE ESCRITORIO"]
[null,"SERVICO","7.","SERVICO DE MANUTENCAO REPAROS E ADAPTACOES EM EQUIPAMENTOSMAQUINAS APARELHOS FERRAMENTAS E INSTRUMENTAL","SERVICO","0703","MANUTENCAO E REPAROS EM EQUIPAMENTOS DE COMUNICACAO E TELECOMUNICACAO"]
[null,"SERVICO","7.","SERVICO DE MANUTENCAO REPAROS E ADAPTACOES EM EQUIPAMENTOSMAQUINAS APARELHOS FERRAMENTAS E INSTRUMENTAL","SERVICO","0704","MANUTENCAO E REPAROS EM EQUIPAMENTOS DE SOM VIDEO FOTOGRA FICOS CINEMATOGRAFICOS E DE ILUMINACAO"]
[null,"SERVICO","7.","SERVICO DE MANUTENCAO REPAROS E ADAPTACOES EM EQUIPAMENTOSMAQUINAS APARELHOS FERRAMENTAS E INSTRUMENTAL","SERVICO","0705","MANUTENCAO REPAROS E ADAPTACOES EM VEICULOS AUTOMOTORES"]
[null,"SERVICO","7.","SERVICO DE MANUTENCAO REPAROS E ADAPTACOES EM EQUIPAMENTOSMAQUINAS APARELHOS FERRAMENTAS E INSTRUMENTAL","SERVICO","0706","MANUTENCAO E REPAROS EM EQUIPAMENTOS DE LABORATORIO E EQUIPAMENTOS E INSTRUMENSTOS DE ENSAIO E MEDICAO"]
[null,"SERVICO","7.","SERVICO DE MANUTENCAO REPAROS E ADAPTACOES EM EQUIPAMENTOSMAQUINAS APARELHOS FERRAMENTAS E INSTRUMENTAL","SERVICO","0707","MANUTENCAO E REPAROS EM EQUIPAMENTOS DE REFRIGERACAO E CONDICIONAMENTO DE AR"]
[null,"SERVICO","7.","SERVICO DE MANUTENCAO REPAROS E ADAPTACOES EM EQUIPAMENTOSMAQUINAS APARELHOS FERRAMENTAS E INSTRUMENTAL","SERVICO","0708","MANUTENCAO E REPAROS EM EQUIPAMENTOS PARA CONSTRUCAO MINERACAO ESCAVACAO E CONSERVACAO DE ESTRADAS"]
[null,"SERVICO","7.","SERVICO DE MANUTENCAO REPAROS E ADAPTACOES EM EQUIPAMENTOSMAQUINAS APARELHOS FERRAMENTAS E INSTRUMENTAL","SERVICO","0709","MANUTENCAO E REPAROS EM VIATURAS EQUIPAMENTOS PARA MOVIMEN TACAO DE MATERIAL"]
[null,"SERVICO","7.","SERVICO DE MANUTENCAO REPAROS E ADAPTACOES EM EQUIPAMENTOSMAQUINAS APARELHOS FERRAMENTAS E INSTRUMENTAL","SERVICO","0710","MANUTENCAO E REPAROS EM APARELHOS EQUIPAMENTOS E UTENSILIOSDE COPA E COZINHA"]
[null,"SERVICO","7.","SERVICO DE MANUTENCAO REPAROS E ADAPTACOES EM EQUIPAMENTOSMAQUINAS APARELHOS FERRAMENTAS E INSTRUMENTAL","SERVICO","0711","MANUTENCAO E REPAROS EM EQUIPAMENTOS E APARELHOS DE TRANSMISSAO/CONTROLE/GERACAO DE ENERGIA"]
[null,"SERVICO","7.","SERVICO DE MANUTENCAO REPAROS E ADAPTACOES EM EQUIPAMENTOSMAQUINAS APARELHOS FERRAMENTAS E INSTRUMENTAL","SERVICO","0712","MANUTENCAO E REPAROS EM EQUIPAMENTOS ESPECIALIZADOS PARA MA NUTECAO E REPAROS"]
[null,"SERVICO","7.","SERVICO DE MANUTENCAO REPAROS E ADAPTACOES EM EQUIPAMENTOSMAQUINAS APARELHOS FERRAMENTAS E INSTRUMENTAL","SERVICO","0713","MANUTECAO E REPAROS EM EQUIPAMENTOS DE PROCESSAMENTO DE DA  DOS"]
[null,"SERVICO","7.","SERVICO DE MANUTENCAO REPAROS E ADAPTACOES EM EQUIPAMENTOSMAQUINAS APARELHOS FERRAMENTAS E INSTRUMENTAL","SERVICO","0714","MANUTENCAO E REPAROS EM EQUIPAMENTOS DE SEGURANCA/PROTECAO  DE EDIFICACOES INDUSTRIAL E PESSOAL"]
[null,"SERVICO","7.","SERVICO DE MANUTENCAO REPAROS E ADAPTACOES EM EQUIPAMENTOSMAQUINAS APARELHOS FERRAMENTAS E INSTRUMENTAL","SERVICO","0715","MANUTENCAO E REPAROS EM INSTALACOES PREDIAIS"]
[null,"SERVICO","7.","SERVICO DE MANUTENCAO REPAROS E ADAPTACOES EM EQUIPAMENTOSMAQUINAS APARELHOS FERRAMENTAS E INSTRUMENTAL","SERVICO","0716","MANUTENCAO E REPAROS EM EQUIPAMENTOS AUDIO VISUAIS"]
[null,"SERVICO","7.","SERVICO DE MANUTENCAO REPAROS E ADAPTACOES EM EQUIPAMENTOSMAQUINAS APARELHOS FERRAMENTAS E INSTRUMENTAL","SERVICO","0717","MANUTENCAO E REPAROS EM MOBILIARIO EM GERAL"]
[null,"SERVICO","7.","SERVICO DE MANUTENCAO REPAROS E ADAPTACOES EM EQUIPAMENTOSMAQUINAS APARELHOS FERRAMENTAS E INSTRUMENTAL","SERVICO","0718","MANUTENCAO E REPAROS EM EQUIPAMENTOS DE AUTOMACAO ARMAZEM DEPOSITO"]
[null,"SERVICO","7.","SERVICO DE MANUTENCAO REPAROS E ADAPTACOES EM EQUIPAMENTOSMAQUINAS APARELHOS FERRAMENTAS E INSTRUMENTAL","SERVICO","0719","MANUTENCAO E REPAROS EM MAQUINARIA E EQUIPAMENTOS AGRICOLAS"]
[null,"SERVICO","7.","SERVICO DE MANUTENCAO REPAROS E ADAPTACOES EM EQUIPAMENTOSMAQUINAS APARELHOS FERRAMENTAS E INSTRUMENTAL","SERVICO","0720","MANUTENCAO E REPARO EM RECIPIENTES PARA GASES E SISTEMAS CENTRALIZADOS DE GASES"]
[null,"SERVICO","7.","SERVICO DE MANUTENCAO REPAROS E ADAPTACOES EM EQUIPAMENTOSMAQUINAS APARELHOS FERRAMENTAS E INSTRUMENTAL","SERVICO","0721","MANUTENCAO E REPAROS EM SISTEMAS/EQUIPAMENTOS COMERCIAIS INDUSTRIAIS E DE SERVICOS"]
[null,"SERVICO","7.","SERVICO DE MANUTENCAO REPAROS E ADAPTACOES EM EQUIPAMENTOSMAQUINAS APARELHOS FERRAMENTAS E INSTRUMENTAL","SERVICO","0722","MANUTENCAO E REPAROS EM EQUIPAMENTOS PARA LIMPEZA"]
[null,"SERVICO","7.","SERVICO DE MANUTENCAO REPAROS E ADAPTACOES EM EQUIPAMENTOSMAQUINAS APARELHOS FERRAMENTAS E INSTRUMENTAL","SERVICO","0723","MANUTENCAO E REPARO EM FERRAMENTAS DO GRUPO DE MATERIAL     51 (FERRAMENTAS MANUAIS E COMPONENTES)"]
[null,"SERVICO","7.","SERVICO DE MANUTENCAO REPAROS E ADAPTACOES EM EQUIPAMENTOSMAQUINAS APARELHOS FERRAMENTAS E INSTRUMENTAL","SERVICO","0724","MANUTENCAO E REPAROS EM AERONAVES COMPONENTES E ACESSORIOS"]
[null,"SERVICO","7.","SERVICO DE MANUTENCAO REPAROS E ADAPTACOES EM EQUIPAMENTOSMAQUINAS APARELHOS FERRAMENTAS E INSTRUMENTAL","SERVICO","0725","MANUTENCAO E REPAROS EM MAQUINAS E EQUIPAMENTOS P/ INDUSTRI A ESPECIALIZADA"]
[null,"SERVICO","7.","SERVICO DE MANUTENCAO REPAROS E ADAPTACOES EM EQUIPAMENTOSMAQUINAS APARELHOS FERRAMENTAS E INSTRUMENTAL","SERVICO","0726","MANUTENCAO E REPARO EM EQUIPAMENTOS PARA PURIFICACAO E TRATAMENTO DE AGUA E TRATAMENTO DE ESGOTOS"]
[null,"SERVICO","7.","SERVICO DE MANUTENCAO REPAROS E ADAPTACOES EM EQUIPAMENTOSMAQUINAS APARELHOS FERRAMENTAS E INSTRUMENTAL","SERVICO","0728","MANUTENCAO E REPAROS EM EQUIPAMENTOS E SISTEMAS DE SINALIZA CAO E ALARME"]
[null,"SERVICO","7.","SERVICO DE MANUTENCAO REPAROS E ADAPTACOES EM EQUIPAMENTOSMAQUINAS APARELHOS FERRAMENTAS E INSTRUMENTAL","SERVICO","0729","MANUTENCAO ADAPTACOES E REPAROS EM EQUIPAMENTOS PARA RECRE ACAO ATLETISMO DESPORTO E CIVICO"]
[null,"SERVICO","7.","SERVICO DE MANUTENCAO REPAROS E ADAPTACOES EM EQUIPAMENTOSMAQUINAS APARELHOS FERRAMENTAS E INSTRUMENTAL","SERVICO","0730","MANUTENCAO E REPARO DE ESTRUTURA COBERTA DE LONA POLIESTER OU OUTROS MATERIAIS"]
[null,"SERVICO","7.","SERVICO DE MANUTENCAO REPAROS E ADAPTACOES EM EQUIPAMENTOSMAQUINAS APARELHOS FERRAMENTAS E INSTRUMENTAL","SERVICO","0731","MANUTENCAO REPAROS E E ADAPTACOES EM ARMAMENTOS"]
[null,"SERVICO","7.","SERVICO DE MANUTENCAO REPAROS E ADAPTACOES EM EQUIPAMENTOSMAQUINAS APARELHOS FERRAMENTAS E INSTRUMENTAL","SERVICO","0732","MANUTENCAO REPAROS E ADAPTACOES EM EMBARCACOES COMPONENTES E ACESSORIOS"]
[null,"SERVICO","7.","SERVICO DE MANUTENCAO REPAROS E ADAPTACOES EM EQUIPAMENTOSMAQUINAS APARELHOS FERRAMENTAS E INSTRUMENTAL","SERVICO","0733","MANUTENCAO E REPAROS EM PNEUS E CAMARAS DE AR"]
[null,"SERVICO","7.","SERVICO DE MANUTENCAO REPAROS E ADAPTACOES EM EQUIPAMENTOSMAQUINAS APARELHOS FERRAMENTAS E INSTRUMENTAL","SERVICO","0734","RECUPERACAO E RECONDICIONAMENTO DE PECAS DE VEICULOS        AUTOMOTORES"]
[null,"SERVICO","7.","SERVICO DE MANUTENCAO REPAROS E ADAPTACOES EM EQUIPAMENTOSMAQUINAS APARELHOS FERRAMENTAS E INSTRUMENTAL","SERVICO","0735","SERVICOS DE RECUPERACAO E RECONDICIONAMENTO DE PECAS DE     EQUIPAMENTOS PARA INFORMATICA"]
[null,"SERVICO","7.","SERVICO DE MANUTENCAO REPAROS E ADAPTACOES EM EQUIPAMENTOSMAQUINAS APARELHOS FERRAMENTAS E INSTRUMENTAL","SERVICO","0736","SERVICOS DE RECUPERACAO E RECONDICIONAMENTO DE PECAS PARA   EQUIPAMENTOS DE INDUSTRIA GRAFICA"]
[null,"SERVICO","7.","SERVICO DE MANUTENCAO REPAROS E ADAPTACOES EM EQUIPAMENTOSMAQUINAS APARELHOS FERRAMENTAS E INSTRUMENTAL","SERVICO","0737","MANUTENCAO E REPARO EM EQUIPAMENTOS FERROVIARIOS"]
[null,"SERVICO","8.","LOCACOES","SERVICO","0801","SERVICOS DE LOCACAO DE IMOVEIS"]
[null,"SERVICO","8.","LOCACOES","SERVICO","0802","SERVICO DE LOCACAO DE EQUIPAMENTOS MAQUINAS APARELHOS INSTRUMENTAL FERRAMENTAL MATERIAL E INSTALACOES"]
[null,"SERVICO","8.","LOCACOES","SERVICO","0803","SERVICOS DE LOCACAO DE VEICULOS E AERONAVES"]
[null,"SERVICO","8.","LOCACOES","SERVICO","0804","SERVICOS DE LOCACAO DE APARELHOS EQUIPAMENTOS DE TELECOMUNICACAO E LINHAS"]
[null,"SERVICO","8.","LOCACOES","SERVICO","0805","SERVICOS DE LOCACAO DE MATERIAIS E EQUIPAMENTOS DE MIDIA"]
[null,"SERVICO","9.","ADMINISTRACAO GERAL","SERVICO","0901","SERVICOS DE APOIO ADMINISTRATIVO  CONSERVACAO  E LIMPEZA DE BENS MOVEIS E IMOVEIS E INSTALACOES"]
[null,"SERVICO","9.","ADMINISTRACAO GERAL","SERVICO","0902","SERVICOS PUBLICOS ESSENCIAIS TAIS  COMO  SEGUROS IMPOSTOS TAXAS TARIFAS E PREMIOS"]
[null,"SERVICO","9.","ADMINISTRACAO GERAL","SERVICO","0903","SERVICOS TECNICOS E SERVICOS ESPECIALIZADOS"]
[null,"SERVICO","9.","ADMINISTRACAO GERAL","SERVICO","0904","SERVICO DE PUBLICIDADE PUBLICACAO IMPRESSAO REPRODUCAO E ENCADERNACAO"]
[null,"SERVICO","9.","ADMINISTRACAO GERAL","SERVICO","0905","AQUISICAO E ASSINATURAS DE PERIODICOS"]
[null,"SERVICO","9.","ADMINISTRACAO GERAL","SERVICO","0906","SERVICOS DE HIGIENIZACAO E LIMPEZA"]
[null,"SERVICO","9.","ADMINISTRACAO GERAL","SERVICO","0907","SERVICOS DE TREINAMENTO E APERFEICOAMENTO PROFISSIONAL"]
[null,"SERVICO","9.","ADMINISTRACAO GERAL","SERVICO","0908","BENEFICIOS"]
[null,"SERVICO","9.","ADMINISTRACAO GERAL","SERVICO","0909","SERVICOS EVENTUAIS PRESTADOS POR PESSOA FISICA"]
[null,"SERVICO","9.","ADMINISTRACAO GERAL","SERVICO","0910","SERVICOS DE ENCARGOS E INDENIZACOES"]
[null,"SERVICO","9.","ADMINISTRACAO GERAL","SERVICO","0911","SERVICOS DE HOSPEDAGENS CURSOS PROMOCOES E EVENTOS"]
[null,"SERVICO","9.","ADMINISTRACAO GERAL","SERVICO","0912","SERV.ESPECIALIZADOS AREAS MEDICA ODONTOLOGICA REABILITACAOHOSPITALAR E DE LABORATORIO (EXAME ANALISE ENSAIO PESQUISA)"]
[null,"SERVICO","9.","ADMINISTRACAO GERAL","SERVICO","0913","SERVICOS PRESTADOS POR PESSOA JURIDICA  EM  CARATER EXCEPCIONAL"]
[null,"SERVICO","9.","ADMINISTRACAO GERAL","SERVICO","0914","SERVICOS ESPECIALIZADOS DE AUDITORIA CONSULTORIA E  ASSESSORIA"]
[null,"SERVICO","9.","ADMINISTRACAO GERAL","SERVICO","0915","SERVICOS PRESTADOS POR ESTAGIARIOS MONITORES E MEDICOS RESIDENTES"]
[null,"SERVICO","9.","ADMINISTRACAO GERAL","SERVICO","0916","SOFTWARES"]
[null,"SERVICO","9.","ADMINISTRACAO GERAL","SERVICO","0917","SERVICOS DE TECNOLOGIA DA INFORMACAO"]
[null,"SERVICO","9.","ADMINISTRACAO GERAL","SERVICO","0918","CONTRATACAO DE PESSOAL EM SUBSTITUICAO CONFORME DETERMINA A LEI COMPLEMENTAR FEDERAL 101/2000"]
[null,"SERVICO","9.","ADMINISTRACAO GERAL","SERVICO","0919","SERVICOS DE TELECOMUNICACOES"]
[null,"SERVICO","9.","ADMINISTRACAO GERAL","SERVICO","0920","OUTROS SERVICOS DE PESSOA JURIDICA"]
[null,"SERVICO","9.","ADMINISTRACAO GERAL","SERVICO","0921","SERVICOS PESSOA FISICA CONFORME CLASSIFICACAO              BRASILEIRA DE OCUPACOES"]
[null,"SERVICO","9.","ADMINISTRACAO GERAL","SERVICO","0922","SERVICOS PRESTADOS PELA MGS  "]
[null,"SERVICO","9.","ADMINISTRACAO GERAL","SERVICO","0950","ENCARGOS PREVIDENCIARIOS POR SERVICOS PRESTADOS  POR  PESSOAFISICA OU JURIDICA"]
[null,"SERVICO","9.","ADMINISTRACAO GERAL","SERVICO","0955","ENCARGOS FINANCEIROS POR SERVICOS PRESTADOS POR PESSOA FISI CA OU JURIDICA"]

{"sheet":"Plan2","index":1,"n_rows":907,"n_cols":2,"rows_kept":907,"cut":false,"hidden":true,"merged":[]}
[]
[]
[]
["Grupo Material/Serviço","Classe Material/Serviço"]
["ACESSORIOS DE MOTORES","ACESSORIOS DIVERSOS DE MOTORES DE AERONAVES"]
[null,"ACESSORIOS DIVERSOS DE MOTORES, EXCETO DE AERONAVES"]
[null,"COMPONENTES DE SISTEMA DE ARREFECIMENTO DE MOTORES, EXCETO  DE AERONAVES"]
[null,"COMPONENTES DE SISTEMA DE COMBUSTIVEL DE MOTORES, EXCETO DE  AERONAVES"]
[null,"COMPONENTES DO SISTEMA DE COMBUSTIVEL DE MOTORES DE AERONAVES"]
[null,"COMPONENTES DO SISTEMA ELETRICO DE MOTORES, EXCETO DE AERONAVES"]
[null,"PURIFICADORES E FILTROS DE AR E DE OLEO DE MOTORES DE AERONAVES"]
[null,"PURIFICADORES E FILTROS DE MOTORES, EXCETO DE AERONAVES"]
["ACESSORIOS DE MOTORES Total"]
["ADMINISTRACAO GERAL","AQUISICAO E ASSINATURAS DE PERIODICOS"]
[null,"BENEFICIOS"]
[null,"CONTRATACAO DE PESSOAL EM SUBSTITUICAO CONFORME DETERMINA A LEI COMPLEMENTAR FEDERAL 101/2000"]
[null,"ENCARGOS FINANCEIROS POR SERVICOS PRESTADOS POR PESSOA FISI CA OU JURIDICA"]
[null,"ENCARGOS PREVIDENCIARIOS POR SERVICOS PRESTADOS  POR  PESSOAFISICA OU JURIDICA"]
[null,"OUTROS SERVICOS DE PESSOA JURIDICA"]
[null,"SERV.ESPECIALIZADOS AREAS MEDICA, ODONTOLOGICA, REABILITACAO,HOSPITALAR E DE LABORATORIO (EXAME-ANALISE-ENSAIO-PESQUISA)"]
[null,"SERVICO DE PUBLICIDADE, PUBLICACAO, IMPRESSAO, REPRODUCAO E ENCADERNACAO"]
[null,"SERVICOS DE APOIO ADMINISTRATIVO,  CONSERVACAO  E LIMPEZA DE BENS MOVEIS E IMOVEIS E INSTALACOES"]
[null,"SERVICOS DE ENCARGOS E INDENIZACOES"]
[null,"SERVICOS DE HIGIENIZACAO E LIMPEZA"]
[null,"SERVICOS DE HOSPEDAGENS, CURSOS, PROMOCOES E EVENTOS"]
[null,"SERVICOS DE TECNOLOGIA DA INFORMACAO"]
[null,"SERVICOS DE TELECOMUNICACOES"]
[null,"SERVICOS DE TREINAMENTO E APERFEICOAMENTO PROFISSIONAL"]
[null,"SERVICOS ESPECIALIZADOS DE AUDITORIA, CONSULTORIA E  ASSESSORIA"]
[null,"SERVICOS EVENTUAIS PRESTADOS POR PESSOA FISICA"]
[null,"SERVICOS PESSOA FISICA, CONFORME CLASSIFICACAO              BRASILEIRA DE OCUPACOES"]
[null,"SERVICOS PRESTADOS PELA MGS -"]
[null,"SERVICOS PRESTADOS POR ESTAGIARIOS, MONITORES E MEDICOS RESIDENTES"]
[null,"SERVICOS PRESTADOS POR PESSOA JURIDICA  EM  CARATER EXCEPCIONAL"]
[null,"SERVICOS PUBLICOS ESSENCIAIS, TAIS  COMO  SEGUROS, IMPOSTOS, TAXAS, TARIFAS E PREMIOS"]
[null,"SERVICOS TECNICOS E SERVICOS ESPECIALIZADOS"]
[null,"SOFTWARES"]
["ADMINISTRACAO GERAL Total"]
["AERONAVES E COMPONENTES ESTRUTURAIS","AERONAVES"]
[null,"COMPONENTES ESTRUTURAIS DE AERONAVES -"]
["AERONAVES E COMPONENTES ESTRUTURAIS Total"]
["ANIMAIS VIVOS E MATERIAIS GENETICOS"]
["APARELHOS E MEIOS AUXILIARES PARA TREINAMENTO"]
["APARELHOS E UTENSILIOS PARA MEDICAO E INSPECAO","APARELHOS E UTENSILIOS DE MEDICAO"]
[null,"CALIBRES DE INSPECAO"]
[null,"EQUIPAMENTO PARA INSPECAO"]
[null,"JOGOS E ESTOJOS DE APARELHOS E UTENSILIOS PARA MEDICAO E INSPECAO"]
["APARELHOS E UTENSILIOS PARA MEDICAO E INSPECAO Total"]
["ARAMES, LAMINADOS PLANOS E PERFILADOS METALICOS","ARAMES DE ACO"]
[null,"BARRAS DE ACO/FERRO"]
[null,"BARRAS/PERFIS/VERGALHOES DE METAIS NAO FERROSOS"]
[null,"FOLHAS, CHAPAS E TIRAS DE ACO/FERRO"]
[null,"FOLHAS, CHAPAS E TIRAS DE METAIS, NAO FERROSOS"]
[null,"PERFIS ESTRUTURAIS DE ACO/FERRO"]
[null,"PERFIS ESTRUTURAIS DE METAIS NAO FERROSOS"]
["ARAMES, LAMINADOS PLANOS E PERFILADOS METALICOS Total"]
["ARMAMENTO, COMPONENTES, EQUIPAMENTOS E APETRECHOS DE USO    POLICIAL","ARMAS DE FOGO"]
[null,"ARMAS DIVERSAS"]
[null,"EQUIPAMENTOS E APETRECHOS DE USO POLICIAL"]
[null,"FERRAMENTAS PARA ARMAMENTO"]
[null,"PECAS E COMPONENTES PARA ARMAS DE FOGO"]
[null,"PECAS E COMPONENTES PARA ARMAS DIVERSAS"]
["ARMAMENTO, COMPONENTES, EQUIPAMENTOS E APETRECHOS DE USO    POLICIAL Total"]
["ARTIGOS DE ESCRITORIO","ARTIGOS DE ESCRITORIO"]
[null,"COMPONENTES E PECAS PARA UTENSILIOS DE ESCRITORIO"]
[null,"FORMULARIOS (MODELOS) PADROES"]
[null,"PAPELARIA E FORMULARIOS, EXCETO FORMULARIOS PADRONIZADOS"]
[null,"UTENSILIOS DE ESCRITORIO"]
["ARTIGOS DE ESCRITORIO Total"]
["ARTIGOS DOMESTICOS E COMERCIAIS","CORTINAS, TOLDOS, PERSIANAS E COMPONENTES"]
[null,"EQUIPAMENTOS E ARTIGOS DOMESTICOS E COMERCIAIS, DIVERSOS"]
[null,"GUARNICOES DE USO DOMESTICO (ROUPAS DE CAMA, MESA, BANHO    ETC)"]
[null,"RECIPIENTES DE USO DOMESTICO E COMERCIAL"]
[null,"REVESTIMENTOS PARA PISOS"]
["ARTIGOS DOMESTICOS E COMERCIAIS Total"]
["ARTIGOS PARA TOUCADOR E HIGIENE PESSOAL","ARTIGOS DE USO INDIVIDUAL PARA TOUCADOR E HIGIENE PESSOAL"]
[null,"PREPARADOS PARA TOUCADOR E HIGIENE PESSOAL"]
[null,"PRODUTOS DE PAPEL PARA HIGIENE PESSOAL"]
[null,"PRODUTOS PARA HIGIENE PESSOAL"]
["ARTIGOS PARA TOUCADOR E HIGIENE PESSOAL Total"]
["BOMBAS E COMPRESSORES","BOMBAS MANUAIS, MECANICAS, ELETRONICAS E MOTO-BOMBAS"]
[null,"CENTRIFUGAS, SEPARADORES E FILTROS A PRESSAO E A VACUO"]
[null,"COMPONENTES E ACESSORIOS PARA BOMBAS E COMPRESSORES         PARA CONTRATOS DE MANUTENCAO PREVENTIVA/CORRETIVA"]
[null,"COMPONENTES E PECAS PARA BOMBAS E COMPRESSORES"]
[null,"COMPRESSOR, BOMBA DE VACUO E RESERVATORIO -"]
["BOMBAS E COMPRESSORES Total"]
["CABO FIBRA OPTICA","ACESSORIOS E ARTIGOS PARA FIBRA OPTICA"]
[null,"CABO PARA FIBRA OPTICA -"]
[null,"COMPONENTES, ACESSORIOS E ARTIGOS FIBRA OPTICA"]
[null,"EQUIPAMENTOS PARA FIBRA OPTICA -"]
[null,"INSTRUMENTOS DE TESTES FIBRA OPTICA"]
["CABO FIBRA OPTICA Total"]
["CABOS DE ACO, CORDAS, CORRENTES, CORDOALHAS E ACESSORIOS","ACESSORIOS PARA CORDAS, CABOS DE ACO E CORRENTES"]
[null,"CABOS DE ACO E CORRENTES"]
[null,"CABOS DE FIBRA, CORDOALHAS E BARBANTES"]
["CABOS DE ACO, CORDAS, CORRENTES, CORDOALHAS E ACESSORIOS Total"]
["COMBUSTIVEIS, LUBRIFICANTES, OLEOS, GRAXAS E CERAS","CERAS, OLEOS E GORDURAS DIVERSAS"]
[null,"COMBUSTIVEIS LIQUIDOS E GASOSOS"]
[null,"COMBUSTIVEIS PROPELENTES LIQUIDOS E OXIGENADORES"]
[null,"COMBUSTIVEIS SOLIDOS"]
[null,"OLEOS COMBUSTIVEIS"]
[null,"OLEOS E GRAXAS PARA CORTE, LUBRIFICACAO E SISTEMA HIDRAULICO"]
["COMBUSTIVEIS, LUBRIFICANTES, OLEOS, GRAXAS E CERAS Total"]
["COMPONENTES DE EQUIPAMENTOS ELETRICOS E ELETRONICOS","ANTENAS, GUIAS DE ONDAS E EQUIPAMENTOS CORRELATOS"]
[null,"BOBINAS E TRANSFORMADORES"]
[null,"CAPACITORES"]
[null,"CHAVES E INTERRUPTORES"]
[null,"COMPONENTES DIVERSOS, ELETRICOS E ELETRONICOS"]
[null,"CONECTORES ELETRICOS"]
[null,"CONJUNTOS ELETRICOS E ELETRONICOS PLACAS, CARTOES E  CORRELATOS"]
[null,"DISJUNTORES"]
[null,"DISPOSITIVOS A SEMICONDUTOR E PLACAS ASSOCIADAS (FOTOCELULA)"]
[null,"DISPOSITIVOS COM CIRCUITOS MICROELETRONICOS"]
[null,"DISPOSITIVOS OPTRONICOS E ITENS CORRELATOS"]
[null,"ESCOVA DE CONTATO ELETRICO E ELETRODOS"]
[null,"FERRAGENS E ACESSORIOS ELETRICOS"]
[null,"FILTROS E MALHAS DE FILTRO"]
[null,"FONES, MONOFONES, MICROFONES E ALTO-FALANTES"]
[null,"FUSIVEIS E PARA-RAIOS"]
[null,"ISOLANTES ELETRICOS E MATERIAL ISOLANTE"]
[null,"MODULOS ELETRONICOS"]
[null,"RELES, CONTACTORES E SOLENOIDES"]
[null,"RESISTORES"]
[null,"TERMINAIS TIPO ORELHA, JOGO DE TERMINAIS"]
[null,"VALVULAS ELETRONICAS E FERRAGENS ASSOCIADAS"]
["COMPONENTES DE EQUIPAMENTOS ELETRICOS E ELETRONICOS Total"]
["COMPONENTES E ACESSORIOS DE AERONAVES","COMPONENTES DE FIXACAO/VEDACAO E LUBRIFICACAO PARA AERONAVES"]
[null,"COMPONENTES DE SISTEMA DE FREIO E RODAS DE AERONAVES"]
[null,"COMPONENTES DE SISTEMA HIDRAULICO,DE VACUO E DEGELAMENTO DE AERONAVE"]
[null,"COMPONENTES DE TREM DE POUSO"]
[null,"COMPONENTES DO SISTEMA ELETRICO DE AERONAVES"]
[null,"COMPONENTES DOS SISTEMAS DE CONDICIONAMENTO DE AR, AQUECIMENTO E PRESSURIZACAO DE AERONAVE"]
[null,"COMPONENTES E ACESSORIOS DIVERSOS DE AERONAVES"]
[null,"COMPONENTES E ACESSORIOS PARA AERONAVES PARA CONTRATACAO    MEDIANTE FORNECIMENTO PARCELADO"]
[null,"COMPONENTES PARA SISTEMA DE EXTINCAO DE FOGO DE AERONAVES -"]
[null,"COMPONENTES PARA SISTEMA DE TRANSMISSAO DE AERONAVES -"]
[null,"EQUIPAMENTOS PARA REPARO E MANUTENCAO EM AERONAVE -"]
[null,"EQUIPAMENTOS,PECAS,COMPONENTES E ACESSORIOS PARA VANT -"]
[null,"HELICES DE AERONAVES E COMPONENTES"]
[null,"INSTRUMENTOS PARA AERONAVES (AVIONICOS)"]
[null,"MOTORES DE AERONAVES E COMPONENTES"]
[null,"PARA-QUEDAS,EQUIPAMENTO PARA COLETA,LANCAMENTO/ACONDICIONAMENTO CARGA AEREA"]
[null,"ROTORES DE AERONAVES E COMPONENTES -"]
[null,"TINTAS, VERNIZES E MATERIAIS CORRELATOS PARA AERONAVES"]
["COMPONENTES E ACESSORIOS DE AERONAVES Total"]
["COMPONENTES PARA VEICULOS","COMPONENTES DE RODAS E ESTEIRAS DE VEICULOS"]
[null,"COMPONENTES DIVERSOS E ACESSORIOS DE VEICULOS"]
[null,"COMPONENTES DO SISTEMA DE CAPOTARIA DE VEICULOS"]
[null,"COMPONENTES DO SISTEMA DE DIRECAO DE VEICULOS"]
[null,"COMPONENTES DO SISTEMA DE FREIO DE VEICULOS"]
[null,"COMPONENTES DO SISTEMA DE SUSPENSAO DE VEICULOS"]
[null,"COMPONENTES DO SISTEMA DE TRANSMISSAO DE FORCA DE VEICULOS"]
[null,"COMPONENTES DO SISTEMA ELETRICO DE VEICULOS"]
[null,"COMPONENTES E ACESSORIOS DE VEICULOS PARA CONTRATACAO MEDIANTE FORNECIMENTO PARCELADO"]
[null,"COMPONENTES ESTRUTURAIS (CHASSIS, CARROCERIA E CABINES E COMPONENTES) DE VEICULOS"]
[null,"COMPONENTES PARA VEICULOS ESPECIAIS"]
[null,"MATERIAL DE FIXACAO, VEDACAO E LUBRIFICACAO PARA  USO  VEICULAR"]
[null,"MOTORES AUTOMOTIVOS E COMPONENTES"]
[null,"PECAS E COMPONENTES VEICULARES"]
[null,"SISTEMA DE EIXO DE VEICULOS E COMPONENTES"]
[null,"TINTAS, VERNIZES E PRODUTOS CORRELATOS USO AUTOMOTIVO"]
["COMPONENTES PARA VEICULOS Total"]
["EMBARCACOES, PONTOES E DIQUES FLUTUANTES","EMBARCACOES PARA TRANSPORTE DE PASSAGEIROS"]
[null,"PEQUENAS EMBARCACOES"]
["EMBARCACOES, PONTOES E DIQUES FLUTUANTES Total"]
["EQUIPAMENTOS COMERCIAIS E DE SERVICOS","COMPONENTES E ACESSORIOS PARA EQUIPAMENTOS DE LAVANDERIA    PARA CONTRATOS DE MANUTENCAO CORRETIVA/PREVENTIVA"]
[null,"COMPONENTES E PECAS PARA EQUIPAMENTOS COMERCIAIS E DE       SERVICOS"]
[null,"EQUIPAMENTOS DE LAVANDERIA"]
[null,"EQUIPAMENTOS DIVERSOS, COMERCIAIS E DE SERVICOS"]
[null,"EQUIPAMENTOS E COMPONENTES PARA AUTOMACAO E CONTROLE"]
[null,"EQUIPAMENTOS PARA ACONDICIONAMENTO E EMBALAGEM"]
[null,"EQUIPAMENTOS PARA MANUFATURA E CONSERTO DE CALCADOS"]
[null,"MAQUINAS E EQUIPAMENTOS INDUSTRIAIS DE COSTURA"]
["EQUIPAMENTOS COMERCIAIS E DE SERVICOS Total"]
["EQUIPAMENTOS DE CALEFACAO, AQUECIMENTO E INSTALACOES SANITARIAS","APARELHOS HIDRAULICOS-SANITARIOS E ACESSORIOS"]
[null,"EQUIPAMENTOS DIVERSOS HIDRAULICOS, SANITARIOS E DE CALEFACAO"]
[null,"EQUIPAMENTOS P/ CALEFACAO DE AMBIENTES/AQUECEDORES DE AGUA, DOMESTICOS"]
[null,"EQUIPAMENTOS PARA QUEIMA DE COMBUSTIVEL"]
[null,"TANQUES E RESERVATORIOS DE AGUA E COMPONENTES"]
["EQUIPAMENTOS DE CALEFACAO, AQUECIMENTO E INSTALACOES SANITARIAS Total"]
["EQUIPAMENTOS DE COMUNICACOES","EQUIPAMENTO DE RADIACAO EMITIDA,REFLETIDA E VISAO NOTURNA"]
[null,"EQUIPAMENTOS DE COMUNICACAO DE RADIO E DE TELEVISAO"]
[null,"EQUIPAMENTOS DE COMUNICACAO,SEGURANCA E COMPONENTES -"]
[null,"EQUIPAMENTOS DE RADAR, EXCETO OS AEROTRANSPORTAVEIS"]
[null,"EQUIPAMENTOS DIVERSOS DE COMUNICACOES"]
[null,"EQUIPAMENTOS INTERCOMUNICADORES/SISTEMA ALTO-FALANTES,EXCETO AEROTRANSPORTAVEL"]
[null,"EQUIPAMENTOS PARA GRAVACAO E REPRODUCAO DE SOM"]
[null,"EQUIPAMENTOS PARA GRAVACAO E REPRODUCAO DE VIDEO"]
[null,"EQUIPAMENTOS TELEFONICOS E TELEGRAFICOS"]
[null,"PECA,ACESSORIO E COMPONENTE P/EQUIPAMENTO DE COMUNICACAO    - EXCETO INFORMATICA"]
[null,"TELEIMPRESSORAS E EQUIPAMENTOS FAC-SIMILES"]
["EQUIPAMENTOS DE COMUNICACOES Total"]
["EQUIPAMENTOS DE LABORATORIO E INSTRUMENTOS DE MEDICAO","CAMARAS AMBIENTAIS E EQUIPAMENTOS CORRELATOS"]
[null,"COMPONENTES E ACESSORIOS PARA EQUIPAMENTOS DE LABORATORIO   PARA CONTRATOS DE MANUTENCAO PREVENTIVA/CORRETIVA"]
[null,"COMPONENTES E ACESSORIOS PARA ESCALAS E BALANCAS"]
[null,"EQUIPAMENTOS DE LABORATORIO"]
[null,"EQUIPAMENTOS E ACESSORIOS PARA ENSAIO E VERIFICACAO DE PRO  PRIEDADES FISICAS"]
[null,"EQUIPAMENTOS E INSTRUMENTOS PARA ANALISE QUIMICA"]
[null,"ESCALAS E BALANCAS"]
[null,"INSTRUMENTOS COMBINADOS E INSTRUMENTOS DIVERSOS"]
[null,"INSTRUMENTOS DE LABORATORIO"]
[null,"INSTRUMENTOS DE NAVEGACAO"]
[null,"INSTRUMENTOS DE VERIFICACAO, ENSAIO E MEDICAO DE APARELHAGEM ELETRICA E ELETRONICA"]
[null,"INSTRUMENTOS DE VOO"]
[null,"INSTRUMENTOS E APARELHOS DE METEOROLOGIA"]
[null,"INSTRUMENTOS E APARELHOS PARA DETECCAO DE PERIGOS"]
[null,"INSTRUMENTOS OPTICOS"]
[null,"INSTRUMENTOS PARA CONTROLE E MEDICAO DE PRESSAO, TEMPERATURA E UMIDADE"]
[null,"INSTRUMENTOS PARA DESENHO, TOPOGRAFIA E CARTOGRAFIA"]
[null,"INSTRUMENTOS PARA MEDICAO DE TEMPO"]
[null,"INSTRUMENTOS PARA MEDICAO FLUXOS GAS/LIQUIDOS/NIVEL  E  MOVIMENTOS MECANICOS"]
[null,"PECAS E COMPONENTES P/INSTRUMENTOS DE VERIFICACAO,ENSAIO E MEDICAO DE ELETRICA E ELETRONICA"]
[null,"PECAS E COMPONENTES PARA CAMARAS AMBIENTAIS E EQUIPAMENTOS  CORRELATOS"]
[null,"PECAS E COMPONENTES PARA EQUIPAMENTOS DE LABORATORIO"]
[null,"PECAS E COMPONENTES PARA EQUIPAMENTOS E INSTRUMENTOS  PARA  ANALISE QUIMICA"]
[null,"PECAS E COMPONENTES PARA EQUIPAMENTOS PARA ENSAIO E VERIFICACAO DE PROPRIEDADES FISICAS"]
[null,"PECAS E COMPONENTES PARA INSTRUMENTOS COMBINADOS E INSTRUMENTOS DIVERSOS"]
[null,"PECAS E COMPONENTES PARA INSTRUMENTOS E APARELHOS DE METEREOLOGIA"]
[null,"PECAS E COMPONENTES PARA INSTRUMENTOS E APARELHOS PARA DETECCAO DE PERIGOS"]
[null,"PECAS E COMPONENTES PARA INSTRUMENTOS OPTICOS"]
[null,"PECAS E COMPONENTES PARA INSTRUMENTOS PARA CONTROLE E MEDICAO DE PRESSAO, TEMPERATURA E UMIDADE"]
[null,"PECAS E COMPONENTES PARA INSTRUMENTOS PARA MEDICAO DE FLUXOS GAS/LIQUIDOS/NIVEL E MOVIMENTOS MECANICOS"]
[null,"PECAS E COMPONENTES PARA INSTRUMENTOS PARA MEDICAO DE TEMPO"]
[null,"SISTEMAS DE MONITORAMENTO CLIMATICOS"]
[null,"SUPRIMENTOS PARA LABORATORIO"]
["EQUIPAMENTOS DE LABORATORIO E INSTRUMENTOS DE MEDICAO Total"]
["EQUIPAMENTOS DE REFRIGERACAO, CONDICIONAMENTO DE AR E VENTI LACAO","COMPONENTES E ACES.DE UNIDADES  DE REFRIGERACAO E CONDICIONAMENTO DE AR P/ CONTRATOS DE MANUTENCAO PREVENTIVA/CORRETIVA"]
[null,"EQUIP.INDUSTRIAL DE CLIMATIZACAO, VENTILACAO E CIRCULACAO -"]
[null,"PECAS, ACESSORIOS E COMPONENTES PARA EQUIPAMENTOS DE REFRIGERACAO E CONDICIONAMENTO DE AR"]
[null,"UNIDADES COMPLETAS DE CONDICIONAMENTO DE AR E ACESSORIOS"]
[null,"UNIDADES COMPLETAS DE REFRIGERACAO E ACESSORIOS"]
[null,"USINAS DE CONDICIONAMENTO DE AR, DE REFRIGERACAO  E COMPONENTES"]
[null,"VENTILADOR,CIRCULADOR,CLIMATIZADOR,(DES)UMIDIFICADOR DE AR"]
["EQUIPAMENTOS DE REFRIGERACAO, CONDICIONAMENTO DE AR E VENTI LACAO Total"]
["EQUIPAMENTOS DE SINALIZACAO E ALARME","PECAS E COMPONENTES PARA EQUIPAMENTOS DE SINALIZACAO E  ALARME"]
[null,"SISTEMA DE SINALIZACAO DE TRAFEGO E TRANSITO"]
[null,"SISTEMAS DIVERSOS DE SINALIZACAO E ALARME"]
["EQUIPAMENTOS DE SINALIZACAO E ALARME Total"]
["EQUIPAMENTOS E MAQUINARIA PARA TRABALHOS EM MADEIRA","FERRAMENTAS E IMPLEMENTOS DE MAQUINA PARA TRABALHO EM  MADEIRA"]
[null,"MAQUINARIA PARA TRABALHOS EM MADEIRA"]
[null,"PECAS E COMPONENTES PARA EQUIPAMENTOS E MAQUINARIA PARA TRABALHOS EM MADEIRA"]
[null,"SERRARIA E OFICINA DE APLAINAR"]
["EQUIPAMENTOS E MAQUINARIA PARA TRABALHOS EM MADEIRA Total"]
["EQUIPAMENTOS E MAQUINARIA PARA TRABALHOS EM METAL","ACESSORIOS PARA MAQUINAS-FERRAMENTA"]
[null,"ARTIGOS E ACESSORIOS PARA SOLDAGENS COMUM, FRACA E POR CALDEAMENTO"]
[null,"DESBASTADORAS E PLAINAS-LIMADORAS"]
[null,"EQUIPAMENTOS DE SOLDA A ARCO VOLTAICO"]
[null,"EQUIPAMENTOS DE SOLDA A RESISTENCIA ELETRICA"]
[null,"EQUIPAMENTOS DE SOLDA, DIVERSOS  (EM GERAL)"]
[null,"EQUIPAMENTOS PARA TRATAMENTO TERMICO DE METAIS"]
[null,"FERRAMENTAS DE CORTES PARA MAQUINAS-FERRAMENTA"]
[null,"GABARITOS PARA PRODUCAO, FURACAO E COPIAS"]
[null,"MAQUINA DE FRESAR"]
[null,"MAQUINA DE FURAR METAL"]
[null,"MAQUINAS DE DOBRAR E MOLDAR"]
[null,"MAQUINAS DE ESMERILHAR E RETIFICAR"]
[null,"MAQUINAS DE PUNCIONAR E TESOURAS MECANICAS"]
[null,"MAQUINAS DE REBITAR"]
[null,"MAQUINAS SECUNDARIAS PARA FORMA E CORTE DE METAL"]
[null,"MAQUINAS-FERRAMENTA, DIVERSAS"]
[null,"MATERIAIS E EQUIPAMENTOS PARA FUNDICAO EM GERAL"]
[null,"MATERIAL, COMPONENTES E PECAS PARA EQUIPAMENTOS E MAQUINARIAPARA TRABALHOS EM METAL"]
[null,"PRENSA MANUAL"]
[null,"PRENSAS HIDRAULICAS/ELETRICAS/PNEUMATICAS A MOTOR"]
[null,"SERRAS E MAQUINA DE LIMAR"]
[null,"SOLDA A GAS, CORTE A QUENTE E EQUIPAMENTO DE METALIZACAO"]
[null,"TORNOS"]
["EQUIPAMENTOS E MAQUINARIA PARA TRABALHOS EM METAL Total"]
["EQUIPAMENTOS E VIATURAS PARA SERVICOS DE AERODROMO","EQUIPAMENTOS PARA SERVICOS DE AERODROMOS E AEROPORTOS"]
["EQUIPAMENTOS E VIATURAS PARA SERVICOS DE AERODROMO Total"]
["EQUIPAMENTOS ESPECIALIZADOS PARA MANUTENCAO E REPAROS","COMPONENTES, ACESSORIOS E PECAS PARA EQUIPAMENTOS ESPECIALI ZADOS PARA MANUTENCAO E REPAROS"]
[null,"EQUIPAMENTOS  PARA ABASTECIMENTO DE COMBUSTIVEIS  E  LUBRIFICANTES"]
[null,"EQUIPAMENTOS ESPECIAIS DE REPARO, VERIFICACAO E MANUTENCAO DE MUNICOES E COMPONENTES"]
[null,"EQUIPAMENTOS ESPECIAIS DIVERSOS PARA MANUTENCAO E REPAROS"]
[null,"EQUIPAMENTOS ESPECIAIS PARA MANUTENCAO E REPAROS DE VEICULOS E EQUIPAMENTOS"]
["EQUIPAMENTOS ESPECIALIZADOS PARA MANUTENCAO E REPAROS Total"]
["EQUIPAMENTOS PARA  REFEITORIO, COPA E COZINHA","ARTIGOS PARA SERVICOS DE MESAS"]
[null,"EQUIPAMENTOS AUXILIARES DE COZINHA"]
[null,"EQUIPAMENTOS, ACESSORIOS E PECAS, PARA PREPARAR ALIMENTOS"]
[null,"JOGOS E ESTOJOS DE ARTIGOS PARA REFEITORIO,COPA E COZINHA"]
[null,"TALHERES DE MESA E CUTELARIA"]
[null,"UTENSILIOS DE COZINHA, MANUAIS"]
["EQUIPAMENTOS PARA  REFEITORIO, COPA E COZINHA Total"]
["EQUIPAMENTOS PARA CONSTRUCAO, MINERACAO, ESCAVACAO E  CONSERVACAO DE ESTRADAS","ACESSORIOS E COMPONENTES PARA EQUIPAMENTOS DIVERSOS PARA CONSTRUCAO"]
[null,"ACESSORIOS E COMPONENTES PARA EQUIPAMENTOS PARA MINERACAO, PERFURACAO DE ROCHA, TERRA E CORRELATOS"]
[null,"ACESSORIOS E COMPONENTES PARA EQUIPAMENTOS PARA MOVIMENTACAO E ESCAVACAO DE TERRA"]
[null,"ACESSORIOS E PECAS DE GUINDASTE E DE GUINDASTES-ESCAVADEIRAS"]
[null,"COMPONENTES E ACESSORIOS PARA EQUIPAMENTOS DE MOVIMENTACAO EESCAVACAO DE TERRA - CONTRATACAO MEDIANTE FORN. PARCELADO"]
[null,"EQUIPAMENTOS DIVERSOS PARA CONSTRUCAO"]
[null,"EQUIPAMENTOS PARA  MINERACAO, PERFURACAO  DE  ROCHA, TERRA ECORRELATOS"]
[null,"EQUIPAMENTOS PARA MOVIMENTACAO E ESCAVACAO DE TERRA"]
[null,"GUINDASTES E GUINDASTES-ESCAVADEIRAS"]
[null,"IMPLEMENTOS PARA CAMINHOES E TRATORES"]
[null,"MATERIAL DE FIXACAO,VEDACAO E LUBRIFICACAO EQUIPAMENTOS CONSTRUCAO/MINERACAO/ESCAVACAO/CONSTRUCAO ESTRADAS"]
["EQUIPAMENTOS PARA CONSTRUCAO, MINERACAO, ESCAVACAO E  CONSERVACAO DE ESTRADAS Total"]
["EQUIPAMENTOS PARA PURIFICACAO  E TRATAMENTO DE AGUA  E TRATAMENTO DE ESGOTOS","EQUIPAMENTOS PARA PURIFICACAO DE AGUA E COMPONENTES"]
[null,"EQUIPAMENTOS PARA TRATAMENTO DE ESGOTOS"]
["EQUIPAMENTOS PARA PURIFICACAO  E TRATAMENTO DE AGUA  E TRATAMENTO DE ESGOTOS Total"]
["EQUIPAMENTOS PARA SEGURANCA PESSOAL E INDUSTRIAL","EQUIP.COMPONENTES E ACESSORIOS COMBATE A INCENDIO"]
[null,"EQUIPAMENTO E ACESSORIO MARITIMO PARA MERGULHO E SALVAMENTO-"]
[null,"EQUIPAMENTO,COMPONENTE E SUPRIMENTOS PARA BUSCA E SEGURANCA"]
[null,"EQUIPAMENTOS PARA IMPREGNACAO E DESCONTAMINACAO"]
["EQUIPAMENTOS PARA SEGURANCA PESSOAL E INDUSTRIAL Total"]
["EQUIPAMENTOS PARA TRANSMISSAO DE ENERGIA MECANICA","CORREIAS DE TRANSMISSAO E ACESSORIOS"]
[null,"EQUIPAMENTOS DIVERSOS PARA TRANSMISSAO DE FORCA"]
["EQUIPAMENTOS PARA TRANSMISSAO DE ENERGIA MECANICA Total"]
["EQUIPAMENTOS, PERIFERICOS, ACESSORIOS  E SUPRIMENTOS  DE PROCESSAMENTO DE DADOS EM GERAL","ARMAZENAMENTO - INFORMATICA -"]
[null,"ATIVOS DE REDE"]
[null,"COMPONENTES DE PROCESSAMENTO DE DADOS"]
[null,"COMPONENTES, PERIFERICOS E ACESSORIOS DE INFORMATICA -"]
[null,"DISPOSITIVO DE CONTROLE PARA COMPUTADOR E MICRO"]
[null,"EQUIPAMENTOS COMBINADOS PARA INFORMATIZACAO E PROCESSAMENTO DE DADOS"]
[null,"EQUIPAMENTOS DE APOIO E MATERIAL DE CONSUMO PARA INFORMATICA"]
[null,"EQUIPAMENTOS DE INFORMATICA -"]
[null,"EQUIPAMENTOS E DISPOSITIVOS DE SEGURANCA  PARA  EQUIPAMENTOSDE INFORMATICA"]
[null,"UNIDADE CENTRAL DE  PROCESSAMENTO  ANALOGICO (CPU), COMPONENTES E PERIFERICOS"]
[null,"UNIDADE CENTRAL DE PROCESSAMENTO, HIBRIDA (CPU)"]
["EQUIPAMENTOS, PERIFERICOS, ACESSORIOS  E SUPRIMENTOS  DE PROCESSAMENTO DE DADOS EM GERAL Total"]
["ESTRUTURAS E ANDAIMES PRE-FABRICADOS","ABRIGOS DE PAREDE RIGIDA"]
[null,"ANDAIMES, ESCADAS E FORMAS DE CONCRETO"]
[null,"EDIFICIOS PRE-FABRICADOS E PORTATEIS"]
[null,"ESTRUTURAS DE TORRES, PRE-FABRICADAS"]
[null,"ESTRUTURAS DIVERSAS, PRE-FABRICADAS"]
[null,"PONTES FIXAS, MOVEIS E FLUTUANTES"]
[null,"TANQUES DE ARMAZENAGEM, COMPONENTES E PECAS"]
["ESTRUTURAS E ANDAIMES PRE-FABRICADOS Total"]
["EXPLOSIVOS, MUNICOES E DISPOSITIVOS DE DISPERSAO","ARTIGOS PIROTECNICOS E SINALIZADORES"]
[null,"DISPOSITOS DE DISPERSAO, NAO EXPLOSIVOS"]
[null,"EXPLOSIVOS E DISPOSITIVOS DE EXPLOSAO"]
[null,"MUNICOES"]
["EXPLOSIVOS, MUNICOES E DISPOSITIVOS DE DISPERSAO Total"]
["FERRAGENS, ABRASIVOS E MATERIAIS PARA VEDACAO","ARRUELA, CALCO E ESPACADOR"]
[null,"DISCOS, PEDRAS E CORREIAS ABRASIVAS"]
[null,"DISPOSITIVOS DE FIXACAO"]
[null,"FERRAGENS DIVERSAS"]
[null,"MATERIAIS ABRASIVOS"]
[null,"MATERIAIS PARA VEDACAO"]
[null,"MOLAS DE FIO, CHATA E ESPECIAL"]
[null,"MOSTRADORES, PONTEIROS E BOTOES DE CONTROLE"]
[null,"PARAFUSOS COM FENDAS"]
[null,"PARAFUSOS SEM FENDAS"]
[null,"PORCAS E ARRUELAS PARA PARAFUSOS"]
[null,"PREGOS, CHAVETAS E PINOS"]
[null,"PRISIONEIROS"]
[null,"REBITES"]
[null,"TELAS E TECIDOS METALICOS"]
["FERRAGENS, ABRASIVOS E MATERIAIS PARA VEDACAO Total"]
["FERRAMENTAS MANUAIS E COMPONENTES","BROCAS, REBAIXADORES E ESCARIADORES"]
[null,"COMPONENTES E PECAS PARA FERRAMENTAS MANUAIS, MOTORIZADAS/  ELETRICAS, TIPO EMPUNHAVEL"]
[null,"FERRAMENTAS ESPECIAIS MANUTENCAO E REPAROS"]
[null,"FERRAMENTAS MANUAIS MOTORIZADAS/ELETRICAS/PNEUMATICAS, TIPO EMPUNHAVEL"]
[null,"FERRAMENTAS MANUAIS, COM CORTE, NAO MOTORIZADAS"]
[null,"FERRAMENTAS MANUAIS, SEM CORTE, NAO MOTORIZADAS"]
[null,"FERRAMENTAS PARA MANUTENCAO EM EQUIPAMENTOS DE INFORMATICA"]
[null,"JOGOS E CONJUNTOS DE FERRAMENTAS MANUAIS"]
[null,"MACHOS, COSSINETES E COLETORES"]
[null,"RECIPIENTE PARA FERRAMENTAS"]
["FERRAMENTAS MANUAIS E COMPONENTES Total"]
["FIOS, CABOS TELEFONICOS, CONDUITES ELETRICOS, EQUIPAMENTO P/GERACAO/DISTRIBUICAO ENERGIA","ACESSORIOS E REVESTIMENTOS DIVERSOS PARA BATERIAS"]
[null,"BATERIA E PILHA RECARREGAVEL E NAO-RECARREGAVEL"]
[null,"BATERIAS PRIMARIAS (PILHAS)"]
[null,"CELULA COMBUSTIVEL, COMPONENTES E ACESSORIOS"]
[null,"COMPONENTES E ACESSORIOS PARA GRUPOS GERADORES PARA         CONTRATOS DE MANUTENCAO PREVENTIVA/CORRETIVA"]
[null,"CONVERSORES ELETRICOS NAO ROTATIVOS"]
[null,"CONVERSORES ELETRICOS ROTATIVOS"]
[null,"EQUIPAMENTOS PARA CONTROLE ELETRICO"]
[null,"FIOS, CABOS ELETRICOS E TELEFONICOS"]
[null,"GERADORES ELETRICOS, PECAS E COMPONENTES"]
[null,"MATERIAIS E EQUIPAMENTOS DIVERSOS PARA GERACAO/DISTRIBUICAO ENERGIA ELETRICA"]
[null,"MOTORES ELETRICOS E COMPONENTES"]
[null,"SISTEMAS DE ENERGIA ELETRICA SOLAR"]
["FIOS, CABOS TELEFONICOS, CONDUITES ELETRICOS, EQUIPAMENTO P/GERACAO/DISTRIBUICAO ENERGIA Total"]
["FORNOS, CENTRAIS DE VAPOR E EQUIPAMENTOS PARA SECAGEM","CALDEIRAS INDUSTRIAIS"]
[null,"COMPONENTES E PECAS PARA CALDEIRAS,FORNOS,CENTRAIS DE VAPOR E EQUIPAMENTOS DE SECAGEM"]
[null,"FORNALHAS E FORNOS INDUSTRIAIS, FORNOS-TUNEIS E ESTUFAS"]
[null,"SECADORES, DESIDRATADORES E ANTI-HIDRATADORES"]
["FORNOS, CENTRAIS DE VAPOR E EQUIPAMENTOS PARA SECAGEM Total"]
["FORRAGENS, FERTILIZANTES, SEMENTES E MUDAS","AGROTOXICOS"]
[null,"FERTILIZANTES"]
[null,"FORRAGENS E ALIMENTOS PARA ANIMAIS"]
[null,"INOCULANTES"]
[null,"SEMENTES E VIVEIROS PARA PLANTAS"]
["FORRAGENS, FERTILIZANTES, SEMENTES E MUDAS Total"]
["GENEROS ALIMENTICIOS E BEBIDAS","ACUCAR E PRODUTOS DE CONFEITARIA"]
[null,"ALIMENTOS PREPARADOS E ALIMENTOS DIETETICOS"]
[null,"BEBIDAS ALCOOLICAS"]
[null,"BEBIDAS NAO ALCOOLICAS"]
[null,"CARNES, AVES ABATIDAS E PEIXES"]
[null,"CONDIMENTOS E PRODUTOS CORRELATOS"]
[null,"DIETAS ENTERAIS, SUPLEMENTOS E MODULOS NUTRICIONAIS  -"]
[null,"DOCES, GELEIAS E COMPOTAS"]
[null,"FARINHAS E PRODUTOS DE PANIFICACAO"]
[null,"OLEOS E GORDURAS COMESTIVEIS"]
[null,"OVOS E LATICINIOS"]
[null,"PRODUTOS ALIMENTICIOS DE DISTRIBUICAO GRATUITA -"]
[null,"PRODUTOS E PREPARADOS SOLUVEIS"]
[null,"RACAO OPERACIONAL DE EMERGENCIA"]
[null,"SEMENTES E CEREAIS BENEFICIADOS, FRUTAS, LEGUMES E HORTALICAS"]
[null,"SOPAS E CALDOS"]
[null,"SORVETES, SUCOS, REFRESCOS E BEBIDAS LACTEAS"]
["GENEROS ALIMENTICIOS E BEBIDAS Total"]
["INSTRUMENTOS MUSICAIS, RADIOS, FONOGRAFOS, TELEVISOR, VIDEO, AUDIO/SONORIZACAO E ACESSORIOS","ACESSORIOS E PARTES DE INSTRUMENTOS MUSICAIS"]
[null,"GRAVACAO FONOGRAFICA,CINEMATOGRAFICA E FITA VIRGEM"]
[null,"INSTRUMENTOS MUSICAIS"]
[null,"RADIOS, FONOGRAFOS, TELEVISORES TIPO DOMESTICO E ACESSORIOS"]
["INSTRUMENTOS MUSICAIS, RADIOS, FONOGRAFOS, TELEVISOR, VIDEO, AUDIO/SONORIZACAO E ACESSORIOS Total"]
["LAMPADAS E APARELHOS DE ILUMINACAO","APARELHOS  E ARTIGOS DE ILUMINACAO ELETRICA VEICULAR"]
[null,"APARELHOS E ARTIGOS DE ILUMINACAO ELETRICA, INTERNOS E EXTERNOS"]
[null,"APARELHOS E ARTIGOS DE ILUMINACAO ELETRICA, PORTATEIS E MANUAIS"]
[null,"EQUIPAMENTO DE INFRAESTRUTURA PARA ILUMINACAO"]
[null,"LAMPADAS ELETRICAS"]
[null,"MATERIAIS E APARELHOS DE ILUMINACAO NAO ELETRICOS"]
[null,"REATORES(COMPENSADOS), ELEMENTOS DE PARTIDA E PORTA-LAMPADAS"]
["LAMPADAS E APARELHOS DE ILUMINACAO Total"]
["LIVROS, MAPAS E OUTRAS PUBLICACOES","IMPRESSOS DIVERSOS"]
[null,"JORNAIS E PERIODICOS"]
[null,"LIVROS E FOLHETOS"]
[null,"LIVROS E FOLHETOS DE MUSICA"]
[null,"MAPAS, ATLAS, CARTAS, ORTO E AEROFOTOS, IMAGEM ORBITAL      E GLOBOS"]
[null,"NORMAS E DESENHOS TECNICOS"]
["LIVROS, MAPAS E OUTRAS PUBLICACOES Total"]
["LOCACOES","SERVICO DE LOCACAO DE EQUIPAMENTOS, MAQUINAS, APARELHOS, INSTRUMENTAL, FERRAMENTAL, MATERIAL E INSTALACOES"]
[null,"SERVICOS DE LOCACAO DE APARELHOS, EQUIPAMENTOS DE TELECOMUNICACAO E LINHAS"]
[null,"SERVICOS DE LOCACAO DE IMOVEIS"]
[null,"SERVICOS DE LOCACAO DE MATERIAIS E EQUIPAMENTOS DE MIDIA"]
[null,"SERVICOS DE LOCACAO DE VEICULOS E AERONAVES"]
["LOCACOES Total"]
["MADEIRAS,  ESQUADRIAS,  COMPENSADOS E FOLHEADOS","COMPENSADOS, FOLHEADOS  E AGLOMERADOS"]
[null,"ESQUADRIA DE MADEIRA"]
[null,"MADEIRAS E PRODUTOS DERIVADOS"]
["MADEIRAS,  ESQUADRIAS,  COMPENSADOS E FOLHEADOS Total"]
["MAQUINARIA E EQUIPAMENTOS AGRICOLAS","COMPONENTES E PECAS PARA MAQUINA E EQUIPAMENTOS AGRICOLAS"]
[null,"EQUIPAMENTOS AGRICOLAS"]
[null,"EQUIPAMENTOS DE COLHEITA"]
[null,"EQUIPAMENTOS DE TRACAO ANIMAL"]
[null,"EQUIPAMENTOS PARA AGRO-PECUARIA"]
[null,"EQUIPAMENTOS PARA COMBATE A PRAGAS"]
[null,"FERRAMENTAS PARA JARDINAGEM E HORTICULTURA"]
[null,"MATERIAIS DIVERSOS PARA ANIMAIS"]
[null,"PECAS E COMPONENTES PARA EQUIPAMENTOS AGRICOLAS -CONTRATACAOMEDIANTE FORNECIMENTO PARCELADO"]
["MAQUINARIA E EQUIPAMENTOS AGRICOLAS Total"]
["MAQUINARIA,EQUIPAMENTOS,COMPONENTES E SUPRIMENTOS PARA A  INDUSTRIA ESPECIALIZADA","EQUIPAMENTO PARA PRODUCAO E RECICLAGEM DE GASES -"]
[null,"EQUIPAMENTOS, COMPONENTES E SUPRIMENTOS PARA INDUSTRIAS DI  VERSAS"]
[null,"MAQUINAS INDUSTRIAIS DE MONTAGEM"]
[null,"MAQUINAS, EQUIPAMENTOS E COMPONENTES DE MANUFATURA DE  PRODUTOS QUIMICOS E FARMACEUTICOS"]
[null,"MAQUINAS, EQUIPAMENTOS, COMPONENTES E SUPRIMENTOS PARA INDUSTRIA DE BORRACHA, PLASTICO E PRODUTOS SINTETICOS"]
[null,"MAQUINAS, EQUIPAMENTOS, COMPONENTES E SUPRIMENTOS PARA INDUSTRIA DE PRODUTOS ALIMENTICIOS"]
[null,"MAQUINAS, EQUIPAMENTOS, COMPONENTES E SUPRIMENTOS PARA INDUSTRIA DE PRODUTOS DE ARGILA E CONCRETO"]
[null,"MAQUINAS, EQUIPAMENTOS, COMPONENTES E SUPRIMENTOS PARA INDUSTRIA GRAFICA"]
[null,"MAQUINAS, EQUIPAMENTOS, COMPONENTES E SUPRIMENTOS PARA INDUSTRIAS TEXTEIS"]
[null,"MAQUINAS, EQUIPAMETOS, COMPONENTES E SUPRIMENTOS PARA INDUSTRIA DE POLPA E DE PAPEL"]
[null,"PECAS E COMPONENTES PARA MAQUINARIA E EQUIPAMENTOS P/INDUS  TRIA ESPECIALIZADA"]
["MAQUINARIA,EQUIPAMENTOS,COMPONENTES E SUPRIMENTOS PARA A  INDUSTRIA ESPECIALIZADA Total"]
["MAQUINAS DE ESCRITORIO E EQUIPAMENTO DE REGISTRO VISUAL","EQUIPAMENTOS DE SISTEMAS DE INFORMACAO PARA ESCRITORIO"]
[null,"MAQUINA DE DATILOGRAFIA E MAQUINA DE COMPOSICAO DE TIPOS  PARA ESCRITORIO"]
[null,"MAQUINAS CALCULADORAS E DE CONTABILIDADE"]
[null,"MAQUINAS DIVERSAS DE ESCRITORIO"]
[null,"PECAS,ACESSORIOS E COMPONENTES PARA MAQUINAS DE ESCRITORIO E EQUIPAMENTOS DE REGISTRO VISUAL"]
["MAQUINAS DE ESCRITORIO E EQUIPAMENTO DE REGISTRO VISUAL Total"]
["MATERIAIS DIVERSOS","ACESSORIOS E PECAS PARA ARTESANATO E BIJUTERIA"]
[null,"ARTIGOS PARA FUMANTES E PRODUTOS DE TABACO (FUMO)"]
[null,"EQUIPAMENTOS, MOBILIARIOS E SUPRIMENTOS ECLESIASTICOS"]
[null,"ITENS DIVERSOS"]
[null,"LETREIROS, MOSTRUARIOS, DISPOSITIVOS DE AVISOS E CHAPAS DE IDENTIFICACAO"]
[null,"MATERIAIS DIVERSOS PARA ALIENACAO"]
[null,"MATERIAIS PROMOCIONAIS"]
[null,"MATERIAL PARA CONSERVACAO E RESTAURACAO"]
[null,"PATRIMONIO ANTIGO - MATERIAIS NAO CLASSIFICADOS             EM OUTROS GRUPOS"]
[null,"PECAS PARA ACERVO E OBRAS DE ARTE - ITENS COLECIONADORES"]
["MATERIAIS DIVERSOS Total"]
["MATERIAIS E EQUIPAMENTOS FOTOGRAFICOS E CINEMATOGRAFICOS","CAMERA E EQUIPAMENTOS FOTOGRAFICOS -"]
[null,"CAMERAS CINEMATOGRAFICAS E DE ESTUDIO DE TV"]
[null,"EQUIPAMENTOS PARA PROJECAO FOTOGRAFICA E CINEMATOGRAFICA"]
[null,"EQUIPAMENTOS PARA REVELACAO E ACABAMENTOS FOTOGRAFICOS"]
[null,"JOGOS E ESTOJOS DE MATERIAL FOTOGRAFICO  E CINEMATOGRAFICO"]
[null,"MATERIAIS FOTOGRAFICOS E CINEMATOGRAFICOS"]
[null,"PECAS E ACESSORIOS PARA EQUIPAMENTOS FOTOGRAFICOS, CINEMATO GRAFICOS E DE PROJECAO"]
["MATERIAIS E EQUIPAMENTOS FOTOGRAFICOS E CINEMATOGRAFICOS Total"]
["MATERIAIS E EQUIPAMENTOS PARA EMBARCACOES","EQUIPAMENTOS, COMPONENTES E ACESSORIOS PARA EMBARCACOES"]
[null,"FERRAGENS PARA EMBARCACOES E ITENS DO CASCO"]
["MATERIAIS E EQUIPAMENTOS PARA EMBARCACOES Total"]
["MATERIAIS E EQUIPAMENTOS PARA LIMPEZA","ASPIRADORES DE PO E ENCERADEIRA E SEUS COMPONENTES"]
[null,"COMPOSTOS E PREPARADOS PARA LIMPEZA E POLIMENTO"]
[null,"EQUIPAMENTOS AUXILIARES E MATERIAIS PARA LIMPEZA"]
["MATERIAIS E EQUIPAMENTOS PARA LIMPEZA Total"]
["MATERIAIS E EQUIPAMENTOS PARA RECREACAO E DESPORTO","JOGOS E BRINQUEDOS"]
[null,"MATERIAIS E EQUIPAMENTOS PARA ATLETISMO E DESPORTO"]
[null,"MATERIAIS E EQUIPAMENTOS PARA GINASTICA E RECREACAO"]
[null,"PECAS E COMPONENTES"]
["MATERIAIS E EQUIPAMENTOS PARA RECREACAO E DESPORTO Total"]
["MATERIAIS E EQUIPAMENTOS PARA USOS MEDICOS, ODONTOLOGICOS  E VETERINARIOS","COMPONENTES E ACESSORIOS PARA EQUIPAMENTOS MEDICOS-HOSPITALARES PARA CONTRATOS DE MANUTENCAO PREVENTIVA/CORRETIVA"]
[null,"COMPONENTES E ACESSORIOS PARA EQUIPAMENTOS ODONTOLOGICOS    PARA CONTRATOS DE MANUTENCAO PREVENTIVA/CORRETIVA"]
[null,"COMPONENTES E PECAS DE MOBILIARIO PARA USO MEDICO, HOSPITALAR E REABILITACAO"]
[null,"COSMETICOS E PRODUTOS DE TOALETES PARA PACIENTES HOSPITALIZADOS"]
[null,"DROGAS, PRODUTOS BIOLOGICOS E REAGENTES OFICINAIS (PADRONIZADOS)"]
[null,"EQUIPAMENTOS E APARELHOS ODONTOLOGICOS"]
[null,"EQUIPAMENTOS E SUPRIMENTOS PARA  RAIO-X, USO MEDICO/ODONTOLOGICO/VETERINARIO"]
[null,"EQUIPAMENTOS PARA TECNOLOGIA ASSISTIVA"]
[null,"EQUIPAMENTOS, APARELHOS E UTENSILIOS MEDICOS-HOSPITALARES"]
[null,"EQUIPAMENTOS, INSTRUMENTOS  E  SUPRIMENTOS DE OFTALMOLOGIA  (OPTOMETRIA)"]
[null,"INSTRUMENTOS E UTENSILIOS ODONTOLOGICOS"]
[null,"INSTRUMENTOS MEDICOS-HOSPITALARES"]
[null,"INSTRUMENTOS, EQUIPAMENTOS E ARTIGOS VETERINARIOS"]
[null,"MATERIAIS CIRURGICOS PARA CURATIVOS"]
[null,"MOBILIARIO PARA USO MEDICO, HOSPITALAR, REABILITACAO E      LABORATORIO"]
[null,"PECAS E COMPONENTES DE EQUIPAMENTOS PARA USO ODONTOLOGICO"]
[null,"PECAS E COMPONENTES PARA EQUIPAMENTOS DE RAIO-X, USO MEDICO, ODONTOLOGICO E VETERINARIO"]
[null,"PECAS E COMPONENTES PARA EQUIPAMENTOS E INSTRUMENTOS DE OFTALMOLOGIA (OPTOMETRIA)"]
[null,"PECAS E COMPONENTES PARA EQUIPAMENTOS MEDICOS, CIRURGICOS E HOSPITALARES"]
[null,"SUPRIMENTOS PARA TECNOLOGIA ASSISTIVA"]
[null,"SUPRIMENTOS PARA USO MEDICO E CIRURGICO"]
[null,"SUPRIMENTOS PARA USO ODONTOLOGICO"]
[null,"VESTUARIO DE USO MEDICO E ODONTOLOGICO NAO DESCARTAVEL"]
[null,"VESTUARIO DESCARTAVEL DE USO MEDICO, ODONTOLOGICO E HOSPITA LAR"]
["MATERIAIS E EQUIPAMENTOS PARA USOS MEDICOS, ODONTOLOGICOS  E VETERINARIOS Total"]
["MATERIAIS MANUFATURADOS NAO METALICOS","MATERIAIS DIVERSOS, NAO METALICOS, ACABADOS"]
[null,"PAPEL E PAPELAO"]
[null,"PRODUTOS ACABADOS DE BORRACHA"]
[null,"PRODUTOS ACABADOS DE PLASTICO"]
[null,"PRODUTOS ACABADOS DE REFRATARIOS"]
[null,"PRODUTOS ACABADOS DE VIDRO"]
["MATERIAIS MANUFATURADOS NAO METALICOS Total"]
["MATERIAIS PARA CONSTRUCAO","CERCADOS, TELAS E PORTOES"]
[null,"MATERIAIS DIVERSOS PARA CONSTRUCAO"]
[null,"MATERIAIS PARA COBERTURAS"]
[null,"MATERIAL PARA CONSTRUCAO, A GRANEL, DE ORIGEM MINERAL"]
[null,"MATERIAL PARA CONSTRUCAO, DIMENSIONADOS, NAO METALICOS"]
[null,"MATERIAL PARA ISOLAMENTOS TERMICO E ACUSTICO E PAINEIS DIVI SORIOS"]
[null,"PRODUTOS METALICOS PARA ARQUITETURA"]
[null,"TUBOS, CONDUTOS E CORRELATOS, NAO METALICOS"]
["MATERIAIS PARA CONSTRUCAO Total"]
["MATERIAIS PARA EXECUCAO DE OBRAS","CERCAS, TELAS, ARAMES E PORTOES"]
[null,"FERRAGENS E PRODUTOS METALICOS E PERFILADOS"]
[null,"MADEIRAS, ESQUADRIAS E FOLHEADOS"]
[null,"MATERIAIS DIVERSOS PARA OBRAS"]
[null,"MATERIAIS PARA INSTALACOES INCORPORAVEIS A OBRAS"]
[null,"MATERIAL A GRANEL, DE ORIGEM MINERAL"]
[null,"MATERIAL DIMENSIONADO, NAO METALICO"]
[null,"MATERIAL PARA COBERTURA"]
[null,"TINTAS, SECANTES, ADESIVOS E PRODUTOS CORRELATOS"]
[null,"TUBOS, CONDUTOS E CORRELATOS E CONEXOES,  METALICOS E NAO METALICOS"]
["MATERIAIS PARA EXECUCAO DE OBRAS Total"]
["MATERIAS PRIMAS NAO METALICAS","FIBRAS VEGETAIS, ANIMAIS E SINTETICAS"]
[null,"MATERIA-PRIMA DE ORIGEM MINERAL E SINTETICA"]
["MATERIAS PRIMAS NAO METALICAS Total"]
["MEDICAMENTO","ANABOLIZANTES PARA USO SISTEMICO"]
[null,"ANALGESICOS E ANTIPIRETICOS"]
[null,"ANESTESICOS"]
[null,"ANSIOLITICOS"]
[null,"ANTIACIDOS, INIBIDORES DA SECRECAO GASTRICA E TRATAMENTO DASULCERAS"]
[null,"ANTIACNEICOS"]
[null,"ANTIASMATICOS"]
[null,"ANTIBACTERIANOS SISTEMICOS"]
[null,"ANTICOAGULANTES, ANTITROMBOTICOS E TROMBOLITICOS"]
[null,"ANTICONCEPCIONAIS, HORMONIOS SEXUAIS E MODULADORES DO SISTEMA GENITAL"]
[null,"ANTIDEPRESSIVOS"]
[null,"ANTIDIARREICOS, ANTI-INFLAMATORIOS, ANTI-INFECCIOSOS INTESTINAIS"]
[null,"ANTIDOTOS, AGENTES DESINTOXICANTES E AGENTES QUELANTES"]
[null,"ANTIEMETICOS E ANTINAUSEANTES"]
[null,"ANTIEPILEPTICOS"]
[null,"ANTIESPASMODICOS, ANTICOLINERGICOS E PROPULSIVOS"]
[null,"ANTIFUNGICOS SISTEMICOS"]
[null,"ANTIGOTOSOS"]
[null,"ANTI-HELMINTICOS"]
[null,"ANTI-HEMORRAGICOS, FATORES DE COAGULACAO E CORRELATOS"]
[null,"ANTI-HIPERTENSIVOS"]
[null,"ANTI-HISTAMINICOS SISTEMICOS"]
[null,"ANTI-INFECCIOSOS E ANTISSEPTICOS GINECOLOGICOS"]
[null,"ANTI-INFECCIOSOS, ANTIBIOTICOS E ANTI-INFLAMATORIOS TOPICOS"]
[null,"ANTI-INFLAMATORIOS E ANTIRREUMATICOS"]
[null,"ANTIMICOBACTERIANOS SISTEMICOS"]
[null,"ANTINEOPLASICOS"]
[null,"ANTIPARKINSONIANOS"]
[null,"ANTIPROTOZOARIOS"]
[null,"ANTIPRURIGINOSOS E ANTIPSORIATICOS"]
[null,"ANTIPSICICOTICOS"]
[null,"ANTISSEPTICOS E DESINFETANTES"]
[null,"ANTIVIRAIS SISTEMICOS"]
[null,"ANTROPOSOFICOS, FITOTERAPICOS E HOMEOPATICOS"]
[null,"BETA-BLOQUEADORES"]
[null,"BLOQUEADORES DE CANAL DE CALCIO"]
[null,"CORTICOESTEROIDES SISTEMICOS"]
[null,"DIGESTIVOS E ENZIMAS DIGESTIVAS"]
[null,"DIURETICOS"]
[null,"EMOLIENTES, HIDRATANTES, PROTETORES E FILTRO SOLAR"]
[null,"EQUIPAMENTOS, REAGENTES, SOLVENTES E OUTROS INSUMOS FARMACEUTICOS"]
[null,"ESTIMULANTES CARDIACOS, CARDIOTONICOS E GLICOSIDEOS"]
[null,"ESTIMULANTES DO APETITE"]
[null,"FORMULAS OU ASSOCIACOES MANIPULADAS"]
[null,"GASES MEDICINAIS"]
[null,"HEMODIALISES, DIALISES E SOLUCOES PARA PERFUSAO E IRRIGACAO"]
[null,"HIPNOTICOS E SEDATIVOS"]
[null,"HIPOLIPEMIANTES"]
[null,"HORMONIOS HIPOFISARIOS, HIPOTALAMICOS E ANALOGOS"]
[null,"HORMONIOS PANCREATICOS"]
[null,"IMUNOESTIMULANTES"]
[null,"IMUNOSOROS E IMUNOGLOBULINAS"]
[null,"IMUNOSSUPRESSORES"]
[null,"INSETICIDAS, REPELENTES, ESCABICIDAS E ECTOPARASITOCIDAS"]
[null,"LAXATIVOS"]
[null,"MEDICAMENTOS PARA TOSSE E RESFRIADO"]
[null,"MEDICAMENTOS RELACIONADOS A HOMEOSTASIA DO CALCIO"]
[null,"MEDICAMENTOS UROLOGICOS"]
[null,"MEDICAMENTOS UTILIZADOS NO DIABETES"]
[null,"MEDICAMENTOS VETERINARIOS"]
[null,"MEIOS DE CONTRASTE"]
[null,"NUTRICAO PARENTERAL"]
[null,"OUTROS MEDICAMENTOS PARA O SISTEMA DIGESTIVO E O METABOLISMO"]
[null,"OUTROS MEDICAMENTOS PARA O SISTEMA MUSCULO-ESQUELETICO"]
[null,"OUTROS MEDICAMENTOS PARA O SISTEMA NERVOSO"]
[null,"OUTROS MEDICAMENTOS PARA O SISTEMA RESPIRATORIO"]
[null,"OUTROS PREPARADOS DERMATOLOGICOS"]
[null,"OUTROS PREPARADOS GINECOLOGICOS"]
[null,"OUTROS PREPARADOS HEMATOLOGICOS"]
[null,"OUTROS PRODUTOS TERAPEUTICOS"]
[null,"PREPARADOS ANTIANEMICOS"]
[null,"PREPARADOS ANTIOBESIDADE"]
[null,"PREPARADOS ESTOMATOLOGICOS (BOCA E DENTES)"]
[null,"PREPARADOS PARA USO NASAL"]
[null,"PRODUTOS OFTALMOLOGICOS"]
[null,"PRODUTOS OTOLOGICOS"]
[null,"PSICOESTIMULANTES"]
[null,"PSICOLEPTICOS E PSICOANAPLETICOS EM ASSOCIACAO"]
[null,"RELAXANTES MUSCULARES"]
[null,"SISTEMA RENINA-ANGIOTENSINA"]
[null,"TERAPIAS ENDOCRINAS"]
[null,"TESTES E AGENTES DE DIAGNOSTICO"]
[null,"TONICOS E REPOSITORES HIDROELETROLITICOS ORAIS"]
[null,"TRATAMENTO BILIAR E HEPATICO"]
[null,"TRATAMENTO DA TIREOIDE"]
[null,"TRATAMENTO DE DOENCAS OSSEAS"]
[null,"TRATAMENTO DE FERIDAS E ULCERAS"]
[null,"TRATAMENTO DO ALZHEIMER E DEMENCIA"]
[null,"VACINAS"]
[null,"VASODILATADORES PERIFERICOS"]
[null,"VASOPROTETORES"]
[null,"VITAMINAS, SUPLEMENTOS MINERAIS E ASSOCIACOES"]
["MEDICAMENTO Total"]
["MEDICAMENTOS","ACAO ENDOCRINA/CORTICOSTEROIDES"]
[null,"ACAO ENDOCRINA/HIPERGLICEMIANTES"]
[null,"ACAO ENDOCRINA/HIPOGLICEMIANTES ORAIS"]
[null,"ACAO ENDOCRINA/HORMONIOS ESTROGENICOS"]
[null,"ACAO ENDOCRINA/HORMONIOS HOPIFISARIOS E AFINS"]
[null,"ACAO ENDOCRINA/HORMONIOS PROGESTAGENICOS"]
[null,"ACAO ENDOCRINA/HORMONIOS TIREOIDEANOS E INIBIDORES DA FUNCAO TIREOIDEANA"]
[null,"ACAO ENDOCRINA/INIBIDORES DA SECRECAO DE PROLACTINA"]
[null,"ACAO ENDOCRINA/INSULINA"]
[null,"AGENTES DIAGNOSTICOS/AUXILIARES DE DIAGNOSTICOS"]
[null,"AGENTES DIAGNOSTICOS/CONTRASTES RADIOLOGICOS"]
[null,"ANTIDOTOS"]
[null,"ANTIINFECCIOSOS/ANTIBIOTICOS"]
[null,"ANTIINFECCIOSOS/ANTIFUNGICOS"]
[null,"ANTIINFECCIOSOS/ANTIVIRAIS"]
[null,"ANTIINFECCIOSOS/HANSENOSTATICOS E TUBERCULOSTATICOS"]
[null,"ANTIINFECCIOSOS/NITROFURANOS, QUINOLONAS E SULFONAMIDAS"]
[null,"ANTIMEOPLASICOS/PRODUTOS NATURAIS"]
[null,"ANTINEOPLASICOS/AGENTES ALQUILANTES"]
[null,"ANTINEOPLASICOS/ALCALOIDES"]
[null,"ANTINEOPLASICOS/ANTIBIOTICOS CITOTOXICOS"]
[null,"ANTINEOPLASICOS/ANTIMETABOLICOS"]
[null,"ANTINEOPLASICOS/COMPOSTOS DE PLATINA"]
[null,"ANTINEOPLASICOS/HORMONIOS, INIBIDORES ENZIMATICOS E DA ACAO HORMONAL"]
[null,"ANTIPARASITARIOS"]
[null,"APARELHO DIGESTIVO/ADSORVENTES, ANTIFISETICOS E ANTIFLATULENTOS"]
[null,"APARELHO DIGESTIVO/ANTIACIDOS E INIBIDORES DA SECRECAO GAS  TRICA"]
[null,"APARELHO DIGESTIVO/ANTIEMETICOS E PRO-CINETICOS"]
[null,"APARELHO DIGESTIVO/CONSTIPANTES"]
[null,"APARELHO DIGESTIVO/DIGESTIVOS E ANTIINFLAMATORIOS"]
[null,"APARELHO DIGESTIVO/LAXATIVOS"]
[null,"APARELHO GENITURINARIO/ANTICONCEPCIONAIS E ANOVULATORIOS"]
[null,"APARELHO GENITURINARIO/ANTISSEPTICOS"]
[null,"APARELHO GENITURINARIO/DIURETICOS E TERAPEUTIICA DA INCONTI NENCIA URINARIA"]
[null,"APARELHO GENITURINARIO/OXITOCITOS"]
[null,"APARELHO RESPIRATORIO/AGENTES TENSOATIVO PULMONAR"]
[null,"APARELHO RESPIRATORIO/ANTITUSSIGENOS"]
[null,"APARELHO RESPIRATORIO/BRONCODILATADORES"]
[null,"APARELHO RESPIRATORIO/EXPECTORANTES, FLUIDIFICANTES E       DESCONGESTIONANTES"]
[null,"FITOTERAPICOS"]
[null,"IMUNOTERAPICOS/IMUNOGLOBULINAS"]
[null,"IMUNOTERAPICOS/IMUNOSSUPRESSORES"]
[null,"IMUNOTERAPICOS/SOROS"]
[null,"IMUNOTERAPICOS/VACINAS E TOXOIDES"]
[null,"MEDICAMENTOS DECISAO JUDICIAL DE USO EXCLUSIVO DA SES"]
[null,"METABOLISMO E NUTRICAO/AGENTES PARA REPOSICAO HIDROELETROLI TICA"]
[null,"METABOLISMO E NUTRICAO/HIPOLIPEMIANTES"]
[null,"METABOLISMO E NUTRICAO/NUTRIENTES DE USO PARENTERAL E       DIETAS ENTERAIS"]
[null,"METABOLISMO E NUTRICAO/REGULADORES DO METABOLISMO OSSEO, VI TAMINAS, SUPLEMENTOS MINERAIS E ENZIMATICOS"]
[null,"METABOLISMO E NUTRICAO/SUPLEMENTOS DIETETICOS"]
[null,"OFTALMICOS/AGENTES DIAGNOSTICOS E AUXILIARES CIRURGICOS"]
[null,"OFTALMICOS/ANESTESICOS"]
[null,"OFTALMICOS/ANTIINFECCIOSOS E ANTIINFLAMATORIOS"]
[null,"OFTALMICOS/MIOTICOS, MEDRIATICOS, CICLOPLEGICOS E ANTIGLAUCOMATOSOS"]
[null,"OFTALMICOS/UMECTANTES"]
[null,"ORGAOS HEMATOPOIETICOS E SANGUE/ANTIAGREGANTE PLAQUETARIO"]
[null,"ORGAOS HEMATOPOIETICOS E SANGUE/ANTIANEMICOS"]
[null,"ORGAOS HEMATOPOIETICOS E SANGUE/ANTICOAGULANTES"]
[null,"ORGAOS HEMATOPOIETICOS E SANGUE/ANTI-HEMORRAGICOS"]
[null,"ORGAOS HEMATOPOIETICOS E SANGUE/ESTIMULANTES E INIBIDORES"]
[null,"ORGAOS HEMATOPOIETICOS E SANGUE/EXPANSORES E PLASMATICOS"]
[null,"ORGAOS HEMATOPOIETICOS E SANGUE/FATORES E COAGULACAO E CORRELATOS"]
[null,"ORGAOS HEMATOPOIETICOS E SANGUE/FIBRINOLITICOS"]
[null,"SISTEMA CIRCULARORIO/CARDIOTONICOS"]
[null,"SISTEMA CIRCULATORIO/ANTIANGINOSOS"]
[null,"SISTEMA CIRCULATORIO/ANTIARRITMICOS"]
[null,"SISTEMA CIRCULATORIO/ANTI-HIPERTENSIVOS"]
[null,"SISTEMA CIRCULATORIO/BLOQUEADORES DOS CANAIS DE CALCIO"]
[null,"SISTEMA CIRCULATORIO/VASODILATADORES E ESCLEROSANTES"]
[null,"SISTEMA MUSCULO ESQUELETICO/ANTIGOTOSOS"]
[null,"SISTEMA MUSCULO ESQUELETICO/RELAXANTES MUSCULARES"]
[null,"SISTEMA NERVOSO AUTONOMO/ADRENERGICOS"]
[null,"SISTEMA NERVOSO AUTONOMO/ANTI-HISTAMINICOS"]
[null,"SISTEMA NERVOSO AUTONOMO/BLOQUEADORES COLINERGICOS E ANTIES PASMODICOS"]
[null,"SISTEMA NERVOSO AUTONOMO/COLINERGICOS"]
[null,"SISTEMA NERVOSO CENTRAL E PERIFERICO/ANALGESICOS, ANTIINFLA MATORIOS E ANTIPIRETICOS"]
[null,"SISTEMA NERVOSO CENTRAL E PERIFERICO/ANESTESICOS GERAIS"]
[null,"SISTEMA NERVOSO CENTRAL E PERIFERICO/ANESTESICOS LOCAIS"]
[null,"SISTEMA NERVOSO CENTRAL E PERIFERICO/ANSIOLITICOS"]
[null,"SISTEMA NERVOSO CENTRAL E PERIFERICO/ANTICONVULSIVANTES"]
[null,"SISTEMA NERVOSO CENTRAL E PERIFERICO/ANTIDEPRESSIVOS E ESTA BILIZADORES DO HUMOR"]
[null,"SISTEMA NERVOSO CENTRAL E PERIFERICO/ANTIPARKINSONIANOS"]
[null,"SISTEMA NERVOSO CENTRAL E PERIFERICO/ANTIVERTIGINOSOS"]
[null,"SISTEMA NERVOSO CENTRAL E PERIFERICO/BLOQUADORES MUSCULARES"]
[null,"SISTEMA NERVOSO CENTRAL E PERIFERICO/HIPNOTICOS E SEDATIVOS"]
[null,"SISTEMA NERVOSO CENTRAL E PERIFERICO/HIPOANALGESICOS"]
[null,"SISTEMA NERVOSO CENTRAL E PERIFERICO/NEUROLEPTICOS/ANTIPSICOTICOS"]
[null,"SISTEMA NERVOSO CENTRAL E PERIFERICO/TERAPEUTICA DA DOENCA  DE ALZHEIMER"]
[null,"SOLUCOES PARA DIALISE, HEMODIALISE E IRRIGACAO"]
[null,"USO EXTERNO/ANTIINFECCIOSOS, ANTIINFLAMATORIOS E ANTI-HEMOR ROIDARIOS"]
[null,"USO EXTERNO/ANTIPARASITARIOS E FUNGICIDAS"]
[null,"USO EXTERNO/ANTISSEPTICOS"]
[null,"USO EXTERNO/PROTETORES E REDUTORES"]
[null,"USO TOPICO UTILIZADOS EM OTORRINOLARINGOLOGIA/ANTIINFECCIO  SOS E ANTIINFLAMATORIOS"]
[null,"USO TOPICO UTILIZADOS EM OTORRINOLARINGOLOGIA/DESCONGESTIO  NANTES"]
[null,"USO TOPICO UTILIZADOS EM OTORRINOLARINGOLOGIA/EMOLIENTES"]
[null,"VETERINARIOS"]
["MEDICAMENTOS Total"]
["MEDICAMENTOS (GRUPO AUXILIAR)","MEDICAMENTOS DE URGENCIA"]
["MEDICAMENTOS (GRUPO AUXILIAR) Total"]
["MINERIOS, MINERAIS E SEUS PRODUTOS PRIMARIOS SEMIACABADOS","MINERAIS NATURAIS E SINTETICOS"]
[null,"PRODUTOS PRIMARIOS E SEMIACABADOS DE FERRO E DE ACO"]
[null,"PRODUTOS PRIMARIOS E SEMIACABADOS DE METAIS NAO FERROSOS"]
[null,"SUCATA DE FERRO E DE ACO"]
[null,"SUCATA DE METAIS NAO FERROSOS"]
["MINERIOS, MINERAIS E SEUS PRODUTOS PRIMARIOS SEMIACABADOS Total"]
["MOBILIARIO","COMPONENTES E PECAS PARA MOBILIARIO"]
[null,"ESTANTES E ARMACOES PARA ALMOXARIFADOS"]
[null,"MOBILIARIO DE ESCRITORIO"]
[null,"MOBILIARIO DE USO GERAL"]
[null,"MOBILIARIO DIVERSO E ESPECIAL"]
[null,"MOBILIARIO ESCOLAR E DE AUDITORIO"]
[null,"MOBILIARIO PARA AREA DE INFORMATICA"]
["MOBILIARIO Total"]
["MOTORES, TURBINAS E COMPONENTES","MOTORES A GASOLINA, ALCOOL, GAS E COMPONENTES,EXCETO DE AERONAVES E COMPONENTES"]
[null,"MOTORES DIESEL E COMPONENTES"]
["MOTORES, TURBINAS E COMPONENTES Total"]
["OBRAS CIVIS, ADAPTACOES, REPAROS E MONTAGENS","AQUISICAO DE IMOVEIS NECESSARIOS A REALIZACAO DE OBRAS"]
[null,"DESAPROPRIACOES DE IMOVEIS PARA OBRAS E INSTALACOES"]
[null,"INSTALACOES INCORPORAVEIS A OBRAS"]
[null,"OUTRAS ATIVIDADES NECESSARIAS DE OBRAS E INSTALACOES POR CONTRATO"]
[null,"SERVICOS DE DEMOLICOES, ADAPTACAO E REPAROS DE BENS IMOVEIS"]
[null,"SERVICOS DE EXECUCAO DE OBRAS DIRETAS"]
[null,"SERVICOS DE EXECUCAO DE OBRAS POR CONTRATO"]
["OBRAS CIVIS, ADAPTACOES, REPAROS E MONTAGENS Total"]
["PNEUS, CAMARAS DE AR E MATERIAIS CORRELATOS","MATERIAIS PARA RECONDICIONAMENTO E ACESSORIOS DE PNEUS  E CAMARAS DE AR"]
[null,"PNEUS E CAMARAS DE AR, DE AERONAVES"]
[null,"PNEUS E CAMARAS DE AR, EXCETO DE AERONAVES"]
["PNEUS, CAMARAS DE AR E MATERIAIS CORRELATOS Total"]
["RECIPIENTES E MATERIAIS PARA ACONDICIONAMENTO E EMBALAGEM","BOLSAS E SACOS"]
[null,"CAIXAS E ENGRADADOS"]
[null,"CILINDROS PARA GASES, PECAS E COMPONENTES"]
[null,"GARRAFAS E GARRAFOES"]
[null,"MATERIAIS DIVERSOS PARA ACONDICIONAMENTO E EMBALAGEM"]
[null,"RECIPIENTES PARA MUNICOES E EXPLOSIVOS"]
[null,"TAMBORES E LATAS"]
["RECIPIENTES E MATERIAIS PARA ACONDICIONAMENTO E EMBALAGEM Total"]
["ROLAMENTOS E MANCAIS","MANCAIS E COMPONENTES"]
[null,"ROLAMENTOS E COMPONENTES"]
["ROLAMENTOS E MANCAIS Total"]
["SERVICO DE MANUTENCAO, REPAROS E ADAPTACOES EM EQUIPAMENTOS,MAQUINAS, APARELHOS, FERRAMENTAS E INSTRUMENTAL","MANUTECAO E REPAROS EM EQUIPAMENTOS DE PROCESSAMENTO DE DA  DOS"]
[null,"MANUTENCAO E REPARO DE ESTRUTURA COBERTA DE LONA, POLIESTER OU OUTROS MATERIAIS"]
[null,"MANUTENCAO E REPARO EM EQUIPAMENTOS FERROVIARIOS"]
[null,"MANUTENCAO E REPARO EM EQUIPAMENTOS PARA PURIFICACAO E TRATAMENTO DE AGUA E TRATAMENTO DE ESGOTOS"]
[null,"MANUTENCAO E REPARO EM FERRAMENTAS DO GRUPO DE MATERIAL     51 (FERRAMENTAS MANUAIS E COMPONENTES)"]
[null,"MANUTENCAO E REPARO EM RECIPIENTES PARA GASES E SISTEMAS CENTRALIZADOS DE GASES"]
[null,"MANUTENCAO E REPAROS EM AERONAVES, COMPONENTES E ACESSORIOS"]
[null,"MANUTENCAO E REPAROS EM APARELHOS, EQUIPAMENTOS E UTENSILIOSDE COPA E COZINHA"]
[null,"MANUTENCAO E REPAROS EM EQUIPAMENTOS AUDIO-VISUAIS"]
[null,"MANUTENCAO E REPAROS EM EQUIPAMENTOS DE AUTOMACAO, ARMAZEM, DEPOSITO"]
[null,"MANUTENCAO E REPAROS EM EQUIPAMENTOS DE COMUNICACAO E TELECOMUNICACAO"]
[null,"MANUTENCAO E REPAROS EM EQUIPAMENTOS DE LABORATORIO E EQUIPAMENTOS E INSTRUMENSTOS DE ENSAIO E MEDICAO"]
[null,"MANUTENCAO E REPAROS EM EQUIPAMENTOS DE REFRIGERACAO E CONDICIONAMENTO DE AR"]
[null,"MANUTENCAO E REPAROS EM EQUIPAMENTOS DE SEGURANCA/PROTECAO  DE EDIFICACOES, INDUSTRIAL E PESSOAL"]
[null,"MANUTENCAO E REPAROS EM EQUIPAMENTOS DE SOM, VIDEO, FOTOGRA FICOS, CINEMATOGRAFICOS E DE ILUMINACAO"]
[null,"MANUTENCAO E REPAROS EM EQUIPAMENTOS E APARELHOS DE TRANSMISSAO/CONTROLE/GERACAO DE ENERGIA"]
[null,"MANUTENCAO E REPAROS EM EQUIPAMENTOS E SISTEMAS DE SINALIZA CAO E ALARME"]
[null,"MANUTENCAO E REPAROS EM EQUIPAMENTOS E UTENSILIOS DE ESCRITORIO"]
[null,"MANUTENCAO E REPAROS EM EQUIPAMENTOS ESPECIALIZADOS PARA MA NUTECAO E REPAROS"]
[null,"MANUTENCAO E REPAROS EM EQUIPAMENTOS PARA CONSTRUCAO, MINERACAO, ESCAVACAO E CONSERVACAO DE ESTRADAS"]
[null,"MANUTENCAO E REPAROS EM EQUIPAMENTOS PARA LIMPEZA"]
[null,"MANUTENCAO E REPAROS EM INSTALACOES PREDIAIS"]
[null,"MANUTENCAO E REPAROS EM MAQUINARIA E EQUIPAMENTOS AGRICOLAS"]
[null,"MANUTENCAO E REPAROS EM MAQUINAS E EQUIPAMENTOS P/ INDUSTRI A ESPECIALIZADA"]
[null,"MANUTENCAO E REPAROS EM MOBILIARIO EM GERAL"]
[null,"MANUTENCAO E REPAROS EM PNEUS E CAMARAS DE AR"]
[null,"MANUTENCAO E REPAROS EM SISTEMAS/EQUIPAMENTOS COMERCIAIS, INDUSTRIAIS E DE SERVICOS"]
[null,"MANUTENCAO E REPAROS EM VIATURAS, EQUIPAMENTOS PARA MOVIMEN TACAO DE MATERIAL"]
[null,"MANUTENCAO, ADAPTACOES E REPAROS EM EQUIPAMENTOS PARA RECRE ACAO, ATLETISMO, DESPORTO E CIVICO"]
[null,"MANUTENCAO, REPAROS E ADAPTACOES EM EMBARCACOES, COMPONENTES E ACESSORIOS"]
[null,"MANUTENCAO, REPAROS E ADAPTACOES EM EQUIPAMENTOS, INSTRUMEN TOS MEDICOS, ODONTOLOGICOS E HOSPITALARES"]
[null,"MANUTENCAO, REPAROS E ADAPTACOES EM VEICULOS AUTOMOTORES"]
[null,"MANUTENCAO, REPAROS E E ADAPTACOES EM ARMAMENTOS"]
[null,"RECUPERACAO E RECONDICIONAMENTO DE PECAS DE VEICULOS        AUTOMOTORES"]
[null,"SERVICOS DE RECUPERACAO E RECONDICIONAMENTO DE PECAS DE     EQUIPAMENTOS PARA INFORMATICA"]
[null,"SERVICOS DE RECUPERACAO E RECONDICIONAMENTO DE PECAS PARA   EQUIPAMENTOS DE INDUSTRIA GRAFICA"]
["SERVICO DE MANUTENCAO, REPAROS E ADAPTACOES EM EQUIPAMENTOS,MAQUINAS, APARELHOS, FERRAMENTAS E INSTRUMENTAL Total"]
["SERVICOS DE ESTUDOS E PROJETOS","SERVICOS TECNICOS, ESTUDOS E PROJETOS"]
["SERVICOS DE ESTUDOS E PROJETOS Total"]
["SERVICOS DE INSTALACOES E MONTAGENS","SERVICOS DE ADMINISTRACAO DE EDIFICACOES"]
[null,"SERVICOS DE INSTALACAO E MONTAGEM  DE  EQUIPAMENTOS,  ACESSORIOS, COMPONENTES E BENS DE SERVICOS"]
["SERVICOS DE INSTALACOES E MONTAGENS Total"]
["SERVICOS DE TECNOLOGIA DA INFORMACAO E COMUNICACAO - TIC","ARMAZEM DE INFORMACAO"]
[null,"BUSINESS INTELLIGENCE"]
[null,"CERTIFICACAO DIGITAL"]
[null,"DATACENTER"]
[null,"DESENVOLVIMENTO DE SOLUCAO DE EDUCACAO A DISTANCIA"]
[null,"GESTAO DE CONTEUDO"]
[null,"SERVICOS DE INFRAESTRUTURA"]
[null,"SERVICOS DE REDE"]
[null,"SISTEMAS DE INFORMACAO"]
[null,"SOLUCOES CORPORATIVAS"]
["SERVICOS DE TECNOLOGIA DA INFORMACAO E COMUNICACAO - TIC Total"]
["SERVICOS TECNICOS ESPECIALIZADOS NA AREA DE CONSTRUCAO CIVIL","ESTUDOS E PROJETOS PARA OBRAS E INSTALACOES"]
["SERVICOS TECNICOS ESPECIALIZADOS NA AREA DE CONSTRUCAO CIVIL Total"]
["SUBSTANCIAS E PRODUTOS QUIMICOS","COMPOSTOS QUIMICOS, PRODUTOS QUIMICOS E REAGENTES PARA INDUSTRIA FARMACEUTICA"]
[null,"DESINFETANTES E AGENTES PARA COMBATE A PRAGAS"]
[null,"ESPECIALIDADES QUIMICAS"]
[null,"GASES: COMPRIMIDOS E LIQUIFEITOS"]
[null,"REAGENTES QUIMICOS"]
[null,"REAGENTES QUIMICOS, CORANTES E INDICADORES"]
["SUBSTANCIAS E PRODUTOS QUIMICOS Total"]
["TECIDOS, COUROS, MATERIAIS CORRELATOS E MIUDEZAS, AVIAMENTOS PARA COSTURA EM GERAL","ARTIGOS PARA CALCADOS"]
[null,"BANDEIRAS E GALHARDETES"]
[null,"BARRACAS E ENCERADOS"]
[null,"COUROS"]
[null,"FIOS E LINHAS PARA COSTURA"]
[null,"MATERIAL PARA ESTOFAMENTO E ACOLCHOAMENTO"]
[null,"MIUDEZAS E AVIAMENTOS DE COSTURA"]
[null,"TECIDOS"]
["TECIDOS, COUROS, MATERIAIS CORRELATOS E MIUDEZAS, AVIAMENTOS PARA COSTURA EM GERAL Total"]
["TINTAS, EQUIPAMENTOS PARA PINTURA, SECANTES E ADESIVOS","ADESIVOS"]
[null,"COMPOSTOS PRESERVATIVOS E SELANTES"]
[null,"EQUIPAMENTOS E UTENSILIOS PARA PINTURA"]
[null,"TINTAS, VERNIZES E PRODUTOS CORRELATOS"]
["TINTAS, EQUIPAMENTOS PARA PINTURA, SECANTES E ADESIVOS Total"]
["TRANSPORTE","FORNECIMENTO DE COMBUSTIVEL E LUBRIFICANTE"]
[null,"OUTROS SERVICOS COM TRANSPORTE/DESLOCAMENTOS"]
[null,"SERVICO DE FORNECIMENTO DE PASSAGEM"]
[null,"SERVICO TRANSPORTE E ACONDICIONAMENTO DE MATERIAIS E ANIMAIS"]
[null,"SERVICOS DE TRANSPORTES DE DOCUMENTOS, DE BENS E DE VALORES"]
["TRANSPORTE Total"]
["TRATORES","ACESSORIOS E COMPONENTES PARA TRATOR DE RODA"]
[null,"TRATORES DE RODA"]
["TRATORES Total"]
["TUBOS, TUBULACOES, MANGUEIRAS E CONEXOES","CONEXOES E ACESSORIOS PARA TUBOS E MANGUEIRAS"]
[null,"MANGUEIRAS E TUBULACOES FLEXIVEIS"]
[null,"TUBO RIGIDO"]
["TUBOS, TUBULACOES, MANGUEIRAS E CONEXOES Total"]
["VALVULAS E REGISTROS","COMPONENTES E PECAS PARA VALVULAS E REGISTROS"]
[null,"VALVULAS E REGISTROS"]
[null,"VALVULAS MOTORIZADAS"]
["VALVULAS E REGISTROS Total"]
["VEICULOS PARA TRANSPORTE RODOVIARIO DE PASSAGEIROS E  DE CARGA","OUTROS VEICULOS DE 02,03 OU 04 RODAS, COMPONENTES E PECAS"]
[null,"REBOQUES"]
[null,"VEICULOS ESPECIAIS"]
[null,"VEICULOS MOTORIZADOS DE SERVICO PARA TRANSPORTE DE CARGA"]
[null,"VEICULOS MOTORIZADOS DE SERVICO PARA TRANSPORTE DE PASSAGEIROS"]
[null,"VEICULOS MOTORIZADOS PARA TRANSPORTE DE CARGA"]
[null,"VEICULOS MOTORIZADOS PARA TRANSPORTE DE PASSAGEIRO"]
[null,"VIATURAS"]
["VEICULOS PARA TRANSPORTE RODOVIARIO DE PASSAGEIROS E  DE CARGA Total"]
["VESTUARIOS E EQUIPAMENTOS INDIVIDUAIS DE USO COMUM E  ESPECIAL","ARTIGOS E ACESSORIOS PARA CRIANCA E ADOLESCENTE"]
[null,"CALCADOS PARA HOMEM"]
[null,"CALCADOS PARA MULHER"]
[null,"DISTINTIVOS E INSIGNIAS"]
[null,"EQUIPAMENTOS INDIVIDUAIS DE USOS DIVERSOS"]
[null,"FARDAMENTO BOMBEIRO MILITAR"]
[null,"FARDAMENTO POLICIAL"]
[null,"MALARIA"]
[null,"MEIAS, LUVAS E COMPLEMENTOS DE VESTUARIO PARA HOMEM"]
[null,"MEIAS, LUVAS E COMPLEMENTOS DE VESTUARIO PARA MULHER"]
[null,"ROUPAS DE BAIXO E DE DORMIR, PARA HOMEM"]
[null,"ROUPAS DE BAIXO E DE DORMIR, PARA MULHER"]
[null,"VESTUARIO ESPECIAL"]
[null,"VESTUARIOS EXTERIORES PARA HOMEM"]
[null,"VESTUARIOS EXTERIORES PARA MULHER"]
[null,"VESTUARIOS UNISSEX"]
["VESTUARIOS E EQUIPAMENTOS INDIVIDUAIS DE USO COMUM E  ESPECIAL Total"]
["VIATURAS, EQUIPAMENTOS PARA MOVIMENTACAO DE MATERIAL","BLOCOS, MOITOES, ARTICULACOES E ESTROPOS,PECAS E COMPONENTES"]
[null,"COMPONENTES E ACESSORIOS DE  ELEVADORES P/ CONTRATOS DE MANUTENCAO PREVENTIVA/CORRETIVA"]
[null,"ELEVADORES E ESCADAS ROLANTES, PECAS E COMPONENTES"]
[null,"EQUIPAMENTOS E ARTIGOS DIVERSOS PARA MOVIMENTACAO DE MATERIAIS, PECAS E COMPONENTES"]
[null,"GUINCHOS, TALHAS, GUINDASTES E CABREAS, PECAS E COMPONENTES"]
[null,"TRANSPORTADORES, PECAS E COMPONENTES"]
[null,"VIATURAS P/MOVIMENTACAO DE MATERIAIS, NAO MOTORIZADAS, PECASE COMPONENTES"]
[null,"VIATURAS PARA  MOVIMENTACAO DE MATERIAIS, MOTORIZADAS, PECAS E COMPONENTES"]
["VIATURAS, EQUIPAMENTOS PARA MOVIMENTACAO DE MATERIAL Total"]
["Total Geral"]

{"sheet":"LISTA DE GRUPOS DIVIDIDA","index":2,"n_rows":82,"n_cols":4,"rows_kept":82,"cut":false,"hidden":true,"merged":[]}
[]
["ACESSORIOS DE MOTORES","MATERIAL"]
["AERONAVES E COMPONENTES ESTRUTURAIS","MATERIAL",null,"Sim"]
["ANIMAIS VIVOS E MATERIAIS GENETICOS","MATERIAL",null,"Não"]
["APARELHOS E MEIOS AUXILIARES PARA TREINAMENTO","MATERIAL"]
["APARELHOS E UTENSILIOS PARA MEDICAO E INSPECAO","MATERIAL"]
["ARAMES LAMINADOS PLANOS E PERFILADOS METALICOS","MATERIAL"]
["ARTIGOS DE ESCRITORIO","MATERIAL"]
["ARTIGOS DOMESTICOS E COMERCIAIS","MATERIAL"]
["ARTIGOS PARA TOUCADOR E HIGIENE PESSOAL","MATERIAL"]
["BOMBAS E COMPRESSORES","MATERIAL"]
["CABO FIBRA OPTICA","MATERIAL"]
["CABOS DE ACO CORDAS CORRENTES CORDOALHAS E ACESSORIOS","MATERIAL"]
["COMBUSTIVEIS LUBRIFICANTES OLEOS GRAXAS E CERAS","MATERIAL"]
["COMPONENTES DE EQUIPAMENTOS ELETRICOS E ELETRONICOS","MATERIAL"]
["COMPONENTES PARA VEICULOS","MATERIAL"]
["EMBARCACOES PONTOES E DIQUES FLUTUANTES","MATERIAL"]
["EQUIPAMENTOS COMERCIAIS E DE SERVICOS","MATERIAL"]
["EQUIPAMENTOS DE CALEFACAO AQUECIMENTO E INSTALACOES SANITARIAS","MATERIAL"]
["EQUIPAMENTOS DE COMUNICACOES","MATERIAL"]
["EQUIPAMENTOS DE LABORATORIO E INSTRUMENTOS DE MEDICAO","MATERIAL"]
["EQUIPAMENTOS DE REFRIGERACAO CONDICIONAMENTO DE AR E VENTI LACAO","MATERIAL"]
["EQUIPAMENTOS DE SINALIZACAO E ALARME","MATERIAL"]
["EQUIPAMENTOS E MAQUINARIA PARA TRABALHOS EM MADEIRA","MATERIAL"]
["EQUIPAMENTOS E MAQUINARIA PARA TRABALHOS EM METAL","MATERIAL"]
["EQUIPAMENTOS ESPECIALIZADOS PARA MANUTENCAO E REPAROS","MATERIAL"]
["EQUIPAMENTOS PARA  REFEITORIO COPA E COZINHA","MATERIAL"]
["EQUIPAMENTOS PARA CONSTRUCAO MINERACAO ESCAVACAO E  CONSERVACAO DE ESTRADAS","MATERIAL"]
["EQUIPAMENTOS PARA PURIFICACAO  E TRATAMENTO DE AGUA  E TRATAMENTO DE ESGOTOS","MATERIAL"]
["EQUIPAMENTOS PARA SEGURANCA PESSOAL E INDUSTRIAL","MATERIAL"]
["EQUIPAMENTOS PARA TRANSMISSAO DE ENERGIA MECANICA","MATERIAL"]
["EQUIPAMENTOS PERIFERICOS ACESSORIOS  E SUPRIMENTOS  DE PROCESSAMENTO DE DADOS EM GERAL","MATERIAL"]
["ESTRUTURAS E ANDAIMES PRE FABRICADOS","MATERIAL"]
["EXPLOSIVOS MUNICOES E DISPOSITIVOS DE DISPERSAO","MATERIAL"]
["FERRAGENS ABRASIVOS E MATERIAIS PARA VEDACAO","MATERIAL"]
["FERRAMENTAS MANUAIS E COMPONENTES","MATERIAL"]
["FIOS CABOS TELEFONICOS CONDUITES ELETRICOS EQUIPAMENTO PARA GERACAO E DISTRIBUICAO DE ENERGIA","MATERIAL"]
["FORNOS CENTRAIS DE VAPOR E EQUIPAMENTOS PARA SECAGEM","MATERIAL"]
["FORRAGENS FERTILIZANTES SEMENTES E MUDAS","MATERIAL"]
["GENEROS ALIMENTICIOS E BEBIDAS","MATERIAL"]
["INSTRUMENTOS MUSICAIS RADIOS FONOGRAFOS TELEVISOR VIDEO AUDIO SONORIZACAO E ACESSORIOS","MATERIAL"]
["LAMPADAS E APARELHOS DE ILUMINACAO","MATERIAL"]
["LIVROS MAPAS E OUTRAS PUBLICACOES","MATERIAL"]
["MADEIRAS  ESQUADRIAS  COMPENSADOS E FOLHEADOS","MATERIAL"]
["MAQUINARIA E EQUIPAMENTOS AGRICOLAS","MATERIAL"]
["MAQUINARIA EQUIPAMENTOS COMPONENTES E SUPRIMENTOS PARA A  INDUSTRIA ESPECIALIZADA","MATERIAL"]
["MAQUINAS DE ESCRITORIO E EQUIPAMENTO DE REGISTRO VISUAL","MATERIAL"]
["MATERIAIS DIVERSOS","MATERIAL"]
["MATERIAIS E EQUIPAMENTOS FOTOGRAFICOS E CINEMATOGRAFICOS","MATERIAL"]
["MATERIAIS E EQUIPAMENTOS PARA EMBARCACOES","MATERIAL"]
["MATERIAIS E EQUIPAMENTOS PARA LIMPEZA","MATERIAL"]
["MATERIAIS E EQUIPAMENTOS PARA RECREACAO E DESPORTO","MATERIAL"]
["MATERIAIS E EQUIPAMENTOS PARA USOS MEDICOS ODONTOLOGICOS  E VETERINARIOS","MATERIAL"]
["MATERIAIS MANUFATURADOS NAO METALICOS","MATERIAL"]
["MATERIAIS PARA CONSTRUCAO","MATERIAL"]
["MATERIAIS PARA EXECUCAO DE OBRAS","MATERIAL"]
["MATERIAS PRIMAS NAO METALICAS","MATERIAL"]
["MEDICAMENTO","MATERIAL"]
["MINERIOS MINERAIS E SEUS PRODUTOS PRIMARIOS SEMIACABADOS","MATERIAL"]
["MOBILIARIO","MATERIAL"]
["MOTORES TURBINAS E COMPONENTES","MATERIAL"]
["PNEUS CAMARAS DE AR E MATERIAIS CORRELATOS","MATERIAL"]
["RECIPIENTES E MATERIAIS PARA ACONDICIONAMENTO E EMBALAGEM","MATERIAL"]
["ROLAMENTOS E MANCAIS","MATERIAL"]
["SUBSTANCIAS E PRODUTOS QUIMICOS","MATERIAL"]
["TECIDOS COUROS MATERIAIS CORRELATOS E MIUDEZAS AVIAMENTOS PARA COSTURA EM GERAL","MATERIAL"]
["TINTAS EQUIPAMENTOS PARA PINTURA SECANTES E ADESIVOS","MATERIAL"]
["TRATORES","MATERIAL"]
["TUBOS TUBULACOES MANGUEIRAS E CONEXOES","MATERIAL"]
["VALVULAS E REGISTROS","MATERIAL"]
["VEICULOS PARA TRANSPORTE RODOVIARIO DE PASSAGEIROS E  DE CARGA","MATERIAL"]
["VESTUARIOS E EQUIPAMENTOS INDIVIDUAIS DE USO COMUM E  ESPECIAL","MATERIAL"]
["VIATURAS EQUIPAMENTOS PARA MOVIMENTACAO DE MATERIAL","MATERIAL"]
["ADMINISTRACAO GERAL","SERVICO"]
["LOCACOES","SERVICO"]
["OBRAS CIVIS ADAPTACOES REPAROS E MONTAGENS","SERVICO"]
["SERVICO DE MANUTENCAO REPAROS E ADAPTACOES EM EQUIPAMENTOSMAQUINAS APARELHOS FERRAMENTAS E INSTRUMENTAL","SERVICO"]
["SERVICOS DE ESTUDOS E PROJETOS","SERVICO"]
["SERVICOS DE INSTALACOES E MONTAGENS","SERVICO"]
["SERVICOS DE TECNOLOGIA DA INFORMACAO E COMUNICACAO TIC","SERVICO"]
["SERVICOS TECNICOS ESPECIALIZADOS NA AREA DE CONSTRUCAO CIVIL","SERVICO"]
["TRANSPORTE","SERVICO"]

{"sheet":"LISTA DE GRUPOS","index":3,"n_rows":81,"n_cols":4,"rows_kept":81,"cut":false,"hidden":true,"merged":[]}
["ACESSORIOS DE MOTORES",{"$f":"VLOOKUP('LISTA DE GRUPOS'!A1,'Relatório 1'!D5:E830,2,FALSE)","v":"MATERIAL"}]
["ADMINISTRACAO GERAL",{"$f":"VLOOKUP('LISTA DE GRUPOS'!A2,'Relatório 1'!D6:E831,2,FALSE)","v":"SERVICO"},null,"Sim"]
["AERONAVES E COMPONENTES ESTRUTURAIS",{"$f":"VLOOKUP('LISTA DE GRUPOS'!A3,'Relatório 1'!D7:E832,2,FALSE)","v":"MATERIAL"},null,"Não"]
["ANIMAIS VIVOS E MATERIAIS GENETICOS",{"$f":"VLOOKUP('LISTA DE GRUPOS'!A4,'Relatório 1'!D8:E833,2,FALSE)","v":"MATERIAL"}]
["APARELHOS E MEIOS AUXILIARES PARA TREINAMENTO",{"$f":"VLOOKUP('LISTA DE GRUPOS'!A5,'Relatório 1'!D9:E834,2,FALSE)","v":"MATERIAL"}]
["APARELHOS E UTENSILIOS PARA MEDICAO E INSPECAO",{"$f":"VLOOKUP('LISTA DE GRUPOS'!A6,'Relatório 1'!D10:E835,2,FALSE)","v":"MATERIAL"}]
["ARAMES LAMINADOS PLANOS E PERFILADOS METALICOS",{"$f":"VLOOKUP('LISTA DE GRUPOS'!A7,'Relatório 1'!D11:E836,2,FALSE)","v":"MATERIAL"}]
["ARTIGOS DE ESCRITORIO",{"$f":"VLOOKUP('LISTA DE GRUPOS'!A8,'Relatório 1'!D12:E837,2,FALSE)","v":"MATERIAL"}]
["ARTIGOS DOMESTICOS E COMERCIAIS",{"$f":"VLOOKUP('LISTA DE GRUPOS'!A9,'Relatório 1'!D13:E838,2,FALSE)","v":"MATERIAL"}]
["ARTIGOS PARA TOUCADOR E HIGIENE PESSOAL",{"$f":"VLOOKUP('LISTA DE GRUPOS'!A10,'Relatório 1'!D14:E839,2,FALSE)","v":"MATERIAL"}]
["BOMBAS E COMPRESSORES",{"$f":"VLOOKUP('LISTA DE GRUPOS'!A11,'Relatório 1'!D15:E840,2,FALSE)","v":"MATERIAL"}]
["CABO FIBRA OPTICA",{"$f":"VLOOKUP('LISTA DE GRUPOS'!A12,'Relatório 1'!D16:E841,2,FALSE)","v":"MATERIAL"}]
["CABOS DE ACO CORDAS CORRENTES CORDOALHAS E ACESSORIOS",{"$f":"VLOOKUP('LISTA DE GRUPOS'!A13,'Relatório 1'!D17:E842,2,FALSE)","v":"MATERIAL"}]
["COMBUSTIVEIS LUBRIFICANTES OLEOS GRAXAS E CERAS",{"$f":"VLOOKUP('LISTA DE GRUPOS'!A14,'Relatório 1'!D18:E843,2,FALSE)","v":"MATERIAL"}]
["COMPONENTES DE EQUIPAMENTOS ELETRICOS E ELETRONICOS",{"$f":"VLOOKUP('LISTA DE GRUPOS'!A15,'Relatório 1'!D19:E844,2,FALSE)","v":"MATERIAL"}]
["COMPONENTES PARA VEICULOS",{"$f":"VLOOKUP('LISTA DE GRUPOS'!A16,'Relatório 1'!D20:E845,2,FALSE)","v":"MATERIAL"}]
["EMBARCACOES PONTOES E DIQUES FLUTUANTES",{"$f":"VLOOKUP('LISTA DE GRUPOS'!A17,'Relatório 1'!D21:E846,2,FALSE)","v":"MATERIAL"}]
["EQUIPAMENTOS COMERCIAIS E DE SERVICOS",{"$f":"VLOOKUP('LISTA DE GRUPOS'!A18,'Relatório 1'!D22:E847,2,FALSE)","v":"MATERIAL"}]
["EQUIPAMENTOS DE CALEFACAO AQUECIMENTO E INSTALACOES SANITARIAS",{"$f":"VLOOKUP('LISTA DE GRUPOS'!A19,'Relatório 1'!D23:E848,2,FALSE)","v":"MATERIAL"}]
["EQUIPAMENTOS DE COMUNICACOES",{"$f":"VLOOKUP('LISTA DE GRUPOS'!A20,'Relatório 1'!D24:E849,2,FALSE)","v":"MATERIAL"}]
["EQUIPAMENTOS DE LABORATORIO E INSTRUMENTOS DE MEDICAO",{"$f":"VLOOKUP('LISTA DE GRUPOS'!A21,'Relatório 1'!D25:E850,2,FALSE)","v":"MATERIAL"}]
["EQUIPAMENTOS DE REFRIGERACAO CONDICIONAMENTO DE AR E VENTI LACAO",{"$f":"VLOOKUP('LISTA DE GRUPOS'!A22,'Relatório 1'!D26:E851,2,FALSE)","v":"MATERIAL"}]
["EQUIPAMENTOS DE SINALIZACAO E ALARME",{"$f":"VLOOKUP('LISTA DE GRUPOS'!A23,'Relatório 1'!D27:E852,2,FALSE)","v":"MATERIAL"}]
["EQUIPAMENTOS E MAQUINARIA PARA TRABALHOS EM MADEIRA",{"$f":"VLOOKUP('LISTA DE GRUPOS'!A24,'Relatório 1'!D28:E853,2,FALSE)","v":"MATERIAL"}]
["EQUIPAMENTOS E MAQUINARIA PARA TRABALHOS EM METAL",{"$f":"VLOOKUP('LISTA DE GRUPOS'!A25,'Relatório 1'!D29:E854,2,FALSE)","v":"MATERIAL"}]
["EQUIPAMENTOS ESPECIALIZADOS PARA MANUTENCAO E REPAROS",{"$f":"VLOOKUP('LISTA DE GRUPOS'!A26,'Relatório 1'!D30:E855,2,FALSE)","v":"MATERIAL"}]
["EQUIPAMENTOS PARA  REFEITORIO COPA E COZINHA",{"$f":"VLOOKUP('LISTA DE GRUPOS'!A27,'Relatório 1'!D31:E856,2,FALSE)","v":"MATERIAL"}]
["EQUIPAMENTOS PARA CONSTRUCAO MINERACAO ESCAVACAO E  CONSERVACAO DE ESTRADAS",{"$f":"VLOOKUP('LISTA DE GRUPOS'!A28,'Relatório 1'!D32:E857,2,FALSE)","v":"MATERIAL"}]
["EQUIPAMENTOS PARA PURIFICACAO  E TRATAMENTO DE AGUA  E TRATAMENTO DE ESGOTOS",{"$f":"VLOOKUP('LISTA DE GRUPOS'!A29,'Relatório 1'!D33:E858,2,FALSE)","v":"MATERIAL"}]
["EQUIPAMENTOS PARA SEGURANCA PESSOAL E INDUSTRIAL",{"$f":"VLOOKUP('LISTA DE GRUPOS'!A30,'Relatório 1'!D34:E859,2,FALSE)","v":"MATERIAL"}]
["EQUIPAMENTOS PARA TRANSMISSAO DE ENERGIA MECANICA",{"$f":"VLOOKUP('LISTA DE GRUPOS'!A31,'Relatório 1'!D35:E860,2,FALSE)","v":"MATERIAL"}]
["EQUIPAMENTOS PERIFERICOS ACESSORIOS  E SUPRIMENTOS  DE PROCESSAMENTO DE DADOS EM GERAL",{"$f":"VLOOKUP('LISTA DE GRUPOS'!A32,'Relatório 1'!D36:E861,2,FALSE)","v":"MATERIAL"}]
["ESTRUTURAS E ANDAIMES PRE FABRICADOS",{"$f":"VLOOKUP('LISTA DE GRUPOS'!A33,'Relatório 1'!D37:E862,2,FALSE)","v":"MATERIAL"}]
["EXPLOSIVOS MUNICOES E DISPOSITIVOS DE DISPERSAO",{"$f":"VLOOKUP('LISTA DE GRUPOS'!A34,'Relatório 1'!D38:E863,2,FALSE)","v":{"$error":"#N/A"}}]
["FERRAGENS ABRASIVOS E MATERIAIS PARA VEDACAO",{"$f":"VLOOKUP('LISTA DE GRUPOS'!A35,'Relatório 1'!D39:E864,2,FALSE)","v":"MATERIAL"}]
["FERRAMENTAS MANUAIS E COMPONENTES",{"$f":"VLOOKUP('LISTA DE GRUPOS'!A36,'Relatório 1'!D40:E865,2,FALSE)","v":"MATERIAL"}]
["FIOS CABOS TELEFONICOS CONDUITES ELETRICOS EQUIPAMENTO PARA GERACAO E DISTRIBUICAO DE ENERGIA",{"$f":"VLOOKUP('LISTA DE GRUPOS'!A37,'Relatório 1'!D41:E866,2,FALSE)","v":{"$error":"#N/A"}}]
["FORNOS CENTRAIS DE VAPOR E EQUIPAMENTOS PARA SECAGEM",{"$f":"VLOOKUP('LISTA DE GRUPOS'!A38,'Relatório 1'!D42:E867,2,FALSE)","v":"MATERIAL"}]
["FORRAGENS FERTILIZANTES SEMENTES E MUDAS",{"$f":"VLOOKUP('LISTA DE GRUPOS'!A39,'Relatório 1'!D43:E868,2,FALSE)","v":"MATERIAL"}]
["GENEROS ALIMENTICIOS E BEBIDAS",{"$f":"VLOOKUP('LISTA DE GRUPOS'!A40,'Relatório 1'!D44:E869,2,FALSE)","v":"MATERIAL"}]
["INSTRUMENTOS MUSICAIS RADIOS FONOGRAFOS TELEVISOR VIDEO AUDIO SONORIZACAO E ACESSORIOS",{"$f":"VLOOKUP('LISTA DE GRUPOS'!A41,'Relatório 1'!D45:E870,2,FALSE)","v":{"$error":"#N/A"}}]
["LAMPADAS E APARELHOS DE ILUMINACAO",{"$f":"VLOOKUP('LISTA DE GRUPOS'!A42,'Relatório 1'!D46:E871,2,FALSE)","v":"MATERIAL"}]
["LIVROS MAPAS E OUTRAS PUBLICACOES",{"$f":"VLOOKUP('LISTA DE GRUPOS'!A43,'Relatório 1'!D47:E872,2,FALSE)","v":"MATERIAL"}]
["LOCACOES",{"$f":"VLOOKUP('LISTA DE GRUPOS'!A44,'Relatório 1'!D48:E873,2,FALSE)","v":"SERVICO"}]
["MADEIRAS  ESQUADRIAS  COMPENSADOS E FOLHEADOS",{"$f":"VLOOKUP('LISTA DE GRUPOS'!A45,'Relatório 1'!D49:E874,2,FALSE)","v":"MATERIAL"}]
["MAQUINARIA E EQUIPAMENTOS AGRICOLAS",{"$f":"VLOOKUP('LISTA DE GRUPOS'!A46,'Relatório 1'!D50:E875,2,FALSE)","v":"MATERIAL"}]
["MAQUINARIA EQUIPAMENTOS COMPONENTES E SUPRIMENTOS PARA A  INDUSTRIA ESPECIALIZADA",{"$f":"VLOOKUP('LISTA DE GRUPOS'!A47,'Relatório 1'!D51:E876,2,FALSE)","v":{"$error":"#N/A"}}]
["MAQUINAS DE ESCRITORIO E EQUIPAMENTO DE REGISTRO VISUAL",{"$f":"VLOOKUP('LISTA DE GRUPOS'!A48,'Relatório 1'!D52:E877,2,FALSE)","v":"MATERIAL"}]
["MATERIAIS DIVERSOS",{"$f":"VLOOKUP('LISTA DE GRUPOS'!A49,'Relatório 1'!D53:E878,2,FALSE)","v":"MATERIAL"}]
["MATERIAIS E EQUIPAMENTOS FOTOGRAFICOS E CINEMATOGRAFICOS",{"$f":"VLOOKUP('LISTA DE GRUPOS'!A50,'Relatório 1'!D54:E879,2,FALSE)","v":"MATERIAL"}]
["MATERIAIS E EQUIPAMENTOS PARA EMBARCACOES",{"$f":"VLOOKUP('LISTA DE GRUPOS'!A51,'Relatório 1'!D55:E880,2,FALSE)","v":{"$error":"#N/A"}}]
["MATERIAIS E EQUIPAMENTOS PARA LIMPEZA",{"$f":"VLOOKUP('LISTA DE GRUPOS'!A52,'Relatório 1'!D56:E881,2,FALSE)","v":"MATERIAL"}]
["MATERIAIS E EQUIPAMENTOS PARA RECREACAO E DESPORTO",{"$f":"VLOOKUP('LISTA DE GRUPOS'!A53,'Relatório 1'!D57:E882,2,FALSE)","v":"MATERIAL"}]
["MATERIAIS E EQUIPAMENTOS PARA USOS MEDICOS ODONTOLOGICOS  E VETERINARIOS",{"$f":"VLOOKUP('LISTA DE GRUPOS'!A54,'Relatório 1'!D58:E883,2,FALSE)","v":"MATERIAL"}]
["MATERIAIS MANUFATURADOS NAO METALICOS",{"$f":"VLOOKUP('LISTA DE GRUPOS'!A55,'Relatório 1'!D59:E884,2,FALSE)","v":"MATERIAL"}]
["MATERIAIS PARA CONSTRUCAO",{"$f":"VLOOKUP('LISTA DE GRUPOS'!A56,'Relatório 1'!D60:E885,2,FALSE)","v":"MATERIAL"}]
["MATERIAIS PARA EXECUCAO DE OBRAS",{"$f":"VLOOKUP('LISTA DE GRUPOS'!A57,'Relatório 1'!D61:E886,2,FALSE)","v":"MATERIAL"}]
["MATERIAS PRIMAS NAO METALICAS",{"$f":"VLOOKUP('LISTA DE GRUPOS'!A58,'Relatório 1'!D62:E887,2,FALSE)","v":"MATERIAL"}]
["MEDICAMENTO",{"$f":"VLOOKUP('LISTA DE GRUPOS'!A59,'Relatório 1'!D63:E888,2,FALSE)","v":"MATERIAL"}]
["MINERIOS MINERAIS E SEUS PRODUTOS PRIMARIOS SEMIACABADOS",{"$f":"VLOOKUP('LISTA DE GRUPOS'!A60,'Relatório 1'!D64:E889,2,FALSE)","v":"MATERIAL"}]
["MOBILIARIO",{"$f":"VLOOKUP('LISTA DE GRUPOS'!A61,'Relatório 1'!D65:E890,2,FALSE)","v":"MATERIAL"}]
["MOTORES TURBINAS E COMPONENTES",{"$f":"VLOOKUP('LISTA DE GRUPOS'!A62,'Relatório 1'!D66:E891,2,FALSE)","v":"MATERIAL"}]
["OBRAS CIVIS ADAPTACOES REPAROS E MONTAGENS",{"$f":"VLOOKUP('LISTA DE GRUPOS'!A63,'Relatório 1'!D67:E892,2,FALSE)","v":"SERVICO"}]
["PNEUS CAMARAS DE AR E MATERIAIS CORRELATOS",{"$f":"VLOOKUP('LISTA DE GRUPOS'!A64,'Relatório 1'!D68:E893,2,FALSE)","v":"MATERIAL"}]
["RECIPIENTES E MATERIAIS PARA ACONDICIONAMENTO E EMBALAGEM",{"$f":"VLOOKUP('LISTA DE GRUPOS'!A65,'Relatório 1'!D69:E894,2,FALSE)","v":"MATERIAL"}]
["ROLAMENTOS E MANCAIS",{"$f":"VLOOKUP('LISTA DE GRUPOS'!A66,'Relatório 1'!D70:E895,2,FALSE)","v":"MATERIAL"}]
["SERVICO DE MANUTENCAO REPAROS E ADAPTACOES EM EQUIPAMENTOSMAQUINAS APARELHOS FERRAMENTAS E INSTRUMENTAL",{"$f":"VLOOKUP('LISTA DE GRUPOS'!A67,'Relatório 1'!D71:E896,2,FALSE)","v":"SERVICO"}]
["SERVICOS DE ESTUDOS E PROJETOS",{"$f":"VLOOKUP('LISTA DE GRUPOS'!A68,'Relatório 1'!D72:E897,2,FALSE)","v":"SERVICO"}]
["SERVICOS DE INSTALACOES E MONTAGENS",{"$f":"VLOOKUP('LISTA DE GRUPOS'!A69,'Relatório 1'!D73:E898,2,FALSE)","v":"SERVICO"}]
["SERVICOS DE TECNOLOGIA DA INFORMACAO E COMUNICACAO TIC",{"$f":"VLOOKUP('LISTA DE GRUPOS'!A70,'Relatório 1'!D74:E899,2,FALSE)","v":{"$error":"#N/A"}}]
["SERVICOS TECNICOS ESPECIALIZADOS NA AREA DE CONSTRUCAO CIVIL",{"$f":"VLOOKUP('LISTA DE GRUPOS'!A71,'Relatório 1'!D75:E900,2,FALSE)","v":"SERVICO"}]
["SUBSTANCIAS E PRODUTOS QUIMICOS",{"$f":"VLOOKUP('LISTA DE GRUPOS'!A72,'Relatório 1'!D76:E901,2,FALSE)","v":"MATERIAL"}]
["TECIDOS COUROS MATERIAIS CORRELATOS E MIUDEZAS AVIAMENTOS PARA COSTURA EM GERAL",{"$f":"VLOOKUP('LISTA DE GRUPOS'!A73,'Relatório 1'!D77:E902,2,FALSE)","v":"MATERIAL"}]
["TINTAS EQUIPAMENTOS PARA PINTURA SECANTES E ADESIVOS",{"$f":"VLOOKUP('LISTA DE GRUPOS'!A74,'Relatório 1'!D78:E903,2,FALSE)","v":"MATERIAL"}]
["TRANSPORTE",{"$f":"VLOOKUP('LISTA DE GRUPOS'!A75,'Relatório 1'!D79:E904,2,FALSE)","v":"SERVICO"}]
["TRATORES",{"$f":"VLOOKUP('LISTA DE GRUPOS'!A76,'Relatório 1'!D80:E905,2,FALSE)","v":"MATERIAL"}]
["TUBOS TUBULACOES MANGUEIRAS E CONEXOES",{"$f":"VLOOKUP('LISTA DE GRUPOS'!A77,'Relatório 1'!D81:E906,2,FALSE)","v":"MATERIAL"}]
["VALVULAS E REGISTROS",{"$f":"VLOOKUP('LISTA DE GRUPOS'!A78,'Relatório 1'!D82:E907,2,FALSE)","v":"MATERIAL"}]
["VEICULOS PARA TRANSPORTE RODOVIARIO DE PASSAGEIROS E  DE CARGA",{"$f":"VLOOKUP('LISTA DE GRUPOS'!A79,'Relatório 1'!D83:E908,2,FALSE)","v":"MATERIAL"}]
["VESTUARIOS E EQUIPAMENTOS INDIVIDUAIS DE USO COMUM E  ESPECIAL",{"$f":"VLOOKUP('LISTA DE GRUPOS'!A80,'Relatório 1'!D84:E909,2,FALSE)","v":"MATERIAL"}]
["VIATURAS EQUIPAMENTOS PARA MOVIMENTACAO DE MATERIAL",{"$f":"VLOOKUP('LISTA DE GRUPOS'!A81,'Relatório 1'!D85:E910,2,FALSE)","v":"MATERIAL"}]

{"sheet":"Plan4","index":4,"n_rows":89,"n_cols":1,"rows_kept":89,"cut":false,"hidden":true,"merged":[]}
[]
["Grupo Material/Serviço"]
["ACESSORIOS DE MOTORES"]
["ADMINISTRACAO GERAL"]
["AERONAVES E COMPONENTES ESTRUTURAIS"]
["ANIMAIS VIVOS E MATERIAIS GENETICOS"]
["APARELHOS E MEIOS AUXILIARES PARA TREINAMENTO"]
["APARELHOS E UTENSILIOS PARA MEDICAO E INSPECAO"]
["ARAMES, LAMINADOS PLANOS E PERFILADOS METALICOS"]
["ARMAMENTO, COMPONENTES, EQUIPAMENTOS E APETRECHOS DE USO    POLICIAL"]
["ARTIGOS DE ESCRITORIO"]
["ARTIGOS DOMESTICOS E COMERCIAIS"]
["ARTIGOS PARA TOUCADOR E HIGIENE PESSOAL"]
["BOMBAS E COMPRESSORES"]
["CABO FIBRA OPTICA"]
["CABOS DE ACO, CORDAS, CORRENTES, CORDOALHAS E ACESSORIOS"]
["COMBUSTIVEIS, LUBRIFICANTES, OLEOS, GRAXAS E CERAS"]
["COMPONENTES DE EQUIPAMENTOS ELETRICOS E ELETRONICOS"]
["COMPONENTES E ACESSORIOS DE AERONAVES"]
["COMPONENTES PARA VEICULOS"]
["EMBARCACOES, PONTOES E DIQUES FLUTUANTES"]
["EQUIPAMENTOS COMERCIAIS E DE SERVICOS"]
["EQUIPAMENTOS DE COMUNICACOES"]
["EQUIPAMENTOS DE CALEFACAO, AQUECIMENTO E INSTALACOES SANITARIAS"]
["EQUIPAMENTOS DE LABORATORIO E INSTRUMENTOS DE MEDICAO"]
["EQUIPAMENTOS DE REFRIGERACAO, CONDICIONAMENTO DE AR E VENTI LACAO"]
["EQUIPAMENTOS DE SINALIZACAO E ALARME"]
["EQUIPAMENTOS E MAQUINARIA PARA TRABALHOS EM MADEIRA"]
["EQUIPAMENTOS E MAQUINARIA PARA TRABALHOS EM METAL"]
["EQUIPAMENTOS E VIATURAS PARA SERVICOS DE AERODROMO"]
["EQUIPAMENTOS ESPECIALIZADOS PARA MANUTENCAO E REPAROS"]
["EQUIPAMENTOS PARA  REFEITORIO, COPA E COZINHA"]
["EQUIPAMENTOS PARA CONSTRUCAO, MINERACAO, ESCAVACAO E  CONSERVACAO DE ESTRADAS"]
["EQUIPAMENTOS PARA PURIFICACAO  E TRATAMENTO DE AGUA  E TRATAMENTO DE ESGOTOS"]
["EQUIPAMENTOS PARA SEGURANCA PESSOAL E INDUSTRIAL"]
["EQUIPAMENTOS PARA TRANSMISSAO DE ENERGIA MECANICA"]
["EQUIPAMENTOS, PERIFERICOS, ACESSORIOS  E SUPRIMENTOS  DE PROCESSAMENTO DE DADOS EM GERAL"]
["ESTRUTURAS E ANDAIMES PRE-FABRICADOS"]
["EXPLOSIVOS, MUNICOES E DISPOSITIVOS DE DISPERSAO"]
["FERRAGENS, ABRASIVOS E MATERIAIS PARA VEDACAO"]
["FERRAMENTAS MANUAIS E COMPONENTES"]
["FIOS, CABOS TELEFONICOS, CONDUITES ELETRICOS, EQUIPAMENTO P/GERACAO/DISTRIBUICAO ENERGIA"]
["FORNOS, CENTRAIS DE VAPOR E EQUIPAMENTOS PARA SECAGEM"]
["FORRAGENS, FERTILIZANTES, SEMENTES E MUDAS"]
["GENEROS ALIMENTICIOS E BEBIDAS"]
["INSTRUMENTOS MUSICAIS, RADIOS, FONOGRAFOS, TELEVISOR, VIDEO, AUDIO/SONORIZACAO E ACESSORIOS"]
["LAMPADAS E APARELHOS DE ILUMINACAO"]
["LIVROS, MAPAS E OUTRAS PUBLICACOES"]
["LOCACOES"]
["MADEIRAS,  ESQUADRIAS,  COMPENSADOS E FOLHEADOS"]
["MAQUINARIA E EQUIPAMENTOS AGRICOLAS"]
["MAQUINARIA,EQUIPAMENTOS,COMPONENTES E SUPRIMENTOS PARA A  INDUSTRIA ESPECIALIZADA"]
["MAQUINAS DE ESCRITORIO E EQUIPAMENTO DE REGISTRO VISUAL"]
["MATERIAIS DIVERSOS"]
["MATERIAIS E EQUIPAMENTOS FOTOGRAFICOS E CINEMATOGRAFICOS"]
["MATERIAIS E EQUIPAMENTOS PARA EMBARCACOES"]
["MATERIAIS E EQUIPAMENTOS PARA LIMPEZA"]
["MATERIAIS E EQUIPAMENTOS PARA RECREACAO E DESPORTO"]
["MATERIAIS E EQUIPAMENTOS PARA USOS MEDICOS, ODONTOLOGICOS  E VETERINARIOS"]
["MATERIAIS MANUFATURADOS NAO METALICOS"]
["MATERIAIS PARA CONSTRUCAO"]
["MATERIAIS PARA EXECUCAO DE OBRAS"]
["MATERIAS PRIMAS NAO METALICAS"]
["MEDICAMENTO"]
["MEDICAMENTOS"]
["MEDICAMENTOS (GRUPO AUXILIAR)"]
["MINERIOS, MINERAIS E SEUS PRODUTOS PRIMARIOS SEMIACABADOS"]
["MOBILIARIO"]
["MOTORES, TURBINAS E COMPONENTES"]
["OBRAS CIVIS, ADAPTACOES, REPAROS E MONTAGENS"]
["PNEUS, CAMARAS DE AR E MATERIAIS CORRELATOS"]
["RECIPIENTES E MATERIAIS PARA ACONDICIONAMENTO E EMBALAGEM"]
["ROLAMENTOS E MANCAIS"]
["SERVICO DE MANUTENCAO, REPAROS E ADAPTACOES EM EQUIPAMENTOS,MAQUINAS, APARELHOS, FERRAMENTAS E INSTRUMENTAL"]
["SERVICOS DE ESTUDOS E PROJETOS"]
["SERVICOS DE INSTALACOES E MONTAGENS"]
["SERVICOS DE TECNOLOGIA DA INFORMACAO E COMUNICACAO - TIC"]
["SERVICOS TECNICOS ESPECIALIZADOS NA AREA DE CONSTRUCAO CIVIL"]
["SUBSTANCIAS E PRODUTOS QUIMICOS"]
["TECIDOS, COUROS, MATERIAIS CORRELATOS E MIUDEZAS, AVIAMENTOS PARA COSTURA EM GERAL"]
["TINTAS, EQUIPAMENTOS PARA PINTURA, SECANTES E ADESIVOS"]
["TRANSPORTE"]
["TRATORES"]
["TUBOS, TUBULACOES, MANGUEIRAS E CONEXOES"]
["VALVULAS E REGISTROS"]
["VEICULOS PARA TRANSPORTE RODOVIARIO DE PASSAGEIROS E  DE CARGA"]
["VESTUARIOS E EQUIPAMENTOS INDIVIDUAIS DE USO COMUM E  ESPECIAL"]
["VIATURAS, EQUIPAMENTOS PARA MOVIMENTACAO DE MATERIAL"]
["Total Geral"]

{"sheet":"CLASSES","index":5,"n_rows":787,"n_cols":5,"rows_kept":787,"cut":false,"hidden":true,"merged":[]}
[null,null,"Grupo Material/Serviço","Classe Material/Serviço"]
["MATERIAL","PERMANENTE","ACESSORIOS DE MOTORES","ACESSORIOS DIVERSOS DE MOTORES DE AERONAVES","ACESSORIOS_DE_MOTORES"]
[null,null,null,"ACESSORIOS DIVERSOS DE MOTORES EXCETO DE AERONAVES",""]
[null,null,null,"COMPONENTES DE SISTEMA DE ARREFECIMENTO DE MOTORES EXCETO  DE AERONAVES",""]
[null,null,null,"COMPONENTES DE SISTEMA DE COMBUSTIVEL DE MOTORES EXCETO DE  AERONAVES",""]
[null,null,null,"COMPONENTES DO SISTEMA DE COMBUSTIVEL DE MOTORES DE AERONAVES",""]
[null,null,null,"COMPONENTES DO SISTEMA ELETRICO DE MOTORES EXCETO DE AERONAVES",""]
[null,null,null,"PURIFICADORES E FILTROS DE AR E DE OLEO DE MOTORES DE AERONAVES",""]
[null,null,null,"PURIFICADORES E FILTROS DE MOTORES EXCETO DE AERONAVES",""]
["PESSOAL",null,"DESPESAS DE PESSOAL","ENCARGOS FINANCEIROS POR SERVICOS PRESTADOS POR PESSOA FISICA OU JURIDICA","DESPESAS_DE_PESSOAL"]
[null,null,null,"ENCARGOS PREVIDENCIARIOS POR SERVICOS PRESTADOS  POR  PESSOAFISICA OU JURIDICA",""]
[null,null,null,"SERVICOS DE ENCARGOS E INDENIZACOES",""]
[null,null,null,"SERVICOS PRESTADOS POR ESTAGIARIOS MONITORES E MEDICOS RESIDENTES",""]
[null,null,null,"BENEFICIOS",""]
["SERVICO",null,"ADMINISTRACAO GERAL","AQUISICAO E ASSINATURAS DE PERIODICOS","ADMINISTRACAO_GERAL"]
[null,null,null,"OUTROS SERVICOS DE PESSOA JURIDICA",""]
[null,null,null,"SERV.ESPECIALIZADOS AREAS MEDICA ODONTOLOGICA REABILITACAOHOSPITALAR E DE LABORATORIO (EXAME-ANALISE-ENSAIO-PESQUISA)",""]
[null,null,null,"SERVICO DE PUBLICIDADE PUBLICACAO IMPRESSAO REPRODUCAO E ENCADERNACAO",""]
[null,null,null,"SERVICOS DE APOIO ADMINISTRATIVO  CONSERVACAO  E LIMPEZA DE BENS MOVEIS E IMOVEIS E INSTALACOES",""]
[null,null,null,"SERVICOS DE HIGIENIZACAO E LIMPEZA",""]
[null,null,null,"SERVICOS DE HOSPEDAGENS CURSOS PROMOCOES E EVENTOS",""]
[null,null,null,"SERVICOS DE TECNOLOGIA DA INFORMACAO",""]
[null,null,null,"SERVICOS DE TELECOMUNICACOES",""]
[null,null,null,"SERVICOS DE TREINAMENTO E APERFEICOAMENTO PROFISSIONAL",""]
[null,null,null,"SERVICOS ESPECIALIZADOS DE AUDITORIA CONSULTORIA E  ASSESSORIA",""]
[null,null,null,"SERVICOS EVENTUAIS PRESTADOS POR PESSOA FISICA",""]
[null,null,null,"SERVICOS PESSOA FISICA CONFORME CLASSIFICACAO              BRASILEIRA DE OCUPACOES",""]
[null,null,null,"SERVICOS TECNICOS E SERVICOS ESPECIALIZADOS",""]
[null,null,null,"SOFTWARES",""]
["MATERIAL","PERMANENTE","AERONAVES E COMPONENTES ESTRUTURAIS","AERONAVES","AERONAVES_E_COMPONENTES_ESTRUTURAIS"]
[null,null,null,"COMPONENTES ESTRUTURAIS DE AERONAVES -",""]
["MATERIAL","PERMANENTE","ANIMAIS VIVOS E MATERIAIS GENETICOS","ANIMAIS DE TRACAO POLICIAMENTO REPRODUCAO ESTUDOS","ANIMAIS_VIVOS_E_MATERIAIS_GENETICOS"]
[null,null,null,"ANIMAIS VIVOS DE CORTE E DE ABATE",""]
[null,null,null,"MATERIAIS GENETICOS",""]
["MATERIAL","PERMANENTE","APARELHOS E MEIOS AUXILIARES PARA TREINAMENTO","APARELHAGEM DE INSTRUCAO DE ARMAMENTO","APARELHOS_E_MEIOS_AUXILIARES_PARA_TREINAMENTO"]
[null,null,null,"APARELHAGEM PARA TREINAMENTO E INSTRUCAO",""]
[null,null,null,"EQUIPAMENTOS E MEIOS AUXILIARES DIDATICOS/PEDAGOGICOS",""]
[null,null,null,"MEIOS AUXILIARES PARA TESTES DE SELECAO E TREINAMENTO",""]
["MATERIAL","PERMANENTE","APARELHOS E UTENSILIOS PARA MEDICAO E INSPECAO","APARELHOS E UTENSILIOS DE MEDICAO","APARELHOS_E_UTENSILIOS_PARA_MEDICAO_E_INSPECAO"]
[null,null,null,"CALIBRES DE INSPECAO",""]
[null,null,null,"EQUIPAMENTO PARA INSPECAO",""]
[null,null,null,"JOGOS E ESTOJOS DE APARELHOS E UTENSILIOS PARA MEDICAO E INSPECAO",""]
["MATERIAL","CONSUMO","ARAMES LAMINADOS PLANOS E PERFILADOS METALICOS","ARAMES DE ACO","ARAMES_LAMINADOS_PLANOS_E_PERFILADOS_METALICOS"]
[null,null,null,"BARRAS DE ACO/FERRO",""]
[null,null,null,"BARRAS/PERFIS/VERGALHOES DE METAIS NAO FERROSOS",""]
[null,null,null,"FOLHAS CHAPAS E TIRAS DE ACO/FERRO",""]
[null,null,null,"FOLHAS CHAPAS E TIRAS DE METAIS NAO FERROSOS",""]
[null,null,null,"PERFIS ESTRUTURAIS DE ACO/FERRO",""]
[null,null,null,"PERFIS ESTRUTURAIS DE METAIS NAO FERROSOS",""]
["MATERIAL","CONSUMO","ARTIGOS DE ESCRITORIO","ARTIGOS DE ESCRITORIO","ARTIGOS_DE_ESCRITORIO"]
[null,null,null,"COMPONENTES E PECAS PARA UTENSILIOS DE ESCRITORIO",""]
[null,null,null,"FORMULARIOS (MODELOS) PADROES",""]
[null,null,null,"PAPELARIA E FORMULARIOS EXCETO FORMULARIOS PADRONIZADOS",""]
[null,null,null,"UTENSILIOS DE ESCRITORIO",""]
["MATERIAL","CONSUMO","ARTIGOS DOMESTICOS E COMERCIAIS","CORTINAS TOLDOS PERSIANAS E COMPONENTES","ARTIGOS_DOMESTICOS_E_COMERCIAIS"]
[null,null,null,"EQUIPAMENTOS E ARTIGOS DOMESTICOS E COMERCIAIS DIVERSOS",""]
[null,null,null,"GUARNICOES DE USO DOMESTICO (ROUPAS DE CAMA MESA BANHO    ETC)",""]
[null,null,null,"RECIPIENTES DE USO DOMESTICO E COMERCIAL",""]
[null,null,null,"REVESTIMENTOS PARA PISOS",""]
["MATERIAL","PERMANENTE","ARTIGOS PARA TOUCADOR E HIGIENE PESSOAL","PRODUTOS PARA HIGIENE PESSOAL","ARTIGOS_PARA_TOUCADOR_E_HIGIENE_PESSOAL"]
["MATERIAL","PERMANENTE","BOMBAS E COMPRESSORES","BOMBAS MANUAIS MECANICAS ELETRONICAS E MOTO-BOMBAS","BOMBAS_E_COMPRESSORES"]
[null,null,null,"CENTRIFUGAS SEPARADORES E FILTROS A PRESSAO E A VACUO",""]
[null,null,null,"COMPONENTES E ACESSORIOS PARA BOMBAS E COMPRESSORES         PARA CONTRATOS DE MANUTENCAO PREVENTIVA/CORRETIVA",""]
[null,null,null,"COMPONENTES E PECAS PARA BOMBAS E COMPRESSORES",""]
[null,null,null,"COMPRESSOR BOMBA DE VACUO E RESERVATORIO -",""]
["MATERIAL","CONSUMO","CABO FIBRA OPTICA","ACESSORIOS E ARTIGOS PARA FIBRA OPTICA","CABO_FIBRA_OPTICA"]
[null,null,null,"CABO PARA FIBRA OPTICA -",""]
[null,null,null,"COMPONENTES ACESSORIOS E ARTIGOS FIBRA OPTICA",""]
[null,null,null,"EQUIPAMENTOS PARA FIBRA OPTICA -",""]
[null,null,null,"INSTRUMENTOS DE TESTES FIBRA OPTICA",""]
["MATERIAL","CONSUMO","CABOS DE ACO CORDAS CORRENTES CORDOALHAS E ACESSORIOS","ACESSORIOS PARA CORDAS CABOS DE ACO E CORRENTES","CABOS_DE_ACO_CORDAS_CORRENTES_CORDOALHAS_E_ACESSORIOS"]
[null,null,null,"CABOS DE ACO E CORRENTES",""]
[null,null,null,"CABOS DE FIBRA CORDOALHAS E BARBANTES",""]
["MATERIAL","CONSUMO","COMBUSTIVEIS LUBRIFICANTES OLEOS GRAXAS E CERAS","CERAS OLEOS E GORDURAS DIVERSAS","COMBUSTIVEIS_LUBRIFICANTES_OLEOS_GRAXAS_E_CERAS"]
[null,null,null,"COMBUSTIVEIS LIQUIDOS E GASOSOS",""]
[null,null,null,"COMBUSTIVEIS PROPELENTES LIQUIDOS E OXIGENADORES",""]
[null,null,null,"COMBUSTIVEIS SOLIDOS",""]
[null,null,null,"OLEOS COMBUSTIVEIS",""]
[null,null,null,"OLEOS E GRAXAS PARA CORTE LUBRIFICACAO E SISTEMA HIDRAULICO",""]
["MATERIAL","CONSUMO","COMPONENTES DE EQUIPAMENTOS ELETRICOS E ELETRONICOS","ANTENAS GUIAS DE ONDAS E EQUIPAMENTOS CORRELATOS","COMPONENTES_DE_EQUIPAMENTOS_ELETRICOS_E_ELETRONICOS"]
[null,null,null,"BOBINAS E TRANSFORMADORES",""]
[null,null,null,"CAPACITORES",""]
[null,null,null,"CHAVES E INTERRUPTORES",""]
[null,null,null,"COMPONENTES DIVERSOS ELETRICOS E ELETRONICOS",""]
[null,null,null,"CONECTORES ELETRICOS",""]
[null,null,null,"CONJUNTOS ELETRICOS E ELETRONICOS PLACAS CARTOES E  CORRELATOS",""]
[null,null,null,"DISJUNTORES",""]
[null,null,null,"DISPOSITIVOS A SEMICONDUTOR E PLACAS ASSOCIADAS (FOTOCELULA)",""]
[null,null,null,"DISPOSITIVOS COM CIRCUITOS MICROELETRONICOS",""]
[null,null,null,"DISPOSITIVOS OPTRONICOS E ITENS CORRELATOS",""]
[null,null,null,"ESCOVA DE CONTATO ELETRICO E ELETRODOS",""]
[null,null,null,"FERRAGENS E ACESSORIOS ELETRICOS",""]
[null,null,null,"FILTROS E MALHAS DE FILTRO",""]
[null,null,null,"FONES MONOFONES MICROFONES E ALTO-FALANTES",""]
[null,null,null,"FUSIVEIS E PARA-RAIOS",""]
[null,null,null,"ISOLANTES ELETRICOS E MATERIAL ISOLANTE",""]
[null,null,null,"MODULOS ELETRONICOS",""]
[null,null,null,"RELES CONTACTORES E SOLENOIDES",""]
[null,null,null,"RESISTORES",""]
[null,null,null,"TERMINAIS TIPO ORELHA JOGO DE TERMINAIS",""]
[null,null,null,"VALVULAS ELETRONICAS E FERRAGENS ASSOCIADAS",""]
["MATERIAL","PERMANENTE","COMPONENTES PARA VEICULOS","COMPONENTES DE RODAS E ESTEIRAS DE VEICULOS","COMPONENTES_PARA_VEICULOS"]
[null,null,null,"COMPONENTES DIVERSOS E ACESSORIOS DE VEICULOS",""]
[null,null,null,"COMPONENTES DO SISTEMA DE CAPOTARIA DE VEICULOS",""]
[null,null,null,"COMPONENTES DO SISTEMA DE DIRECAO DE VEICULOS",""]
[null,null,null,"COMPONENTES DO SISTEMA DE FREIO DE VEICULOS",""]
[null,null,null,"COMPONENTES DO SISTEMA DE SUSPENSAO DE VEICULOS",""]
[null,null,null,"COMPONENTES DO SISTEMA DE TRANSMISSAO DE FORCA DE VEICULOS",""]
[null,null,null,"COMPONENTES DO SISTEMA ELETRICO DE VEICULOS",""]
[null,null,null,"COMPONENTES E ACESSORIOS DE VEICULOS PARA CONTRATACAO MEDIANTE FORNECIMENTO PARCELADO",""]
[null,null,null,"COMPONENTES ESTRUTURAIS (CHASSIS CARROCERIA E CABINES E COMPONENTES) DE VEICULOS",""]
[null,null,null,"COMPONENTES PARA VEICULOS ESPECIAIS",""]
[null,null,null,"MATERIAL DE FIXACAO VEDACAO E LUBRIFICACAO PARA  USO  VEICULAR",""]
[null,null,null,"MOTORES AUTOMOTIVOS E COMPONENTES",""]
[null,null,null,"PECAS E COMPONENTES VEICULARES",""]
[null,null,null,"SISTEMA DE EIXO DE VEICULOS E COMPONENTES",""]
[null,null,null,"TINTAS VERNIZES E PRODUTOS CORRELATOS USO AUTOMOTIVO",""]
[null,null,"EMBARCACOES PONTOES E DIQUES FLUTUANTES","EMBARCACOES PARA TRANSPORTE DE PASSAGEIROS","EMBARCACOES_PONTOES_E_DIQUES_FLUTUANTES"]
[null,null,null,"PEQUENAS EMBARCACOES",""]
["MATERIAL","PERMANENTE","EQUIPAMENTOS COMERCIAIS E DE SERVICOS","COMPONENTES E ACESSORIOS PARA EQUIPAMENTOS DE LAVANDERIA    PARA CONTRATOS DE MANUTENCAO CORRETIVA/PREVENTIVA","EQUIPAMENTOS_COMERCIAIS_E_DE_SERVICOS"]
[null,null,null,"COMPONENTES E PECAS PARA EQUIPAMENTOS COMERCIAIS E DE       SERVICOS",""]
[null,null,null,"EQUIPAMENTOS DE LAVANDERIA",""]
[null,null,null,"EQUIPAMENTOS DIVERSOS COMERCIAIS E DE SERVICOS",""]
[null,null,null,"EQUIPAMENTOS E COMPONENTES PARA AUTOMACAO E CONTROLE",""]
[null,null,null,"EQUIPAMENTOS PARA ACONDICIONAMENTO E EMBALAGEM",""]
[null,null,null,"EQUIPAMENTOS PARA MANUFATURA E CONSERTO DE CALCADOS",""]
[null,null,null,"MAQUINAS E EQUIPAMENTOS INDUSTRIAIS DE COSTURA",""]
["MATERIAL","PERMANENTE","EQUIPAMENTOS DE CALEFACAO AQUECIMENTO E INSTALACOES SANITARIAS","APARELHOS HIDRAULICOS-SANITARIOS E ACESSORIOS","EQUIPAMENTOS_DE_CALEFACAO_AQUECIMENTO_E_INSTALACOES_SANITARIAS"]
[null,null,null,"EQUIPAMENTOS DIVERSOS HIDRAULICOS SANITARIOS E DE CALEFACAO",""]
[null,null,null,"EQUIPAMENTOS P/ CALEFACAO DE AMBIENTES/AQUECEDORES DE AGUA DOMESTICOS",""]
[null,null,null,"EQUIPAMENTOS PARA QUEIMA DE COMBUSTIVEL",""]
[null,null,null,"TANQUES E RESERVATORIOS DE AGUA E COMPONENTES",""]
["MATERIAL","PERMANENTE","EQUIPAMENTOS DE COMUNICACOES","EQUIPAMENTO DE RADIACAO EMITIDAREFLETIDA E VISAO NOTURNA","EQUIPAMENTOS_DE_COMUNICACOES"]
[null,null,null,"EQUIPAMENTOS DE COMUNICACAO DE RADIO E DE TELEVISAO",""]
[null,null,null,"EQUIPAMENTOS DE COMUNICACAOSEGURANCA E COMPONENTES -",""]
[null,null,null,"EQUIPAMENTOS DE RADAR EXCETO OS AEROTRANSPORTAVEIS",""]
[null,null,null,"EQUIPAMENTOS DIVERSOS DE COMUNICACOES",""]
[null,null,null,"EQUIPAMENTOS INTERCOMUNICADORES/SISTEMA ALTO-FALANTESEXCETO AEROTRANSPORTAVEL",""]
[null,null,null,"EQUIPAMENTOS PARA GRAVACAO E REPRODUCAO DE SOM",""]
[null,null,null,"EQUIPAMENTOS PARA GRAVACAO E REPRODUCAO DE VIDEO",""]
[null,null,null,"EQUIPAMENTOS TELEFONICOS E TELEGRAFICOS",""]
[null,null,null,"PECAACESSORIO E COMPONENTE P/EQUIPAMENTO DE COMUNICACAO    - EXCETO INFORMATICA",""]
[null,null,null,"TELEIMPRESSORAS E EQUIPAMENTOS FAC-SIMILES",""]
["MATERIAL","PERMANENTE","EQUIPAMENTOS DE LABORATORIO E INSTRUMENTOS DE MEDICAO","CAMARAS AMBIENTAIS E EQUIPAMENTOS CORRELATOS","EQUIPAMENTOS_DE_LABORATORIO_E_INSTRUMENTOS_DE_MEDICAO"]
[null,null,null,"COMPONENTES E ACESSORIOS PARA EQUIPAMENTOS DE LABORATORIO   PARA CONTRATOS DE MANUTENCAO PREVENTIVA/CORRETIVA",""]
[null,null,null,"COMPONENTES E ACESSORIOS PARA ESCALAS E BALANCAS",""]
[null,null,null,"EQUIPAMENTOS DE LABORATORIO",""]
[null,null,null,"EQUIPAMENTOS E ACESSORIOS PARA ENSAIO E VERIFICACAO DE PRO  PRIEDADES FISICAS",""]
[null,null,null,"EQUIPAMENTOS E INSTRUMENTOS PARA ANALISE QUIMICA",""]
[null,null,null,"ESCALAS E BALANCAS",""]
[null,null,null,"INSTRUMENTOS COMBINADOS E INSTRUMENTOS DIVERSOS",""]
[null,null,null,"INSTRUMENTOS DE LABORATORIO",""]
[null,null,null,"INSTRUMENTOS DE NAVEGACAO",""]
[null,null,null,"INSTRUMENTOS DE VERIFICACAO ENSAIO E MEDICAO DE APARELHAGEM ELETRICA E ELETRONICA",""]
[null,null,null,"INSTRUMENTOS DE VOO",""]
[null,null,null,"INSTRUMENTOS E APARELHOS DE METEOROLOGIA",""]
[null,null,null,"INSTRUMENTOS E APARELHOS PARA DETECCAO DE PERIGOS",""]
[null,null,null,"INSTRUMENTOS OPTICOS",""]
[null,null,null,"INSTRUMENTOS PARA CONTROLE E MEDICAO DE PRESSAO TEMPERATURA E UMIDADE",""]
[null,null,null,"INSTRUMENTOS PARA DESENHO TOPOGRAFIA E CARTOGRAFIA",""]
[null,null,null,"INSTRUMENTOS PARA MEDICAO DE TEMPO",""]
[null,null,null,"INSTRUMENTOS PARA MEDICAO FLUXOS GAS/LIQUIDOS/NIVEL  E  MOVIMENTOS MECANICOS",""]
[null,null,null,"PECAS E COMPONENTES P/INSTRUMENTOS DE VERIFICACAOENSAIO E MEDICAO DE ELETRICA E ELETRONICA",""]
[null,null,null,"PECAS E COMPONENTES PARA CAMARAS AMBIENTAIS E EQUIPAMENTOS  CORRELATOS",""]
[null,null,null,"PECAS E COMPONENTES PARA EQUIPAMENTOS DE LABORATORIO",""]
[null,null,null,"PECAS E COMPONENTES PARA EQUIPAMENTOS E INSTRUMENTOS  PARA  ANALISE QUIMICA",""]
[null,null,null,"PECAS E COMPONENTES PARA EQUIPAMENTOS PARA ENSAIO E VERIFICACAO DE PROPRIEDADES FISICAS",""]
[null,null,null,"PECAS E COMPONENTES PARA INSTRUMENTOS COMBINADOS E INSTRUMENTOS DIVERSOS",""]
[null,null,null,"PECAS E COMPONENTES PARA INSTRUMENTOS E APARELHOS DE METEREOLOGIA",""]
[null,null,null,"PECAS E COMPONENTES PARA INSTRUMENTOS E APARELHOS PARA DETECCAO DE PERIGOS",""]
[null,null,null,"PECAS E COMPONENTES PARA INSTRUMENTOS OPTICOS",""]
[null,null,null,"PECAS E COMPONENTES PARA INSTRUMENTOS PARA CONTROLE E MEDICAO DE PRESSAO TEMPERATURA E UMIDADE",""]
[null,null,null,"PECAS E COMPONENTES PARA INSTRUMENTOS PARA MEDICAO DE FLUXOS GAS/LIQUIDOS/NIVEL E MOVIMENTOS MECANICOS",""]
[null,null,null,"PECAS E COMPONENTES PARA INSTRUMENTOS PARA MEDICAO DE TEMPO",""]
[null,null,null,"SISTEMAS DE MONITORAMENTO CLIMATICOS",""]
[null,null,null,"SUPRIMENTOS PARA LABORATORIO",""]
["MATERIAL","PERMANENTE","EQUIPAMENTOS DE REFRIGERACAO CONDICIONAMENTO DE AR E VENTI LACAO","COMPONENTES E ACES.DE UNIDADES  DE REFRIGERACAO E CONDICIONAMENTO DE AR P/ CONTRATOS DE MANUTENCAO PREVENTIVA/CORRETIVA","EQUIPAMENTOS_DE_REFRIGERACAO_CONDICIONAMENTO_DE_AR_E_VENTI_LACAO"]
[null,null,null,"EQUIP.INDUSTRIAL DE CLIMATIZACAO VENTILACAO E CIRCULACAO -",""]
[null,null,null,"PECAS ACESSORIOS E COMPONENTES PARA EQUIPAMENTOS DE REFRIGERACAO E CONDICIONAMENTO DE AR",""]
[null,null,null,"UNIDADES COMPLETAS DE CONDICIONAMENTO DE AR E ACESSORIOS",""]
[null,null,null,"UNIDADES COMPLETAS DE REFRIGERACAO E ACESSORIOS",""]
[null,null,null,"USINAS DE CONDICIONAMENTO DE AR DE REFRIGERACAO  E COMPONENTES",""]
[null,null,null,"VENTILADORCIRCULADORCLIMATIZADOR(DES)UMIDIFICADOR DE AR",""]
["MATERIAL","PERMANENTE","EQUIPAMENTOS DE SINALIZACAO E ALARME","PECAS E COMPONENTES PARA EQUIPAMENTOS DE SINALIZACAO E  ALARME","EQUIPAMENTOS_DE_SINALIZACAO_E_ALARME"]
[null,null,null,"SISTEMA DE SINALIZACAO DE TRAFEGO E TRANSITO",""]
[null,null,null,"SISTEMAS DIVERSOS DE SINALIZACAO E ALARME",""]
[null,null,"EQUIPAMENTOS E MAQUINARIA PARA TRABALHOS EM MADEIRA","FERRAMENTAS E IMPLEMENTOS DE MAQUINA PARA TRABALHO EM  MADEIRA","EQUIPAMENTOS_E_MAQUINARIA_PARA_TRABALHOS_EM_MADEIRA"]
[null,null,null,"MAQUINARIA PARA TRABALHOS EM MADEIRA",""]
[null,null,null,"PECAS E COMPONENTES PARA EQUIPAMENTOS E MAQUINARIA PARA TRABALHOS EM MADEIRA",""]
[null,null,null,"SERRARIA E OFICINA DE APLAINAR",""]
["MATERIAL","PERMANENTE","EQUIPAMENTOS E MAQUINARIA PARA TRABALHOS EM METAL","ACESSORIOS PARA MAQUINAS-FERRAMENTA","EQUIPAMENTOS_E_MAQUINARIA_PARA_TRABALHOS_EM_METAL"]
[null,null,null,"ARTIGOS E ACESSORIOS PARA SOLDAGENS COMUM FRACA E POR CALDEAMENTO",""]
[null,null,null,"DESBASTADORAS E PLAINAS-LIMADORAS",""]
[null,null,null,"EQUIPAMENTOS DE SOLDA A ARCO VOLTAICO",""]
[null,null,null,"EQUIPAMENTOS DE SOLDA A RESISTENCIA ELETRICA",""]
[null,null,null,"EQUIPAMENTOS DE SOLDA DIVERSOS  (EM GERAL)",""]
[null,null,null,"EQUIPAMENTOS PARA TRATAMENTO TERMICO DE METAIS",""]
[null,null,null,"FERRAMENTAS DE CORTES PARA MAQUINAS-FERRAMENTA",""]
[null,null,null,"GABARITOS PARA PRODUCAO FURACAO E COPIAS",""]
[null,null,null,"MAQUINA DE FRESAR",""]
[null,null,null,"MAQUINA DE FURAR METAL",""]
[null,null,null,"MAQUINAS DE DOBRAR E MOLDAR",""]
[null,null,null,"MAQUINAS DE ESMERILHAR E RETIFICAR",""]
[null,null,null,"MAQUINAS DE PUNCIONAR E TESOURAS MECANICAS",""]
[null,null,null,"MAQUINAS DE REBITAR",""]
[null,null,null,"MAQUINAS SECUNDARIAS PARA FORMA E CORTE DE METAL",""]
[null,null,null,"MAQUINAS-FERRAMENTA DIVERSAS",""]
[null,null,null,"MATERIAIS E EQUIPAMENTOS PARA FUNDICAO EM GERAL",""]
[null,null,null,"MATERIAL COMPONENTES E PECAS PARA EQUIPAMENTOS E MAQUINARIAPARA TRABALHOS EM METAL",""]
[null,null,null,"PRENSA MANUAL",""]
[null,null,null,"PRENSAS HIDRAULICAS/ELETRICAS/PNEUMATICAS A MOTOR",""]
[null,null,null,"SERRAS E MAQUINA DE LIMAR",""]
[null,null,null,"SOLDA A GAS CORTE A QUENTE E EQUIPAMENTO DE METALIZACAO",""]
[null,null,null,"TORNOS",""]
["MATERIAL","PERMANENTE","EQUIPAMENTOS ESPECIALIZADOS PARA MANUTENCAO E REPAROS","EQUIPAMENTOS ESPECIALIZADOS PARA MANUTENCAO E REPAROS","EQUIPAMENTOS_ESPECIALIZADOS_PARA_MANUTENCAO_E_REPAROS"]
[null,null,null,"EQUIPAMENTOS ESPECIAIS PARA MANUTENCAO E REPAROS DE VEICULOS E EQUIPAMENTOS",""]
["MATERIAL","PERMANENTE","EQUIPAMENTOS PARA  REFEITORIO COPA E COZINHA","ARTIGOS PARA SERVICOS DE MESAS","EQUIPAMENTOS_PARA__REFEITORIO_COPA_E_COZINHA"]
[null,null,null,"EQUIPAMENTOS AUXILIARES DE COZINHA",""]
[null,null,null,"EQUIPAMENTOS ACESSORIOS E PECAS PARA PREPARAR ALIMENTOS",""]
[null,null,null,"JOGOS E ESTOJOS DE ARTIGOS PARA REFEITORIOCOPA E COZINHA",""]
[null,null,null,"TALHERES DE MESA E CUTELARIA",""]
[null,null,null,"UTENSILIOS DE COZINHA MANUAIS",""]
["MATERIAL","PERMANENTE","EQUIPAMENTOS PARA CONSTRUCAO MINERACAO ESCAVACAO E  CONSERVACAO DE ESTRADAS","ACESSORIOS E COMPONENTES PARA EQUIPAMENTOS DIVERSOS PARA CONSTRUCAO","EQUIPAMENTOS_PARA_CONSTRUCAO_MINERACAO_ESCAVACAO_E__CONSERVACAO_DE_ESTRADAS"]
[null,null,null,"ACESSORIOS E COMPONENTES PARA EQUIPAMENTOS PARA MINERACAO PERFURACAO DE ROCHA TERRA E CORRELATOS",""]
[null,null,null,"ACESSORIOS E COMPONENTES PARA EQUIPAMENTOS PARA MOVIMENTACAO E ESCAVACAO DE TERRA",""]
[null,null,null,"ACESSORIOS E PECAS DE GUINDASTE E DE GUINDASTES-ESCAVADEIRAS",""]
[null,null,null,"COMPONENTES E ACESSORIOS PARA EQUIPAMENTOS DE MOVIMENTACAO EESCAVACAO DE TERRA - CONTRATACAO MEDIANTE FORN. PARCELADO",""]
[null,null,null,"EQUIPAMENTOS DIVERSOS PARA CONSTRUCAO",""]
[null,null,null,"EQUIPAMENTOS PARA  MINERACAO PERFURACAO  DE  ROCHA TERRA ECORRELATOS",""]
[null,null,null,"EQUIPAMENTOS PARA MOVIMENTACAO E ESCAVACAO DE TERRA",""]
[null,null,null,"GUINDASTES E GUINDASTES-ESCAVADEIRAS",""]
[null,null,null,"IMPLEMENTOS PARA CAMINHOES E TRATORES",""]
[null,null,null,"MATERIAL DE FIXACAOVEDACAO E LUBRIFICACAO EQUIPAMENTOS CONSTRUCAO/MINERACAO/ESCAVACAO/CONSTRUCAO ESTRADAS",""]
["MATERIAL","PERMANENTE","EQUIPAMENTOS PARA PURIFICACAO  E TRATAMENTO DE AGUA  E TRATAMENTO DE ESGOTOS","EQUIPAMENTOS PARA PURIFICACAO DE AGUA E COMPONENTES","EQUIPAMENTOS_PARA_PURIFICACAO__E_TRATAMENTO_DE_AGUA__E_TRATAMENTO_DE_ESGOTOS"]
[null,null,null,"EQUIPAMENTOS PARA TRATAMENTO DE ESGOTOS",""]
["MATERIAL","PERMANENTE","EQUIPAMENTOS PARA SEGURANCA PESSOAL E INDUSTRIAL","EQUIP.COMPONENTES E ACESSORIOS COMBATE A INCENDIO","EQUIPAMENTOS_PARA_SEGURANCA_PESSOAL_E_INDUSTRIAL"]
[null,null,null,"EQUIPAMENTO E ACESSORIO MARITIMO PARA MERGULHO E SALVAMENTO-",""]
[null,null,null,"EQUIPAMENTOCOMPONENTE E SUPRIMENTOS PARA BUSCA E SEGURANCA",""]
[null,null,null,"EQUIPAMENTOS PARA IMPREGNACAO E DESCONTAMINACAO",""]
[null,null,"EQUIPAMENTOS PARA TRANSMISSAO DE ENERGIA MECANICA","CORREIAS DE TRANSMISSAO E ACESSORIOS","EQUIPAMENTOS_PARA_TRANSMISSAO_DE_ENERGIA_MECANICA"]
[null,null,null,"EQUIPAMENTOS DIVERSOS PARA TRANSMISSAO DE FORCA",""]
["MATERIAL","PERMANENTE","EQUIPAMENTOS PERIFERICOS ACESSORIOS  E SUPRIMENTOS  DE PROCESSAMENTO DE DADOS EM GERAL","ARMAZENAMENTO - INFORMATICA -","EQUIPAMENTOS_PERIFERICOS_ACESSORIOS__E_SUPRIMENTOS__DE_PROCESSAMENTO_DE_DADOS_EM_GERAL"]
[null,null,null,"ATIVOS DE REDE",""]
[null,null,null,"COMPONENTES DE PROCESSAMENTO DE DADOS",""]
[null,null,null,"COMPONENTES PERIFERICOS E ACESSORIOS DE INFORMATICA -",""]
[null,null,null,"DISPOSITIVO DE CONTROLE PARA COMPUTADOR E MICRO",""]
[null,null,null,"EQUIPAMENTOS COMBINADOS PARA INFORMATIZACAO E PROCESSAMENTO DE DADOS",""]
[null,null,null,"EQUIPAMENTOS DE APOIO E MATERIAL DE CONSUMO PARA INFORMATICA",""]
[null,null,null,"EQUIPAMENTOS DE INFORMATICA -",""]
[null,null,null,"EQUIPAMENTOS E DISPOSITIVOS DE SEGURANCA  PARA  EQUIPAMENTOSDE INFORMATICA",""]
[null,null,null,"UNIDADE CENTRAL DE  PROCESSAMENTO  ANALOGICO (CPU) COMPONENTES E PERIFERICOS",""]
[null,null,null,"UNIDADE CENTRAL DE PROCESSAMENTO HIBRIDA (CPU)",""]
["MATERIAL","PERMANENTE","ESTRUTURAS E ANDAIMES PRE FABRICADOS","ABRIGOS DE PAREDE RIGIDA","ESTRUTURAS_E_ANDAIMES_PRE_FABRICADOS"]
[null,null,null,"ANDAIMES ESCADAS E FORMAS DE CONCRETO",""]
[null,null,null,"EDIFICIOS PRE-FABRICADOS E PORTATEIS",""]
[null,null,null,"ESTRUTURAS DE TORRES PRE-FABRICADAS",""]
[null,null,null,"ESTRUTURAS DIVERSAS PRE-FABRICADAS",""]
[null,null,null,"PONTES FIXAS MOVEIS E FLUTUANTES",""]
[null,null,null,"TANQUES DE ARMAZENAGEM COMPONENTES E PECAS",""]
[null,null,"EXPLOSIVOS MUNICOES E DISPOSITIVOS DE DISPERSAO","ARTIGOS PIROTECNICOS E SINALIZADORES","EXPLOSIVOS_MUNICOES_E_DISPOSITIVOS_DE_DISPERSAO"]
[null,null,null,"DISPOSITOS DE DISPERSAO NAO EXPLOSIVOS",""]
[null,null,null,"EXPLOSIVOS E DISPOSITIVOS DE EXPLOSAO",""]
[null,null,null,"MUNICOES",""]
["MATERIAL","CONSUMO","FERRAGENS ABRASIVOS E MATERIAIS PARA VEDACAO","ARRUELA CALCO E ESPACADOR","FERRAGENS_ABRASIVOS_E_MATERIAIS_PARA_VEDACAO"]
[null,null,null,"DISCOS PEDRAS E CORREIAS ABRASIVAS",""]
[null,null,null,"DISPOSITIVOS DE FIXACAO",""]
[null,null,null,"FERRAGENS DIVERSAS",""]
[null,null,null,"MATERIAIS ABRASIVOS",""]
[null,null,null,"MATERIAIS PARA VEDACAO",""]
[null,null,null,"MOLAS DE FIO CHATA E ESPECIAL",""]
[null,null,null,"MOSTRADORES PONTEIROS E BOTOES DE CONTROLE",""]
[null,null,null,"PARAFUSOS COM FENDAS",""]
[null,null,null,"PARAFUSOS SEM FENDAS",""]
[null,null,null,"PORCAS E ARRUELAS PARA PARAFUSOS",""]
[null,null,null,"PREGOS CHAVETAS E PINOS",""]
[null,null,null,"PRISIONEIROS",""]
[null,null,null,"REBITES",""]
[null,null,null,"TELAS E TECIDOS METALICOS",""]
["MATERIAL","CONSUMO","FERRAMENTAS MANUAIS E COMPONENTES","BROCAS REBAIXADORES E ESCARIADORES","FERRAMENTAS_MANUAIS_E_COMPONENTES"]
[null,null,null,"COMPONENTES E PECAS PARA FERRAMENTAS MANUAIS MOTORIZADAS/  ELETRICAS TIPO EMPUNHAVEL",""]
[null,null,null,"FERRAMENTAS ESPECIAIS MANUTENCAO E REPAROS",""]
[null,null,null,"FERRAMENTAS MANUAIS MOTORIZADAS/ELETRICAS/PNEUMATICAS TIPO EMPUNHAVEL",""]
[null,null,null,"FERRAMENTAS MANUAIS COM CORTE NAO MOTORIZADAS",""]
[null,null,null,"FERRAMENTAS MANUAIS SEM CORTE NAO MOTORIZADAS",""]
[null,null,null,"FERRAMENTAS PARA MANUTENCAO EM EQUIPAMENTOS DE INFORMATICA",""]
[null,null,null,"JOGOS E CONJUNTOS DE FERRAMENTAS MANUAIS",""]
[null,null,null,"MACHOS COSSINETES E COLETORES",""]
[null,null,null,"RECIPIENTE PARA FERRAMENTAS",""]
["MATERIAL","CONSUMO","FIOS CABOS TELEFONICOS CONDUITES ELETRICOS EQUIPAMENTO PARA GERACAO E DISTRIBUICAO DE ENERGIA","ACESSORIOS E REVESTIMENTOS DIVERSOS PARA BATERIAS","FIOS_CABOS_TELEFONICOS_CONDUITES_ELETRICOS_EQUIPAMENTO_PARA_GERACAO_E_DISTRIBUICAO_DE_ENERGIA"]
[null,null,null,"BATERIA E PILHA RECARREGAVEL E NAO-RECARREGAVEL",""]
[null,null,null,"BATERIAS PRIMARIAS (PILHAS)",""]
[null,null,null,"CELULA COMBUSTIVEL COMPONENTES E ACESSORIOS",""]
[null,null,null,"COMPONENTES E ACESSORIOS PARA GRUPOS GERADORES PARA         CONTRATOS DE MANUTENCAO PREVENTIVA/CORRETIVA",""]
[null,null,null,"CONVERSORES ELETRICOS NAO ROTATIVOS",""]
[null,null,null,"CONVERSORES ELETRICOS ROTATIVOS",""]
[null,null,null,"EQUIPAMENTOS PARA CONTROLE ELETRICO",""]
[null,null,null,"FIOS CABOS ELETRICOS E TELEFONICOS",""]
[null,null,null,"GERADORES ELETRICOS PECAS E COMPONENTES",""]
[null,null,null,"MATERIAIS E EQUIPAMENTOS DIVERSOS PARA GERACAO/DISTRIBUICAO ENERGIA ELETRICA",""]
[null,null,null,"MOTORES ELETRICOS E COMPONENTES",""]
[null,null,null,"SISTEMAS DE ENERGIA ELETRICA SOLAR",""]
[null,null,"FORNOS CENTRAIS DE VAPOR E EQUIPAMENTOS PARA SECAGEM","CALDEIRAS INDUSTRIAIS","FORNOS_CENTRAIS_DE_VAPOR_E_EQUIPAMENTOS_PARA_SECAGEM"]
[null,null,null,"COMPONENTES E PECAS PARA CALDEIRASFORNOSCENTRAIS DE VAPOR E EQUIPAMENTOS DE SECAGEM",""]
[null,null,null,"FORNALHAS E FORNOS INDUSTRIAIS FORNOS-TUNEIS E ESTUFAS",""]
[null,null,null,"SECADORES DESIDRATADORES E ANTI-HIDRATADORES",""]
["MATERIAL","CONSUMO","FORRAGENS FERTILIZANTES SEMENTES E MUDAS","AGROTOXICOS","FORRAGENS_FERTILIZANTES_SEMENTES_E_MUDAS"]
[null,null,null,"FERTILIZANTES",""]
[null,null,null,"FORRAGENS E ALIMENTOS PARA ANIMAIS",""]
[null,null,null,"INOCULANTES",""]
[null,null,null,"SEMENTES E VIVEIROS PARA PLANTAS",""]
["MATERIAL","CONSUMO","GENEROS ALIMENTICIOS E BEBIDAS","ACUCAR E PRODUTOS DE CONFEITARIA","GENEROS_ALIMENTICIOS_E_BEBIDAS"]
[null,null,null,"ALIMENTOS PREPARADOS E ALIMENTOS DIETETICOS",""]
[null,null,null,"BEBIDAS ALCOOLICAS",""]
[null,null,null,"BEBIDAS NAO ALCOOLICAS",""]
[null,null,null,"CARNES AVES ABATIDAS E PEIXES",""]
[null,null,null,"CONDIMENTOS E PRODUTOS CORRELATOS",""]
[null,null,null,"DIETAS ENTERAIS SUPLEMENTOS E MODULOS NUTRICIONAIS  -",""]
[null,null,null,"DOCES GELEIAS E COMPOTAS",""]
[null,null,null,"FARINHAS E PRODUTOS DE PANIFICACAO",""]
[null,null,null,"OLEOS E GORDURAS COMESTIVEIS",""]
[null,null,null,"OVOS E LATICINIOS",""]
[null,null,null,"PRODUTOS ALIMENTICIOS DE DISTRIBUICAO GRATUITA",""]
[null,null,null,"PRODUTOS E PREPARADOS SOLUVEIS",""]
[null,null,null,"SEMENTES E CEREAIS BENEFICIADOS FRUTAS LEGUMES E HORTALICAS",""]
[null,null,null,"SOPAS E CALDOS",""]
[null,null,null,"SORVETES SUCOS REFRESCOS E BEBIDAS LACTEAS",""]
["MATERIAL","PERMANENTE","INSTRUMENTOS MUSICAIS RADIOS FONOGRAFOS TELEVISOR VIDEO AUDIO SONORIZACAO E ACESSORIOS","ACESSORIOS E PARTES DE INSTRUMENTOS MUSICAIS","INSTRUMENTOS_MUSICAIS_RADIOS_FONOGRAFOS_TELEVISOR_VIDEO_AUDIO_SONORIZACAO_E_ACESSORIOS"]
[null,null,null,"GRAVACAO FONOGRAFICACINEMATOGRAFICA E FITA VIRGEM",""]
[null,null,null,"INSTRUMENTOS MUSICAIS",""]
[null,null,null,"RADIOS FONOGRAFOS TELEVISORES TIPO DOMESTICO E ACESSORIOS",""]
["MATERIAL","CONSUMO","LAMPADAS E APARELHOS DE ILUMINACAO","APARELHOS  E ARTIGOS DE ILUMINACAO ELETRICA VEICULAR","LAMPADAS_E_APARELHOS_DE_ILUMINACAO"]
[null,null,null,"APARELHOS E ARTIGOS DE ILUMINACAO ELETRICA INTERNOS E EXTERNOS",""]
[null,null,null,"APARELHOS E ARTIGOS DE ILUMINACAO ELETRICA PORTATEIS E MANUAIS",""]
[null,null,null,"EQUIPAMENTO DE INFRAESTRUTURA PARA ILUMINACAO",""]
[null,null,null,"LAMPADAS ELETRICAS",""]
[null,null,null,"MATERIAIS E APARELHOS DE ILUMINACAO NAO ELETRICOS",""]
[null,null,null,"REATORES(COMPENSADOS) ELEMENTOS DE PARTIDA E PORTA-LAMPADAS",""]
["MATERIAL","CONSUMO","LIVROS MAPAS E OUTRAS PUBLICACOES","IMPRESSOS DIVERSOS","LIVROS_MAPAS_E_OUTRAS_PUBLICACOES"]
[null,null,null,"JORNAIS E PERIODICOS",""]
[null,null,null,"LIVROS E FOLHETOS",""]
[null,null,null,"LIVROS E FOLHETOS DE MUSICA",""]
[null,null,null,"MAPAS ATLAS CARTAS ORTO E AEROFOTOS IMAGEM ORBITAL E GLOBOS",""]
[null,null,null,"NORMAS E DESENHOS TECNICOS",""]
["SERVICO",null,"LOCACOES","SERVICO DE LOCACAO DE EQUIPAMENTOS MAQUINAS APARELHOS INSTRUMENTAL FERRAMENTAL MATERIAL E INSTALACOES","LOCACOES"]
[null,null,null,"SERVICOS DE LOCACAO DE APARELHOS EQUIPAMENTOS DE TELECOMUNICACAO E LINHAS",""]
[null,null,null,"SERVICOS DE LOCACAO DE IMOVEIS",""]
[null,null,null,"SERVICOS DE LOCACAO DE MATERIAIS E EQUIPAMENTOS DE MIDIA",""]
[null,null,null,"SERVICOS DE LOCACAO DE VEICULOS E AERONAVES",""]
[null,null,"MADEIRAS  ESQUADRIAS  COMPENSADOS E FOLHEADOS","COMPENSADOS FOLHEADOS  E AGLOMERADOS","MADEIRAS__ESQUADRIAS__COMPENSADOS_E_FOLHEADOS"]
[null,null,null,"ESQUADRIA DE MADEIRA",""]
[null,null,null,"MADEIRAS E PRODUTOS DERIVADOS",""]
[null,null,"MAQUINARIA E EQUIPAMENTOS AGRICOLAS","COMPONENTES E PECAS PARA MAQUINA E EQUIPAMENTOS AGRICOLAS","MAQUINARIA_E_EQUIPAMENTOS_AGRICOLAS"]
[null,null,null,"EQUIPAMENTOS AGRICOLAS",""]
[null,null,null,"EQUIPAMENTOS DE COLHEITA",""]
[null,null,null,"EQUIPAMENTOS DE TRACAO ANIMAL",""]
[null,null,null,"EQUIPAMENTOS PARA AGRO-PECUARIA",""]
[null,null,null,"EQUIPAMENTOS PARA COMBATE A PRAGAS",""]
[null,null,null,"FERRAMENTAS PARA JARDINAGEM E HORTICULTURA",""]
[null,null,null,"MATERIAIS DIVERSOS PARA ANIMAIS",""]
[null,null,null,"PECAS E COMPONENTES PARA EQUIPAMENTOS AGRICOLAS -CONTRATACAOMEDIANTE FORNECIMENTO PARCELADO",""]
[null,null,"MAQUINARIA EQUIPAMENTOS COMPONENTES E SUPRIMENTOS PARA A  INDUSTRIA ESPECIALIZADA","EQUIPAMENTO PARA PRODUCAO E RECICLAGEM DE GASES -","MAQUINARIA_EQUIPAMENTOS_COMPONENTES_E_SUPRIMENTOS_PARA_A__INDUSTRIA_ESPECIALIZADA"]
[null,null,null,"EQUIPAMENTOS COMPONENTES E SUPRIMENTOS PARA INDUSTRIAS DIVERSAS",""]
[null,null,null,"MAQUINAS INDUSTRIAIS DE MONTAGEM",""]
[null,null,null,"MAQUINAS EQUIPAMENTOS E COMPONENTES DE MANUFATURA DE  PRODUTOS QUIMICOS E FARMACEUTICOS",""]
[null,null,null,"MAQUINAS EQUIPAMENTOS COMPONENTES E SUPRIMENTOS PARA INDUSTRIA DE BORRACHA PLASTICO E PRODUTOS SINTETICOS",""]
[null,null,null,"MAQUINAS EQUIPAMENTOS COMPONENTES E SUPRIMENTOS PARA INDUSTRIA DE PRODUTOS ALIMENTICIOS",""]
[null,null,null,"MAQUINAS EQUIPAMENTOS COMPONENTES E SUPRIMENTOS PARA INDUSTRIA DE PRODUTOS DE ARGILA E CONCRETO",""]
[null,null,null,"MAQUINAS EQUIPAMENTOS COMPONENTES E SUPRIMENTOS PARA INDUSTRIA GRAFICA",""]
[null,null,null,"MAQUINAS EQUIPAMENTOS COMPONENTES E SUPRIMENTOS PARA INDUSTRIAS TEXTEIS",""]
[null,null,null,"MAQUINAS EQUIPAMETOS COMPONENTES E SUPRIMENTOS PARA INDUSTRIA DE POLPA E DE PAPEL",""]
[null,null,null,"PECAS E COMPONENTES PARA MAQUINARIA E EQUIPAMENTOS P/INDUS  TRIA ESPECIALIZADA",""]
["MATERIAL","PERMANENTE","MAQUINAS DE ESCRITORIO E EQUIPAMENTO DE REGISTRO VISUAL","EQUIPAMENTOS DE SISTEMAS DE INFORMACAO PARA ESCRITORIO","MAQUINAS_DE_ESCRITORIO_E_EQUIPAMENTO_DE_REGISTRO_VISUAL"]
[null,null,null,"MAQUINA DE DATILOGRAFIA E MAQUINA DE COMPOSICAO DE TIPOS  PARA ESCRITORIO",""]
[null,null,null,"MAQUINAS CALCULADORAS E DE CONTABILIDADE",""]
[null,null,null,"MAQUINAS DIVERSAS DE ESCRITORIO",""]
[null,null,null,"PECASACESSORIOS E COMPONENTES PARA MAQUINAS DE ESCRITORIO E EQUIPAMENTOS DE REGISTRO VISUAL",""]
["MATERIAL","CONSUMO","MATERIAIS DIVERSOS","ACESSORIOS E PECAS PARA ARTESANATO E BIJUTERIA","MATERIAIS_DIVERSOS"]
[null,null,null,"ARTIGOS PARA FUMANTES E PRODUTOS DE TABACO (FUMO)",""]
[null,null,null,"EQUIPAMENTOS MOBILIARIOS E SUPRIMENTOS ECLESIASTICOS",""]
[null,null,null,"ITENS DIVERSOS",""]
[null,null,null,"LETREIROS MOSTRUARIOS DISPOSITIVOS DE AVISOS E CHAPAS DE IDENTIFICACAO",""]
[null,null,null,"MATERIAIS DIVERSOS PARA ALIENACAO",""]
[null,null,null,"MATERIAIS PROMOCIONAIS",""]
[null,null,null,"MATERIAL PARA CONSERVACAO E RESTAURACAO",""]
[null,null,null,"PATRIMONIO ANTIGO - MATERIAIS NAO CLASSIFICADOS             EM OUTROS GRUPOS",""]
[null,null,null,"PECAS PARA ACERVO E OBRAS DE ARTE - ITENS COLECIONADORES",""]
["MATERIAL","PERMANENTE","MATERIAIS E EQUIPAMENTOS FOTOGRAFICOS E CINEMATOGRAFICOS","CAMERA E EQUIPAMENTOS FOTOGRAFICOS -","MATERIAIS_E_EQUIPAMENTOS_FOTOGRAFICOS_E_CINEMATOGRAFICOS"]
[null,null,null,"CAMERAS CINEMATOGRAFICAS E DE ESTUDIO DE TV",""]
[null,null,null,"EQUIPAMENTOS PARA PROJECAO FOTOGRAFICA E CINEMATOGRAFICA",""]
[null,null,null,"EQUIPAMENTOS PARA REVELACAO E ACABAMENTOS FOTOGRAFICOS",""]
[null,null,null,"JOGOS E ESTOJOS DE MATERIAL FOTOGRAFICO  E CINEMATOGRAFICO",""]
[null,null,null,"MATERIAIS FOTOGRAFICOS E CINEMATOGRAFICOS",""]
[null,null,null,"PECAS E ACESSORIOS PARA EQUIPAMENTOS FOTOGRAFICOS CINEMATO GRAFICOS E DE PROJECAO",""]
[null,null,"MATERIAIS E EQUIPAMENTOS PARA EMBARCACOES","EQUIPAMENTOS COMPONENTES E ACESSORIOS PARA EMBARCACOES","MATERIAIS_E_EQUIPAMENTOS_PARA_EMBARCACOES"]
[null,null,null,"FERRAGENS PARA EMBARCACOES E ITENS DO CASCO",""]
["MATERIAL","CONSUMO","MATERIAIS E EQUIPAMENTOS PARA LIMPEZA","ASPIRADORES DE PO E ENCERADEIRA E SEUS COMPONENTES","MATERIAIS_E_EQUIPAMENTOS_PARA_LIMPEZA"]
[null,null,null,"COMPOSTOS E PREPARADOS PARA LIMPEZA E POLIMENTO",""]
[null,null,null,"EQUIPAMENTOS AUXILIARES E MATERIAIS PARA LIMPEZA",""]
["MATERIAL","CONSUMO","MATERIAIS E EQUIPAMENTOS PARA RECREACAO E DESPORTO","JOGOS E BRINQUEDOS","MATERIAIS_E_EQUIPAMENTOS_PARA_RECREACAO_E_DESPORTO"]
[null,null,null,"MATERIAIS E EQUIPAMENTOS PARA ATLETISMO E DESPORTO",""]
[null,null,null,"MATERIAIS E EQUIPAMENTOS PARA GINASTICA E RECREACAO",""]
[null,null,null,"PECAS E COMPONENTES",""]
["MATERIAL","CONSUMO","MATERIAIS E EQUIPAMENTOS PARA USOS MEDICOS ODONTOLOGICOS  E VETERINARIOS","COMPONENTES E ACESSORIOS PARA EQUIPAMENTOS MEDICOS-HOSPITALARES PARA CONTRATOS DE MANUTENCAO PREVENTIVA/CORRETIVA","MATERIAIS_E_EQUIPAMENTOS_PARA_USOS_MEDICOS_ODONTOLOGICOS__E_VETERINARIOS"]
[null,null,null,"COMPONENTES E ACESSORIOS PARA EQUIPAMENTOS ODONTOLOGICOS    PARA CONTRATOS DE MANUTENCAO PREVENTIVA/CORRETIVA",""]
[null,null,null,"COMPONENTES E PECAS DE MOBILIARIO PARA USO MEDICO HOSPITALAR E REABILITACAO",""]
[null,null,null,"COSMETICOS E PRODUTOS DE TOALETES PARA PACIENTES HOSPITALIZADOS",""]
[null,null,null,"DROGAS PRODUTOS BIOLOGICOS E REAGENTES OFICINAIS (PADRONIZADOS)",""]
[null,null,null,"EQUIPAMENTOS E APARELHOS ODONTOLOGICOS",""]
[null,null,null,"EQUIPAMENTOS E SUPRIMENTOS PARA  RAIO-X USO MEDICO/ODONTOLOGICO/VETERINARIO",""]
[null,null,null,"EQUIPAMENTOS PARA TECNOLOGIA ASSISTIVA",""]
[null,null,null,"EQUIPAMENTOS APARELHOS E UTENSILIOS MEDICOS-HOSPITALARES",""]
[null,null,null,"EQUIPAMENTOS INSTRUMENTOS  E  SUPRIMENTOS DE OFTALMOLOGIA  (OPTOMETRIA)",""]
[null,null,null,"INSTRUMENTOS E UTENSILIOS ODONTOLOGICOS",""]
[null,null,null,"INSTRUMENTOS MEDICOS-HOSPITALARES",""]
[null,null,null,"INSTRUMENTOS EQUIPAMENTOS E ARTIGOS VETERINARIOS",""]
[null,null,null,"MATERIAIS CIRURGICOS PARA CURATIVOS",""]
[null,null,null,"MOBILIARIO PARA USO MEDICO HOSPITALAR REABILITACAO E      LABORATORIO",""]
[null,null,null,"PECAS E COMPONENTES DE EQUIPAMENTOS PARA USO ODONTOLOGICO",""]
[null,null,null,"PECAS E COMPONENTES PARA EQUIPAMENTOS DE RAIO-X USO MEDICO ODONTOLOGICO E VETERINARIO",""]
[null,null,null,"PECAS E COMPONENTES PARA EQUIPAMENTOS E INSTRUMENTOS DE OFTALMOLOGIA (OPTOMETRIA)",""]
[null,null,null,"PECAS E COMPONENTES PARA EQUIPAMENTOS MEDICOS CIRURGICOS E HOSPITALARES",""]
[null,null,null,"SUPRIMENTOS PARA TECNOLOGIA ASSISTIVA",""]
[null,null,null,"SUPRIMENTOS PARA USO MEDICO E CIRURGICO",""]
[null,null,null,"SUPRIMENTOS PARA USO ODONTOLOGICO",""]
[null,null,null,"VESTUARIO DE USO MEDICO E ODONTOLOGICO NAO DESCARTAVEL",""]
[null,null,null,"VESTUARIO DESCARTAVEL DE USO MEDICO ODONTOLOGICO E HOSPITA LAR",""]
["MATERIAL","CONSUMO","MATERIAIS MANUFATURADOS NAO METALICOS","MATERIAIS DIVERSOS NAO METALICOS ACABADOS","MATERIAIS_MANUFATURADOS_NAO_METALICOS"]
[null,null,null,"PAPEL E PAPELAO",""]
[null,null,null,"PRODUTOS ACABADOS DE BORRACHA",""]
[null,null,null,"PRODUTOS ACABADOS DE PLASTICO",""]
[null,null,null,"PRODUTOS ACABADOS DE REFRATARIOS",""]
[null,null,null,"PRODUTOS ACABADOS DE VIDRO",""]
[null,null,"MATERIAIS PARA CONSTRUCAO","CERCADOS TELAS E PORTOES","MATERIAIS_PARA_CONSTRUCAO"]
[null,null,null,"MATERIAIS DIVERSOS PARA CONSTRUCAO",""]
[null,null,null,"MATERIAIS PARA COBERTURAS",""]
[null,null,null,"MATERIAL PARA CONSTRUCAO A GRANEL DE ORIGEM MINERAL",""]
[null,null,null,"MATERIAL PARA CONSTRUCAO DIMENSIONADOS NAO METALICOS",""]
[null,null,null,"MATERIAL PARA ISOLAMENTOS TERMICO E ACUSTICO E PAINEIS DIVI SORIOS",""]
[null,null,null,"PRODUTOS METALICOS PARA ARQUITETURA",""]
[null,null,null,"TUBOS CONDUTOS E CORRELATOS NAO METALICOS",""]
["MATERIAL","CONSUMO","MATERIAIS PARA EXECUCAO DE OBRAS","CERCAS TELAS ARAMES E PORTOES","MATERIAIS_PARA_EXECUCAO_DE_OBRAS"]
[null,null,null,"FERRAGENS E PRODUTOS METALICOS E PERFILADOS",""]
[null,null,null,"MADEIRAS ESQUADRIAS E FOLHEADOS",""]
[null,null,null,"MATERIAIS DIVERSOS PARA OBRAS",""]
[null,null,null,"MATERIAIS PARA INSTALACOES INCORPORAVEIS A OBRAS",""]
[null,null,null,"MATERIAL A GRANEL DE ORIGEM MINERAL",""]
[null,null,null,"MATERIAL DIMENSIONADO NAO METALICO",""]
[null,null,null,"MATERIAL PARA COBERTURA",""]
[null,null,null,"TINTAS SECANTES ADESIVOS E PRODUTOS CORRELATOS",""]
[null,null,null,"TUBOS CONDUTOS E CORRELATOS E CONEXOES  METALICOS E NAO METALICOS",""]
["MATERIAL","CONSUMO","MATERIAS PRIMAS NAO METALICAS","FIBRAS VEGETAIS ANIMAIS E SINTETICAS","MATERIAS_PRIMAS_NAO_METALICAS"]
[null,null,null,"MATERIA-PRIMA DE ORIGEM MINERAL E SINTETICA",""]
[null,null,"MEDICAMENTO","ANABOLIZANTES PARA USO SISTEMICO","MEDICAMENTO"]
[null,null,null,"ANALGESICOS E ANTIPIRETICOS",""]
[null,null,null,"ANESTESICOS",""]
[null,null,null,"ANSIOLITICOS",""]
[null,null,null,"ANTIACIDOS INIBIDORES DA SECRECAO GASTRICA E TRATAMENTO DASULCERAS",""]
[null,null,null,"ANTIACNEICOS",""]
[null,null,null,"ANTIASMATICOS",""]
[null,null,null,"ANTIBACTERIANOS SISTEMICOS",""]
[null,null,null,"ANTICOAGULANTES ANTITROMBOTICOS E TROMBOLITICOS",""]
[null,null,null,"ANTICONCEPCIONAIS HORMONIOS SEXUAIS E MODULADORES DO SISTEMA GENITAL",""]
[null,null,null,"ANTIDEPRESSIVOS",""]
[null,null,null,"ANTIDIARREICOS ANTI-INFLAMATORIOS ANTI-INFECCIOSOS INTESTINAIS",""]
[null,null,null,"ANTIDOTOS AGENTES DESINTOXICANTES E AGENTES QUELANTES",""]
[null,null,null,"ANTIEMETICOS E ANTINAUSEANTES",""]
[null,null,null,"ANTIEPILEPTICOS",""]
[null,null,null,"ANTIESPASMODICOS ANTICOLINERGICOS E PROPULSIVOS",""]
[null,null,null,"ANTIFUNGICOS SISTEMICOS",""]
[null,null,null,"ANTIGOTOSOS",""]
[null,null,null,"ANTI-HELMINTICOS",""]
[null,null,null,"ANTI-HEMORRAGICOS FATORES DE COAGULACAO E CORRELATOS",""]
[null,null,null,"ANTI-HIPERTENSIVOS",""]
[null,null,null,"ANTI-HISTAMINICOS SISTEMICOS",""]
[null,null,null,"ANTI-INFECCIOSOS E ANTISSEPTICOS GINECOLOGICOS",""]
[null,null,null,"ANTI-INFECCIOSOS ANTIBIOTICOS E ANTI-INFLAMATORIOS TOPICOS",""]
[null,null,null,"ANTI-INFLAMATORIOS E ANTIRREUMATICOS",""]
[null,null,null,"ANTIMICOBACTERIANOS SISTEMICOS",""]
[null,null,null,"ANTINEOPLASICOS",""]
[null,null,null,"ANTIPARKINSONIANOS",""]
[null,null,null,"ANTIPROTOZOARIOS",""]
[null,null,null,"ANTIPRURIGINOSOS E ANTIPSORIATICOS",""]
[null,null,null,"ANTIPSICICOTICOS",""]
[null,null,null,"ANTISSEPTICOS E DESINFETANTES",""]
[null,null,null,"ANTIVIRAIS SISTEMICOS",""]
[null,null,null,"ANTROPOSOFICOS FITOTERAPICOS E HOMEOPATICOS",""]
[null,null,null,"BETA-BLOQUEADORES",""]
[null,null,null,"BLOQUEADORES DE CANAL DE CALCIO",""]
[null,null,null,"CORTICOESTEROIDES SISTEMICOS",""]
[null,null,null,"DIGESTIVOS E ENZIMAS DIGESTIVAS",""]
[null,null,null,"DIURETICOS",""]
[null,null,null,"EMOLIENTES HIDRATANTES PROTETORES E FILTRO SOLAR",""]
[null,null,null,"EQUIPAMENTOS REAGENTES SOLVENTES E OUTROS INSUMOS FARMACEUTICOS",""]
[null,null,null,"ESTIMULANTES CARDIACOS CARDIOTONICOS E GLICOSIDEOS",""]
[null,null,null,"ESTIMULANTES DO APETITE",""]
[null,null,null,"FORMULAS OU ASSOCIACOES MANIPULADAS",""]
[null,null,null,"GASES MEDICINAIS",""]
[null,null,null,"HEMODIALISES DIALISES E SOLUCOES PARA PERFUSAO E IRRIGACAO",""]
[null,null,null,"HIPNOTICOS E SEDATIVOS",""]
[null,null,null,"HIPOLIPEMIANTES",""]
[null,null,null,"HORMONIOS HIPOFISARIOS HIPOTALAMICOS E ANALOGOS",""]
[null,null,null,"HORMONIOS PANCREATICOS",""]
[null,null,null,"IMUNOESTIMULANTES",""]
[null,null,null,"IMUNOSOROS E IMUNOGLOBULINAS",""]
[null,null,null,"IMUNOSSUPRESSORES",""]
[null,null,null,"INSETICIDAS REPELENTES ESCABICIDAS E ECTOPARASITOCIDAS",""]
[null,null,null,"LAXATIVOS",""]
[null,null,null,"MEDICAMENTOS PARA TOSSE E RESFRIADO",""]
[null,null,null,"MEDICAMENTOS RELACIONADOS A HOMEOSTASIA DO CALCIO",""]
[null,null,null,"MEDICAMENTOS UROLOGICOS",""]
[null,null,null,"MEDICAMENTOS UTILIZADOS NO DIABETES",""]
[null,null,null,"MEDICAMENTOS VETERINARIOS",""]
[null,null,null,"MEIOS DE CONTRASTE",""]
[null,null,null,"NUTRICAO PARENTERAL",""]
[null,null,null,"OUTROS MEDICAMENTOS PARA O SISTEMA DIGESTIVO E O METABOLISMO",""]
[null,null,null,"OUTROS MEDICAMENTOS PARA O SISTEMA MUSCULO-ESQUELETICO",""]
[null,null,null,"OUTROS MEDICAMENTOS PARA O SISTEMA NERVOSO",""]
[null,null,null,"OUTROS MEDICAMENTOS PARA O SISTEMA RESPIRATORIO",""]
[null,null,null,"OUTROS PREPARADOS DERMATOLOGICOS",""]
[null,null,null,"OUTROS PREPARADOS GINECOLOGICOS",""]
[null,null,null,"OUTROS PREPARADOS HEMATOLOGICOS",""]
[null,null,null,"OUTROS PRODUTOS TERAPEUTICOS",""]
[null,null,null,"PREPARADOS ANTIANEMICOS",""]
[null,null,null,"PREPARADOS ANTIOBESIDADE",""]
[null,null,null,"PREPARADOS ESTOMATOLOGICOS (BOCA E DENTES)",""]
[null,null,null,"PREPARADOS PARA USO NASAL",""]
[null,null,null,"PRODUTOS OFTALMOLOGICOS",""]
[null,null,null,"PRODUTOS OTOLOGICOS",""]
[null,null,null,"PSICOESTIMULANTES",""]
[null,null,null,"PSICOLEPTICOS E PSICOANAPLETICOS EM ASSOCIACAO",""]
[null,null,null,"RELAXANTES MUSCULARES",""]
[null,null,null,"SISTEMA RENINA-ANGIOTENSINA",""]
[null,null,null,"TERAPIAS ENDOCRINAS",""]
[null,null,null,"TESTES E AGENTES DE DIAGNOSTICO",""]
[null,null,null,"TONICOS E REPOSITORES HIDROELETROLITICOS ORAIS",""]
[null,null,null,"TRATAMENTO BILIAR E HEPATICO",""]
[null,null,null,"TRATAMENTO DA TIREOIDE",""]
[null,null,null,"TRATAMENTO DE DOENCAS OSSEAS",""]
[null,null,null,"TRATAMENTO DE FERIDAS E ULCERAS",""]
[null,null,null,"TRATAMENTO DO ALZHEIMER E DEMENCIA",""]
[null,null,null,"VACINAS",""]
[null,null,null,"VASODILATADORES PERIFERICOS",""]
[null,null,null,"VASOPROTETORES",""]
[null,null,null,"VITAMINAS SUPLEMENTOS MINERAIS E ASSOCIACOES",""]
[null,null,null,"ACAO ENDOCRINA/CORTICOSTEROIDES",""]
[null,null,null,"ACAO ENDOCRINA/HIPERGLICEMIANTES",""]
[null,null,null,"ACAO ENDOCRINA/HIPOGLICEMIANTES ORAIS",""]
[null,null,null,"ACAO ENDOCRINA/HORMONIOS ESTROGENICOS",""]
[null,null,null,"ACAO ENDOCRINA/HORMONIOS HOPIFISARIOS E AFINS",""]
[null,null,null,"ACAO ENDOCRINA/HORMONIOS PROGESTAGENICOS",""]
[null,null,null,"ACAO ENDOCRINA/HORMONIOS TIREOIDEANOS E INIBIDORES DA FUNCAO TIREOIDEANA",""]
[null,null,null,"ACAO ENDOCRINA/INIBIDORES DA SECRECAO DE PROLACTINA",""]
[null,null,null,"ACAO ENDOCRINA/INSULINA",""]
[null,null,null,"AGENTES DIAGNOSTICOS/AUXILIARES DE DIAGNOSTICOS",""]
[null,null,null,"AGENTES DIAGNOSTICOS/CONTRASTES RADIOLOGICOS",""]
[null,null,null,"ANTIDOTOS",""]
[null,null,null,"ANTIINFECCIOSOS/ANTIBIOTICOS",""]
[null,null,null,"ANTIINFECCIOSOS/ANTIFUNGICOS",""]
[null,null,null,"ANTIINFECCIOSOS/ANTIVIRAIS",""]
[null,null,null,"ANTIINFECCIOSOS/HANSENOSTATICOS E TUBERCULOSTATICOS",""]
[null,null,null,"ANTIINFECCIOSOS/NITROFURANOS QUINOLONAS E SULFONAMIDAS",""]
[null,null,null,"ANTIMEOPLASICOS/PRODUTOS NATURAIS",""]
[null,null,null,"ANTINEOPLASICOS/AGENTES ALQUILANTES",""]
[null,null,null,"ANTINEOPLASICOS/ALCALOIDES",""]
[null,null,null,"ANTINEOPLASICOS/ANTIBIOTICOS CITOTOXICOS",""]
[null,null,null,"ANTINEOPLASICOS/ANTIMETABOLICOS",""]
[null,null,null,"ANTINEOPLASICOS/COMPOSTOS DE PLATINA",""]
[null,null,null,"ANTINEOPLASICOS/HORMONIOS INIBIDORES ENZIMATICOS E DA ACAO HORMONAL",""]
[null,null,null,"ANTIPARASITARIOS",""]
[null,null,null,"APARELHO DIGESTIVO/ADSORVENTES ANTIFISETICOS E ANTIFLATULENTOS",""]
[null,null,null,"APARELHO DIGESTIVO/ANTIACIDOS E INIBIDORES DA SECRECAO GAS  TRICA",""]
[null,null,null,"APARELHO DIGESTIVO/ANTIEMETICOS E PRO-CINETICOS",""]
[null,null,null,"APARELHO DIGESTIVO/CONSTIPANTES",""]
[null,null,null,"APARELHO DIGESTIVO/DIGESTIVOS E ANTIINFLAMATORIOS",""]
[null,null,null,"APARELHO DIGESTIVO/LAXATIVOS",""]
[null,null,null,"APARELHO GENITURINARIO/ANTICONCEPCIONAIS E ANOVULATORIOS",""]
[null,null,null,"APARELHO GENITURINARIO/ANTISSEPTICOS",""]
[null,null,null,"APARELHO GENITURINARIO/DIURETICOS E TERAPEUTIICA DA INCONTI NENCIA URINARIA",""]
[null,null,null,"APARELHO GENITURINARIO/OXITOCITOS",""]
[null,null,null,"APARELHO RESPIRATORIO/AGENTES TENSOATIVO PULMONAR",""]
[null,null,null,"APARELHO RESPIRATORIO/ANTITUSSIGENOS",""]
[null,null,null,"APARELHO RESPIRATORIO/BRONCODILATADORES",""]
[null,null,null,"APARELHO RESPIRATORIO/EXPECTORANTES FLUIDIFICANTES E       DESCONGESTIONANTES",""]
[null,null,null,"FITOTERAPICOS",""]
[null,null,null,"IMUNOTERAPICOS/IMUNOGLOBULINAS",""]
[null,null,null,"IMUNOTERAPICOS/IMUNOSSUPRESSORES",""]
[null,null,null,"IMUNOTERAPICOS/SOROS",""]
[null,null,null,"IMUNOTERAPICOS/VACINAS E TOXOIDES",""]
[null,null,null,"MEDICAMENTOS DECISAO JUDICIAL DE USO EXCLUSIVO DA SES",""]
[null,null,null,"METABOLISMO E NUTRICAO/AGENTES PARA REPOSICAO HIDROELETROLI TICA",""]
[null,null,null,"METABOLISMO E NUTRICAO/HIPOLIPEMIANTES",""]
[null,null,null,"METABOLISMO E NUTRICAO/NUTRIENTES DE USO PARENTERAL E       DIETAS ENTERAIS",""]
[null,null,null,"METABOLISMO E NUTRICAO/REGULADORES DO METABOLISMO OSSEO VI TAMINAS SUPLEMENTOS MINERAIS E ENZIMATICOS",""]
[null,null,null,"METABOLISMO E NUTRICAO/SUPLEMENTOS DIETETICOS",""]
[null,null,null,"OFTALMICOS/AGENTES DIAGNOSTICOS E AUXILIARES CIRURGICOS",""]
[null,null,null,"OFTALMICOS/ANESTESICOS",""]
[null,null,null,"OFTALMICOS/ANTIINFECCIOSOS E ANTIINFLAMATORIOS",""]
[null,null,null,"OFTALMICOS/MIOTICOS MEDRIATICOS CICLOPLEGICOS E ANTIGLAUCOMATOSOS",""]
[null,null,null,"OFTALMICOS/UMECTANTES",""]
[null,null,null,"ORGAOS HEMATOPOIETICOS E SANGUE/ANTIAGREGANTE PLAQUETARIO",""]
[null,null,null,"ORGAOS HEMATOPOIETICOS E SANGUE/ANTIANEMICOS",""]
[null,null,null,"ORGAOS HEMATOPOIETICOS E SANGUE/ANTICOAGULANTES",""]
[null,null,null,"ORGAOS HEMATOPOIETICOS E SANGUE/ANTI-HEMORRAGICOS",""]
[null,null,null,"ORGAOS HEMATOPOIETICOS E SANGUE/ESTIMULANTES E INIBIDORES",""]
[null,null,null,"ORGAOS HEMATOPOIETICOS E SANGUE/EXPANSORES E PLASMATICOS",""]
[null,null,null,"ORGAOS HEMATOPOIETICOS E SANGUE/FATORES E COAGULACAO E CORRELATOS",""]
[null,null,null,"ORGAOS HEMATOPOIETICOS E SANGUE/FIBRINOLITICOS",""]
[null,null,null,"SISTEMA CIRCULARORIO/CARDIOTONICOS",""]
[null,null,null,"SISTEMA CIRCULATORIO/ANTIANGINOSOS",""]
[null,null,null,"SISTEMA CIRCULATORIO/ANTIARRITMICOS",""]
[null,null,null,"SISTEMA CIRCULATORIO/ANTI-HIPERTENSIVOS",""]
[null,null,null,"SISTEMA CIRCULATORIO/BLOQUEADORES DOS CANAIS DE CALCIO",""]
[null,null,null,"SISTEMA CIRCULATORIO/VASODILATADORES E ESCLEROSANTES",""]
[null,null,null,"SISTEMA MUSCULO ESQUELETICO/ANTIGOTOSOS",""]
[null,null,null,"SISTEMA MUSCULO ESQUELETICO/RELAXANTES MUSCULARES",""]
[null,null,null,"SISTEMA NERVOSO AUTONOMO/ADRENERGICOS",""]
[null,null,null,"SISTEMA NERVOSO AUTONOMO/ANTI-HISTAMINICOS",""]
[null,null,null,"SISTEMA NERVOSO AUTONOMO/BLOQUEADORES COLINERGICOS E ANTIES PASMODICOS",""]
[null,null,null,"SISTEMA NERVOSO AUTONOMO/COLINERGICOS",""]
[null,null,null,"SISTEMA NERVOSO CENTRAL E PERIFERICO/ANALGESICOS ANTIINFLA MATORIOS E ANTIPIRETICOS",""]
[null,null,null,"SISTEMA NERVOSO CENTRAL E PERIFERICO/ANESTESICOS GERAIS",""]
[null,null,null,"SISTEMA NERVOSO CENTRAL E PERIFERICO/ANESTESICOS LOCAIS",""]
[null,null,null,"SISTEMA NERVOSO CENTRAL E PERIFERICO/ANSIOLITICOS",""]
[null,null,null,"SISTEMA NERVOSO CENTRAL E PERIFERICO/ANTICONVULSIVANTES",""]
[null,null,null,"SISTEMA NERVOSO CENTRAL E PERIFERICO/ANTIDEPRESSIVOS E ESTA BILIZADORES DO HUMOR",""]
[null,null,null,"SISTEMA NERVOSO CENTRAL E PERIFERICO/ANTIPARKINSONIANOS",""]
[null,null,null,"SISTEMA NERVOSO CENTRAL E PERIFERICO/ANTIVERTIGINOSOS",""]
[null,null,null,"SISTEMA NERVOSO CENTRAL E PERIFERICO/BLOQUADORES MUSCULARES",""]
[null,null,null,"SISTEMA NERVOSO CENTRAL E PERIFERICO/HIPNOTICOS E SEDATIVOS",""]
[null,null,null,"SISTEMA NERVOSO CENTRAL E PERIFERICO/HIPOANALGESICOS",""]
[null,null,null,"SISTEMA NERVOSO CENTRAL E PERIFERICO/NEUROLEPTICOS/ANTIPSICOTICOS",""]
[null,null,null,"SISTEMA NERVOSO CENTRAL E PERIFERICO/TERAPEUTICA DA DOENCA  DE ALZHEIMER",""]
[null,null,null,"SOLUCOES PARA DIALISE HEMODIALISE E IRRIGACAO",""]
[null,null,null,"USO EXTERNO/ANTIINFECCIOSOS ANTIINFLAMATORIOS E ANTI-HEMOR ROIDARIOS",""]
[null,null,null,"USO EXTERNO/ANTIPARASITARIOS E FUNGICIDAS",""]
[null,null,null,"USO EXTERNO/ANTISSEPTICOS",""]
[null,null,null,"USO EXTERNO/PROTETORES E REDUTORES",""]
[null,null,null,"USO TOPICO UTILIZADOS EM OTORRINOLARINGOLOGIA/ANTIINFECCIO  SOS E ANTIINFLAMATORIOS",""]
[null,null,null,"USO TOPICO UTILIZADOS EM OTORRINOLARINGOLOGIA/DESCONGESTIO  NANTES",""]
[null,null,null,"USO TOPICO UTILIZADOS EM OTORRINOLARINGOLOGIA/EMOLIENTES",""]
[null,null,null,"VETERINARIOS",""]
["MATERIAL","CONSUMO","MINERIOS MINERAIS E SEUS PRODUTOS PRIMARIOS SEMIACABADOS","MINERAIS NATURAIS E SINTETICOS","MINERIOS_MINERAIS_E_SEUS_PRODUTOS_PRIMARIOS_SEMIACABADOS"]
[null,null,null,"PRODUTOS PRIMARIOS E SEMIACABADOS DE FERRO E DE ACO",""]
[null,null,null,"PRODUTOS PRIMARIOS E SEMIACABADOS DE METAIS NAO FERROSOS",""]
[null,null,null,"SUCATA DE FERRO E DE ACO",""]
[null,null,null,"SUCATA DE METAIS NAO FERROSOS",""]
[null,null,"MOBILIARIO","COMPONENTES E PECAS PARA MOBILIARIO","MOBILIARIO"]
[null,null,null,"ESTANTES E ARMACOES PARA ALMOXARIFADOS",""]
[null,null,null,"MOBILIARIO DE ESCRITORIO",""]
[null,null,null,"MOBILIARIO DE USO GERAL",""]
[null,null,null,"MOBILIARIO DIVERSO E ESPECIAL",""]
[null,null,null,"MOBILIARIO ESCOLAR E DE AUDITORIO",""]
[null,null,null,"MOBILIARIO PARA AREA DE INFORMATICA",""]
[null,null,"MOTORES TURBINAS E COMPONENTES","MOTORES A GASOLINA ALCOOL GAS E COMPONENTESEXCETO DE AERONAVES E COMPONENTES","MOTORES_TURBINAS_E_COMPONENTES"]
[null,null,null,"MOTORES DIESEL E COMPONENTES",""]
["SERVICO",null,"OBRAS CIVIS ADAPTACOES REPAROS E MONTAGENS","AQUISICAO DE IMOVEIS NECESSARIOS A REALIZACAO DE OBRAS","OBRAS_CIVIS_ADAPTACOES_REPAROS_E_MONTAGENS"]
[null,null,null,"DESAPROPRIACOES DE IMOVEIS PARA OBRAS E INSTALACOES",""]
[null,null,null,"INSTALACOES INCORPORAVEIS A OBRAS",""]
[null,null,null,"OUTRAS ATIVIDADES NECESSARIAS DE OBRAS E INSTALACOES POR CONTRATO",""]
[null,null,null,"SERVICOS DE DEMOLICOES ADAPTACAO E REPAROS DE BENS IMOVEIS",""]
[null,null,null,"SERVICOS DE EXECUCAO DE OBRAS DIRETAS",""]
[null,null,null,"SERVICOS DE EXECUCAO DE OBRAS POR CONTRATO",""]
[null,null,"PNEUS CAMARAS DE AR E MATERIAIS CORRELATOS","MATERIAIS PARA RECONDICIONAMENTO E ACESSORIOS DE PNEUS  E CAMARAS DE AR","PNEUS_CAMARAS_DE_AR_E_MATERIAIS_CORRELATOS"]
[null,null,null,"PNEUS E CAMARAS DE AR DE AERONAVES",""]
[null,null,null,"PNEUS E CAMARAS DE AR EXCETO DE AERONAVES",""]
[null,null,"RECIPIENTES E MATERIAIS PARA ACONDICIONAMENTO E EMBALAGEM","BOLSAS E SACOS","RECIPIENTES_E_MATERIAIS_PARA_ACONDICIONAMENTO_E_EMBALAGEM"]
[null,null,null,"CAIXAS E ENGRADADOS",""]
[null,null,null,"CILINDROS PARA GASES PECAS E COMPONENTES",""]
[null,null,null,"GARRAFAS E GARRAFOES",""]
[null,null,null,"MATERIAIS DIVERSOS PARA ACONDICIONAMENTO E EMBALAGEM",""]
[null,null,null,"RECIPIENTES PARA MUNICOES E EXPLOSIVOS",""]
[null,null,null,"TAMBORES E LATAS",""]
[null,null,"ROLAMENTOS E MANCAIS","MANCAIS E COMPONENTES","ROLAMENTOS_E_MANCAIS"]
[null,null,null,"ROLAMENTOS E COMPONENTES",""]
["SERVICO",null,"SERVICO DE MANUTENCAO REPAROS E ADAPTACOES EM EQUIPAMENTOSMAQUINAS APARELHOS FERRAMENTAS E INSTRUMENTAL","MANUTECAO E REPAROS EM EQUIPAMENTOS DE PROCESSAMENTO DE DA  DOS","SERVICO_DE_MANUTENCAO_REPAROS_E_ADAPTACOES_EM_EQUIPAMENTOSMAQUINAS_APARELHOS_FERRAMENTAS_E_INSTRUMENTAL"]
[null,null,null,"MANUTENCAO E REPARO DE ESTRUTURA COBERTA DE LONA POLIESTER OU OUTROS MATERIAIS",""]
[null,null,null,"MANUTENCAO E REPARO EM EQUIPAMENTOS FERROVIARIOS",""]
[null,null,null,"MANUTENCAO E REPARO EM EQUIPAMENTOS PARA PURIFICACAO E TRATAMENTO DE AGUA E TRATAMENTO DE ESGOTOS",""]
[null,null,null,"MANUTENCAO E REPARO EM FERRAMENTAS DO GRUPO DE MATERIAL     51 (FERRAMENTAS MANUAIS E COMPONENTES)",""]
[null,null,null,"MANUTENCAO E REPARO EM RECIPIENTES PARA GASES E SISTEMAS CENTRALIZADOS DE GASES",""]
[null,null,null,"MANUTENCAO E REPAROS EM AERONAVES COMPONENTES E ACESSORIOS",""]
[null,null,null,"MANUTENCAO E REPAROS EM APARELHOS EQUIPAMENTOS E UTENSILIOSDE COPA E COZINHA",""]
[null,null,null,"MANUTENCAO E REPAROS EM EQUIPAMENTOS AUDIO-VISUAIS",""]
[null,null,null,"MANUTENCAO E REPAROS EM EQUIPAMENTOS DE AUTOMACAO ARMAZEM DEPOSITO",""]
[null,null,null,"MANUTENCAO E REPAROS EM EQUIPAMENTOS DE COMUNICACAO E TELECOMUNICACAO",""]
[null,null,null,"MANUTENCAO E REPAROS EM EQUIPAMENTOS DE LABORATORIO E EQUIPAMENTOS E INSTRUMENSTOS DE ENSAIO E MEDICAO",""]
[null,null,null,"MANUTENCAO E REPAROS EM EQUIPAMENTOS DE REFRIGERACAO E CONDICIONAMENTO DE AR",""]
[null,null,null,"MANUTENCAO E REPAROS EM EQUIPAMENTOS DE SEGURANCA/PROTECAO  DE EDIFICACOES INDUSTRIAL E PESSOAL",""]
[null,null,null,"MANUTENCAO E REPAROS EM EQUIPAMENTOS DE SOM VIDEO FOTOGRA FICOS CINEMATOGRAFICOS E DE ILUMINACAO",""]
[null,null,null,"MANUTENCAO E REPAROS EM EQUIPAMENTOS E APARELHOS DE TRANSMISSAO/CONTROLE/GERACAO DE ENERGIA",""]
[null,null,null,"MANUTENCAO E REPAROS EM EQUIPAMENTOS E SISTEMAS DE SINALIZA CAO E ALARME",""]
[null,null,null,"MANUTENCAO E REPAROS EM EQUIPAMENTOS E UTENSILIOS DE ESCRITORIO",""]
[null,null,null,"MANUTENCAO E REPAROS EM EQUIPAMENTOS ESPECIALIZADOS PARA MA NUTECAO E REPAROS",""]
[null,null,null,"MANUTENCAO E REPAROS EM EQUIPAMENTOS PARA CONSTRUCAO MINERACAO ESCAVACAO E CONSERVACAO DE ESTRADAS",""]
[null,null,null,"MANUTENCAO E REPAROS EM EQUIPAMENTOS PARA LIMPEZA",""]
[null,null,null,"MANUTENCAO E REPAROS EM INSTALACOES PREDIAIS",""]
[null,null,null,"MANUTENCAO E REPAROS EM MAQUINARIA E EQUIPAMENTOS AGRICOLAS",""]
[null,null,null,"MANUTENCAO E REPAROS EM MAQUINAS E EQUIPAMENTOS P/ INDUSTRI A ESPECIALIZADA",""]
[null,null,null,"MANUTENCAO E REPAROS EM MOBILIARIO EM GERAL",""]
[null,null,null,"MANUTENCAO E REPAROS EM PNEUS E CAMARAS DE AR",""]
[null,null,null,"MANUTENCAO E REPAROS EM SISTEMAS/EQUIPAMENTOS COMERCIAIS INDUSTRIAIS E DE SERVICOS",""]
[null,null,null,"MANUTENCAO E REPAROS EM VIATURAS EQUIPAMENTOS PARA MOVIMEN TACAO DE MATERIAL",""]
[null,null,null,"MANUTENCAO ADAPTACOES E REPAROS EM EQUIPAMENTOS PARA RECRE ACAO ATLETISMO DESPORTO E CIVICO",""]
[null,null,null,"MANUTENCAO REPAROS E ADAPTACOES EM EMBARCACOES COMPONENTES E ACESSORIOS",""]
[null,null,null,"MANUTENCAO REPAROS E ADAPTACOES EM EQUIPAMENTOS INSTRUMEN TOS MEDICOS ODONTOLOGICOS E HOSPITALARES",""]
[null,null,null,"MANUTENCAO REPAROS E ADAPTACOES EM VEICULOS AUTOMOTORES",""]
[null,null,null,"MANUTENCAO REPAROS E E ADAPTACOES EM ARMAMENTOS",""]
[null,null,null,"RECUPERACAO E RECONDICIONAMENTO DE PECAS DE VEICULOS        AUTOMOTORES",""]
[null,null,null,"SERVICOS DE RECUPERACAO E RECONDICIONAMENTO DE PECAS DE     EQUIPAMENTOS PARA INFORMATICA",""]
[null,null,null,"SERVICOS DE RECUPERACAO E RECONDICIONAMENTO DE PECAS PARA   EQUIPAMENTOS DE INDUSTRIA GRAFICA",""]
["SERVICO",null,"SERVICOS DE ESTUDOS E PROJETOS","SERVICOS TECNICOS ESTUDOS E PROJETOS","SERVICOS_DE_ESTUDOS_E_PROJETOS"]
["SERVICO",null,"SERVICOS DE INSTALACOES E MONTAGENS","SERVICOS DE ADMINISTRACAO DE EDIFICACOES","SERVICOS_DE_INSTALACOES_E_MONTAGENS"]
[null,null,null,"SERVICOS DE INSTALACAO E MONTAGEM  DE  EQUIPAMENTOS  ACESSORIOS COMPONENTES E BENS DE SERVICOS",""]
["SERVICO",null,"SERVICOS DE TECNOLOGIA DA INFORMACAO E COMUNICACAO TIC","ARMAZEM DE INFORMACAO","SERVICOS_DE_TECNOLOGIA_DA_INFORMACAO_E_COMUNICACAO_TIC"]
[null,null,null,"BUSINESS INTELLIGENCE",""]
[null,null,null,"CERTIFICACAO DIGITAL",""]
[null,null,null,"DATACENTER",""]
[null,null,null,"DESENVOLVIMENTO DE SOLUCAO DE EDUCACAO A DISTANCIA",""]
[null,null,null,"GESTAO DE CONTEUDO",""]
[null,null,null,"SERVICOS DE INFRAESTRUTURA",""]
[null,null,null,"SERVICOS DE REDE",""]
[null,null,null,"SISTEMAS DE INFORMACAO",""]
[null,null,null,"SOLUCOES CORPORATIVAS",""]
["SERVICO",null,"SERVICOS TECNICOS ESPECIALIZADOS NA AREA DE CONSTRUCAO CIVIL","ESTUDOS E PROJETOS PARA OBRAS E INSTALACOES","SERVICOS_TECNICOS_ESPECIALIZADOS_NA_AREA_DE_CONSTRUCAO_CIVIL"]
[null,null,"SUBSTANCIAS E PRODUTOS QUIMICOS","COMPOSTOS QUIMICOS PRODUTOS QUIMICOS E REAGENTES PARA INDUSTRIA FARMACEUTICA","SUBSTANCIAS_E_PRODUTOS_QUIMICOS"]
[null,null,null,"DESINFETANTES E AGENTES PARA COMBATE A PRAGAS",""]
[null,null,null,"ESPECIALIDADES QUIMICAS",""]
[null,null,null,"GASES: COMPRIMIDOS E LIQUIFEITOS",""]
[null,null,null,"REAGENTES QUIMICOS",""]
[null,null,null,"REAGENTES QUIMICOS CORANTES E INDICADORES",""]
[null,null,"TECIDOS COUROS MATERIAIS CORRELATOS E MIUDEZAS AVIAMENTOS PARA COSTURA EM GERAL","ARTIGOS PARA CALCADOS","TECIDOS_COUROS_MATERIAIS_CORRELATOS_E_MIUDEZAS_AVIAMENTOS_PARA_COSTURA_EM_GERAL"]
[null,null,null,"BANDEIRAS E GALHARDETES",""]
[null,null,null,"BARRACAS E ENCERADOS",""]
[null,null,null,"COUROS",""]
[null,null,null,"FIOS E LINHAS PARA COSTURA",""]
[null,null,null,"MATERIAL PARA ESTOFAMENTO E ACOLCHOAMENTO",""]
[null,null,null,"MIUDEZAS E AVIAMENTOS DE COSTURA",""]
[null,null,null,"TECIDOS",""]
[null,null,"TINTAS EQUIPAMENTOS PARA PINTURA SECANTES E ADESIVOS","ADESIVOS","TINTAS_EQUIPAMENTOS_PARA_PINTURA_SECANTES_E_ADESIVOS"]
[null,null,null,"COMPOSTOS PRESERVATIVOS E SELANTES",""]
[null,null,null,"EQUIPAMENTOS E UTENSILIOS PARA PINTURA",""]
[null,null,null,"TINTAS VERNIZES E PRODUTOS CORRELATOS",""]
["SERVICO",null,"TRANSPORTE","FORNECIMENTO DE COMBUSTIVEL E LUBRIFICANTE","TRANSPORTE"]
[null,null,null,"OUTROS SERVICOS COM TRANSPORTE/DESLOCAMENTOS",""]
[null,null,null,"SERVICO DE FORNECIMENTO DE PASSAGEM",""]
[null,null,null,"SERVICO TRANSPORTE E ACONDICIONAMENTO DE MATERIAIS E ANIMAIS",""]
[null,null,null,"SERVICOS DE TRANSPORTES DE DOCUMENTOS DE BENS E DE VALORES",""]
[null,null,"TRATORES","ACESSORIOS E COMPONENTES PARA TRATOR DE RODA","TRATORES"]
[null,null,null,"TRATORES DE RODA",""]
[null,null,"TUBOS TUBULACOES MANGUEIRAS E CONEXOES","CONEXOES E ACESSORIOS PARA TUBOS E MANGUEIRAS","TUBOS_TUBULACOES_MANGUEIRAS_E_CONEXOES"]
[null,null,null,"MANGUEIRAS E TUBULACOES FLEXIVEIS",""]
[null,null,null,"TUBO RIGIDO",""]
[null,null,"VALVULAS E REGISTROS","COMPONENTES E PECAS PARA VALVULAS E REGISTROS","VALVULAS_E_REGISTROS"]
[null,null,null,"VALVULAS E REGISTROS",""]
[null,null,null,"VALVULAS MOTORIZADAS",""]
[null,null,"VEICULOS PARA TRANSPORTE RODOVIARIO DE PASSAGEIROS E  DE CARGA","OUTROS VEICULOS DE 0203 OU 04 RODAS COMPONENTES E PECAS","VEICULOS_PARA_TRANSPORTE_RODOVIARIO_DE_PASSAGEIROS_E__DE_CARGA"]
[null,null,null,"REBOQUES",""]
[null,null,null,"VEICULOS ESPECIAIS",""]
[null,null,null,"VEICULOS MOTORIZADOS DE SERVICO PARA TRANSPORTE DE CARGA",""]
[null,null,null,"VEICULOS MOTORIZADOS DE SERVICO PARA TRANSPORTE DE PASSAGEIROS",""]
[null,null,null,"VEICULOS MOTORIZADOS PARA TRANSPORTE DE CARGA",""]
[null,null,null,"VEICULOS MOTORIZADOS PARA TRANSPORTE DE PASSAGEIRO",""]
[null,null,null,"VIATURAS",""]
[null,null,"VESTUARIOS E EQUIPAMENTOS INDIVIDUAIS DE USO COMUM E  ESPECIAL","ARTIGOS E ACESSORIOS PARA CRIANCA E ADOLESCENTE","VESTUARIOS_E_EQUIPAMENTOS_INDIVIDUAIS_DE_USO_COMUM_E__ESPECIAL"]
[null,null,null,"CALCADOS PARA HOMEM",""]
[null,null,null,"CALCADOS PARA MULHER",""]
[null,null,null,"DISTINTIVOS E INSIGNIAS",""]
[null,null,null,"EQUIPAMENTOS INDIVIDUAIS DE USOS DIVERSOS",""]
[null,null,null,"FARDAMENTO BOMBEIRO MILITAR",""]
[null,null,null,"FARDAMENTO POLICIAL",""]
[null,null,null,"MALARIA",""]
[null,null,null,"MEIAS LUVAS E COMPLEMENTOS DE VESTUARIO PARA HOMEM",""]
[null,null,null,"MEIAS LUVAS E COMPLEMENTOS DE VESTUARIO PARA MULHER",""]
[null,null,null,"ROUPAS DE BAIXO E DE DORMIR PARA HOMEM",""]
[null,null,null,"ROUPAS DE BAIXO E DE DORMIR PARA MULHER",""]
[null,null,null,"VESTUARIO ESPECIAL",""]
[null,null,null,"VESTUARIOS EXTERIORES PARA HOMEM",""]
[null,null,null,"VESTUARIOS EXTERIORES PARA MULHER",""]
[null,null,null,"VESTUARIOS UNISSEX",""]
[null,null,"VIATURAS EQUIPAMENTOS PARA MOVIMENTACAO DE MATERIAL","BLOCOS MOITOES ARTICULACOES E ESTROPOSPECAS E COMPONENTES","VIATURAS_EQUIPAMENTOS_PARA_MOVIMENTACAO_DE_MATERIAL"]
[null,null,null,"COMPONENTES E ACESSORIOS DE  ELEVADORES P/ CONTRATOS DE MANUTENCAO PREVENTIVA/CORRETIVA",""]
[null,null,null,"ELEVADORES E ESCADAS ROLANTES PECAS E COMPONENTES",""]
[null,null,null,"EQUIPAMENTOS E ARTIGOS DIVERSOS PARA MOVIMENTACAO DE MATERIAIS PECAS E COMPONENTES",""]
[null,null,null,"GUINCHOS TALHAS GUINDASTES E CABREAS PECAS E COMPONENTES",""]
[null,null,null,"TRANSPORTADORES PECAS E COMPONENTES",""]
[null,null,null,"VIATURAS P/MOVIMENTACAO DE MATERIAIS NAO MOTORIZADAS PECASE COMPONENTES",""]
[null,null,null,"VIATURAS PARA  MOVIMENTACAO DE MATERIAIS MOTORIZADAS PECAS E COMPONENTES",""]

{"sheet":"Orientações de preenchimento","index":6,"n_rows":1,"n_cols":1,"rows_kept":1,"cut":false,"hidden":false,"merged":[[0,0,0,15]]}
["Orientações de Preenchimento\nPara o preenchimento deste documento, deverão ser observados os seguintes aspectos:\n1-Esta planilha é protegida por uma senha, ou seja, só é possível preencher as células liberadas. As células que não são passíveis de edição contêm fórmulas para o melhor preenchimento dos valores. Assim sento, solicitamos que não se tente desbloquear este documento. Caso haja necessidade de alterar algum conteúdo, favor entrar em contato com a Segov, por meio do e-mail atendimento@sigconsaida.mg.gov.br e que será providenciada a correção, se for o caso.\n2 - Os itens de materiais são numerados precedidos da letra \"M\" (\"M1\", \"M2\", \"M3\", etc..) e os itens de serviços são numerados precedidos da letra \"S\" (\"S1\", \"S2\", \"S3\", etc..).\n3 - Observe que na planilha só aparece espaço para inserção de 10 itens de materiais e/ou 10 itens de serviços. Mas a planilha permite a inserção de 1000 itens de materiais e/ou 1000 itens de serviços. Para que essas linhas tornem a estar disponíveis, é necessário \"reexibir\" as linhas entre a linha 15 e 1006 (no caso de materiais) e da linha 1017 à 2008 (no caso de serviços). Após reexibir, preencha com os itens, um por linha. Caso sobrem linhas em branco tanto no preenchimento dos materiais quando no preenchimento dos serviços, é necessário que essas linhas em branco sejam ocultadas novamente antes de imprimir o documento. Isso é importante para não gerar uma impressão com várias páginas sem necessidade.\n4 - A ferramenta de \"ocultar linhas\" também deve ser usada quando o objeto do convênio contemplar APENAS materiais ou APENAS serviços. No primeiro caso, tratando-se apenas da aquisição de materiais, as linhas destinadas à descrição dos serviços (linhas 1007 a 2008) devem ser ocultadas ou excluídas. No caso de a execução do objeto se restringir à contratação de serviços, as linhas destinadas à descrição dos materiais (linhas 5 a 1006) devem ser ocultadas ou excluídas. \n5 - Nas colunas \"Grupo de Material ou Serviço\" e \"Classe de Material ou Serviço\" você perceberá que abrirá uma lista de preenchimento pre-definida. A lista de \"Classe de Material ou Serviço\" será uma para cada cada \"Grupo de Material ou Serviço\". Não é possível inserir grupo ou classe de materiais ou serviços diferente do disponível. Caso haja necessidade de acrescentar algum conteúdo distinto nessas colunas, favor entrar em contato com a Segov, por meio do e-mail atendimento@sigconsaida.mg.gov.br e que será providenciada a inclusão. A base de dados utilizada para definir os grupos e classes de materiais ou serviços é o Catálogo de Materiais e Serviços do Governo do Estado de Minas Gerais - CATMAS, uma vez que, no futuro, há a intensão de que ambos os sistemas sejam vinculados.\n6 - Ao contrário das colunas \"Grupo de Material ou Serviço\" e \"Classe de Material ou Serviço\", a coluna \"Descrição do item\" é de livre digitação e deve conter a descrição do item, a mais completa possível.\n7 - As colunas destinadas aos orçamentos coletados deverão ser preenchidas e o preço unitário médio é calculado automaticamente. Caso a despesa seja mensal, os orçamentos devem ser coletados a partir desta referência.\n8 - Se a aquisição ou contratação for recorrente, gerando pagamentos mensais de mesmo valor, deverá ser selecionada a opção \"sim\" na coluna \"Despesa mensal?\" e preenchidas SOMENTE AS COLUNAS \"Valor Mensal adotado para celebração\" e \"Número de meses de execução\". As colunas \"Preço unitário adotado para Celebração\" e \"Quantidade Total de itens\" não devem ser preenchidas se a despesa for mensal. A Coluna \"Valor Mensal adotado para celebração\" deverá conter o valor adotado para celebração, que deverá estar entre o menor orçamento apresentado e o valor médio.\n9 - Se a aquisição ou contratação não tiver periodicidade mensal, por sua natureza, deverá ser selecionada a opção \"não\" na coluna \"Despesa mensal?\" e preenchidas SOMENTE AS COLUNAS \"Preço unitário adotado para Celebração\" e \"Quantidade Total de itens\" . As colunas \"Valor Mensal adotado para celebração\" e \"Número de meses de execução\" não devem ser preenchidas se a despesa não for mensal. A coluna \"Preço unitário adotado para Celebração\" deverá conter o valor adotado para celebração, que deverá estar entre o menor orçamento apresentado e o valor médio. \n10 - A última coluna é destinada às Observações. Pode-se inserir qualquer informação complementar, como por exemplo, que fora utilizado outro valor de referência para adotar o valor de celebração, justificando-se a ausência dos 3 orçamentos.\n"]

{"sheet":"Planilha","index":7,"n_rows":3000,"n_cols":26,"rows_kept":3000,"cut":false,"hidden":false,"merged":[[4,0,4,14],[5,2,6,2],[5,3,6,3],[0,0,2,14],[3,0,3,14],[2013,0,2014,14],[5,14,6,14],[5,4,5,6],[5,7,6,7],[5,8,6,8],[5,9,6,9],[5,10,6,10],[5,11,6,11],[5,12,6,12],[5,13,6,13],[5,0,6,0],[5,1,6,1]]}
["LOGOMARCA/TIMBRE DA OSC"]
[]
[]
["PLANILHA DETALHADA DE ITENS E CUSTOS DOS BENS"]
["DETALHAMENTO DE ITENS E CUSTOS DE MATERIAIS E SERVIÇOS"]
["#","GRUPO DE MATERIAL OU SERVIÇO","CLASSE DE MATERIAL OU SERVIÇO ","Descrição do item","Orçamentos - Preço Unitário/Mensal",null,null,"Preço Unitário/ Mensal médio","Despesa Mensal?","Preço unitário adotado para Celebração","Quantidade Total de itens","Valor Mensal adotado para celebração","Número de meses de execução","Valor total","Observações",null,null,null,null,null,null,null,null,null,null,{"$f":"SUBSTITUTE(D7,\" \",\"_\")","v":""}]
[null,null,null,null,"1º orçamento","2º orçamento","3º orçamento",null,null,null,null,null,null,null,null,null,null,null,null,null,null,null,null,null,null,{"$f":"SUBSTITUTE(D8,\" \",\"_\")","v":""}]
["MATERIAIS",null,null,null,null,null,null,null,null,null,null,null,null,null,null,null,null,null,null,null,null,null,null,null,null,{"$f":"SUBSTITUTE(B9,\" \",\"_\")","v":""}]
["M1",null,null,null,null,null,null,{"$f":"(E9+F9+G9)/3","v":0},null,null,null,null,null,{"$f":"IF(I9=\"Sim\",L9*M9,K9*J9)","v":0},null,null,null,null,null,null,null,null,null,null,null,""]
["M2",null,null,null,null,null,null,{"$f":"(E10+F10+G10)/3","v":0},null,null,null,null,null,0,null,null,null,null,null,null,null,null,null,null,null,""]
["M3",null,null,null,null,null,null,0,null,null,null,null,null,0,null,null,null,null,null,null,null,null,null,null,null,""]
["M4",null,null,null,null,null,null,0,null,null,null,null,null,0,null,null,null,null,null,null,null,null,null,null,null,""]
["M5",null,null,null,null,null,null,0,null,null,null,null,null,0,null,null,null,null,null,null,null,null,null,null,null,""]
["M6",null,null,null,null,null,null,0,null,null,null,null,null,0,null,null,null,null,null,null,null,null,null,null,null,""]
["M7",null,null,null,null,null,null,0,null,null,null,null,null,0,null,null,null,null,null,null,null,null,null,null,null,""]
["M8",null,null,null,null,null,null,0,null,null,null,null,null,0,null,null,null,null,null,null,null,null,null,null,null,""]
["M9",null,null,null,null,null,null,0,null,null,null,null,null,0,null,null,null,null,null,null,null,null,null,null,null,""]
["M10",null,null,null,null,null,null,0,null,null,null,null,null,0,null,null,null,null,null,null,null,null,null,null,null,""]
["M11",null,null,null,null,null,null,0,null,null,null,null,null,0,null,null,null,null,null,null,null,null,null,null,null,""]
["M12",null,null,null,null,null,null,0,null,null,null,null,null,0,null,null,null,null,null,null,null,null,null,null,null,""]
["M13",null,null,null,null,null,null,0,null,null,null,null,null,0,null,null,null,null,null,null,null,null,null,null,null,""]
["M14",null,null,null,null,null,null,0,null,null,null,null,null,0,null,null,null,null,null,null,null,null,null,null,null,""]
["M15",null,null,null,null,null,null,0,null,null,null,null,null,0,null,null,null,null,null,null,null,null,null,null,null,""]
["M16",null,null,null,null,null,null,0,null,null,null,null,null,0,null,null,null,null,null,null,null,null,null,null,null,""]
["M17",null,null,null,null,null,null,0,null,null,null,null,null,0,null,null,null,null,null,null,null,null,null,null,null,""]
["M18",null,null,null,null,null,null,0,null,null,null,null,null,0,null,null,null,null,null,null,null,null,null,null,null,""]
["M19",null,null,null,null,null,null,0,null,null,null,null,null,0,null,null,null,null,null,null,null,null,null,null,null,""]
["M20",null,null,null,null,null,null,0,null,null,null,null,null,0,null,null,null,null,null,null,null,null,null,null,null,""]
["M21",null,null,null,null,null,null,0,null,null,null,null,null,0,null,null,null,null,null,null,null,null,null,null,null,""]
["M22",null,null,null,null,null,null,0,null,null,null,null,null,0,null,null,null,null,null,null,null,null,null,null,null,""]
["M23",null,null,null,null,null,null,0,null,null,null,null,null,0,null,null,null,null,null,null,null,null,null,null,null,""]
["M24",null,null,null,null,null,null,0,null,null,null,null,null,0,null,null,null,null,null,null,null,null,null,null,null,""]
["M25",null,null,null,null,null,null,0,null,null,null,null,null,0,null,null,null,null,null,null,null,null,null,null,null,""]
["M26",null,null,null,null,null,null,0,null,null,null,null,null,0,null,null,null,null,null,null,null,null,null,null,null,""]
["M27",null,null,null,null,null,null,0,null,null,null,null,null,0,null,null,null,null,null,null,null,null,null,null,null,""]
["M28",null,null,null,null,null,null,0,null,null,null,null,null,0,null,null,null,null,null,null,null,null,null,null,null,""]
["M29",null,null,null,null,null,null,0,null,null,null,null,null,0,null,null,null,null,null,null,null,null,null,null,null,""]
["M30",null,null,null,null,null,null,0,null,null,null,null,null,0,null,null,null,null,null,null,null,null,null,null,null,""]
["M31",null,null,null,null,null,null,0,null,null,null,null,null,0,null,null,null,null,null,null,null,null,null,null,null,""]
["M32",null,null,null,null,null,null,0,null,null,null,null,null,0,null,null,null,null,null,null,null,null,null,null,null,""]
["M33",null,null,null,null,null,null,0,null,null,null,null,null,0,null,null,null,null,null,null,null,null,null,null,null,""]
["M34",null,null,null,null,null,null,0,null,null,null,null,null,0,null,null,null,null,null,null,null,null,null,null,null,""]
["M35",null,null,null,null,null,null,0,null,null,null,null,null,0,null,null,null,null,null,null,null,null,null,null,null,""]
["M36",null,null,null,null,null,null,0,null,null,null,null,null,0,null,null,null,null,null,null,null,null,null,null,null,""]
["M37",null,null,null,null,null,null,0,null,null,null,null,null,0,null,null,null,null,null,null,null,null,null,null,null,""]
["M38",null,null,null,null,null,null,0,null,null,null,null,null,0,null,null,null,null,null,null,null,null,null,null,null,""]
["M39",null,null,null,null,null,null,0,null,null,null,null,null,0,null,null,null,null,null,null,null,null,null,null,null,""]
["M40",null,null,null,null,null,null,0,null,null,null,null,null,0,null,null,null,null,null,null,null,null,null,null,null,""]
["M41",null,null,null,null,null,null,0,null,null,null,null,null,0,null,null,null,null,null,null,null,null,null,null,null,""]
["M42",null,null,null,null,null,null,0,null,null,null,null,null,0,null,null,null,null,null,null,null,null,null,null,null,""]
["M43",null,null,null,null,null,null,0,null,null,null,null,null,0,null,null,null,null,null,null,null,null,null,null,null,""]
["M44",null,null,null,null,null,null,0,null,null,null,null,null,0,null,null,null,null,null,null,null,null,null,null,null,""]
["M45",null,null,null,null,null,null,0,null,null,null,null,null,0,null,null,null,null,null,null,null,null,null,null,null,""]
["M46",null,null,null,null,null,null,0,null,null,null,null,null,0,null,null,null,null,null,null,null,null,null,null,null,""]
["M47",null,null,null,null,null,null,0,null,null,null,null,null,0,null,null,null,null,null,null,null,null,null,null,null,""]
["M48",null,null,null,null,null,null,0,null,null,null,null,null,0,null,null,null,null,null,null,null,null,null,null,null,""]
["M49",null,null,null,null,null,null,0,null,null,null,null,null,0,null,null,null,null,null,null,null,null,null,null,null,""]
["M50",null,null,null,null,null,null,0,null,null,null,null,null,0,null,null,null,null,null,null,null,null,null,null,null,""]
["M51",null,null,null,null,null,null,0,null,null,null,null,null,0,null,null,null,null,null,null,null,null,null,null,null,""]
["M52",null,null,null,null,null,null,0,null,null,null,null,null,0,null,null,null,null,null,null,null,null,null,null,null,""]
["M53",null,null,null,null,null,null,0,null,null,null,null,null,0,null,null,null,null,null,null,null,null,null,null,null,""]
["M54",null,null,null,null,null,null,0,null,null,null,null,null,0,null,null,null,null,null,null,null,null,null,null,null,""]
["M55",null,null,null,null,null,null,0,null,null,null,null,null,0,null,null,null,null,null,null,null,null,null,null,null,""]
["M56",null,null,null,null,null,null,0,null,null,null,null,null,0,null,null,null,null,null,null,null,null,null,null,null,""]
["M57",null,null,null,null,null,null,0,null,null,null,null,null,0,null,null,null,null,null,null,null,null,null,null,null,""]
["M58",null,null,null,null,null,null,0,null,null,null,null,null,0,null,null,null,null,null,null,null,null,null,null,null,""]
["M59",null,null,null,null,null,null,0,null,null,null,null,null,0,null,null,null,null,null,null,null,null,null,null,null,""]
["M60",null,null,null,null,null,null,0,null,null,null,null,null,0,null,null,null,null,null,null,null,null,null,null,null,""]
["M61",null,null,null,null,null,null,0,null,null,null,null,null,0,null,null,null,null,null,null,null,null,null,null,null,""]
["M62",null,null,null,null,null,null,0,null,null,null,null,null,0,null,null,null,null,null,null,null,null,null,null,null,""]
["M63",null,null,null,null,null,null,0,null,null,null,null,null,0,null,null,null,null,null,null,null,null,null,null,null,""]
["M64",null,null,null,null,null,null,0,null,null,null,null,null,0,null,null,null,null,null,null,null,null,null,null,null,{"$f":"SUBSTITUTE(B73,\" \",\"_\")","v":""}]
["M65",null,null,null,null,null,null,0,null,null,null,null,null,{"$f":"IF(I73=\"Sim\",L73*M73,K73*J73)","v":0},null,null,null,null,null,null,null,null,null,null,null,""]
["M66",null,null,null,null,null,null,{"$f":"(E74+F74+G74)/3","v":0},null,null,null,null,null,0,null,null,null,null,null,null,null,null,null,null,null,""]
["M67",null,null,null,null,null,null,0,null,null,null,null,null,0,null,null,null,null,null,null,null,null,null,null,null,""]
["M68",null,null,null,null,null,null,0,null,null,null,null,null,0,null,null,null,null,null,null,null,null,null,null,null,""]
["M69",null,null,null,null,null,null,0,null,null,null,null,null,0,null,null,null,null,null,null,null,null,null,null,null,""]
["M70",null,null,null,null,null,null,0,null,null,null,null,null,0,null,null,null,null,null,null,null,null,null,null,null,""]
["M71",null,null,null,null,null,null,0,null,null,null,null,null,0,null,null,null,null,null,null,null,null,null,null,null,""]
["M72",null,null,null,null,null,null,0,null,null,null,null,null,0,null,null,null,null,null,null,null,null,null,null,null,""]
["M73",null,null,null,null,null,null,0,null,null,null,null,null,0,null,null,null,null,null,null,null,null,null,null,null,""]
["M74",null,null,null,null,null,null,0,null,null,null,null,null,0,null,null,null,null,null,null,null,null,null,null,null,""]
["M75",null,null,null,null,null,null,0,null,null,null,null,null,0,null,null,null,null,null,null,null,null,null,null,null,""]
["M76",null,null,null,null,null,null,0,null,null,null,null,null,0,null,null,null,null,null,null,null,null,null,null,null,""]
["M77",null,null,null,null,null,null,0,null,null,null,null,null,0,null,null,null,null,null,null,null,null,null,null,null,""]
["M78",null,null,null,null,null,null,0,null,null,null,null,null,0,null,null,null,null,null,null,null,null,null,null,null,""]
["M79",null,null,null,null,null,null,0,null,null,null,null,null,0,null,null,null,null,null,null,null,null,null,null,null,""]
["M80",null,null,null,null,null,null,0,null,null,null,null,null,0,null,null,null,null,null,null,null,null,null,null,null,""]
["M81",null,null,null,null,null,null,0,null,null,null,null,null,0,null,null,null,null,null,null,null,null,null,null,null,""]
["M82",null,null,null,null,null,null,0,null,null,null,null,null,0,null,null,null,null,null,null,null,null,null,null,null,""]
["M83",null,null,null,null,null,null,0,null,null,null,null,null,0,null,null,null,null,null,null,null,null,null,null,null,""]
["M84",null,null,null,null,null,null,0,null,null,null,null,null,0,null,null,null,null,null,null,null,null,null,null,null,""]
["M85",null,null,null,null,null,null,0,null,null,null,null,null,0,null,null,null,null,null,null,null,null,null,null,null,""]
["M86",null,null,null,null,null,null,0,null,null,null,null,null,0,null,null,null,null,null,null,null,null,null,null,null,""]
["M87",null,null,null,null,null,null,0,null,null,null,null,null,0,null,null,null,null,null,null,null,null,null,null,null,""]
["M88",null,null,null,null,null,null,0,null,null,null,null,null,0,null,null,null,null,null,null,null,null,null,null,null,""]
["M89",null,null,null,null,null,null,0,null,null,null,null,null,0,null,null,null,null,null,null,null,null,null,null,null,""]
["M90",null,null,null,null,null,null,0,null,null,null,null,null,0,null,null,null,null,null,null,null,null,null,null,null,""]
["M91",null,null,null,null,null,null,0,null,null,null,null,null,0,null,null,null,null,null,null,null,null,null,null,null,""]
["M92",null,null,null,null,null,null,0,null,null,null,null,null,0,null,null,null,null,null,null,null,null,null,null,null,""]
["M93",null,null,null,null,null,null,0,null,null,null,null,null,0,null,null,null,null,null,null,null,null,null,null,null,""]
["M94",null,null,null,null,null,null,0,null,null,null,null,null,0,null,null,null,null,null,null,null,null,null,null,null,""]
["M95",null,null,null,null,null,null,0,null,null,null,null,null,0,null,null,null,null,null,null,null,null,null,null,null,""]
["M96",null,null,null,null,null,null,0,null,null,null,null,null,0,null,null,null,null,null,null,null,null,null,null,null,""]
["M97",null,null,null,null,null,null,0,null,null,null,null,null,0,null,null,null,null,null,null,null,null,null,null,null,""]
["M98",null,null,null,null,null,null,0,null,null,null,null,null,0,null,null,null,null,null,null,null,null,null,null,null,""]
["M99",null,null,null,null,null,null,0,null,null,null,null,null,0,null,null,null,null,null,null,null,null,null,null,null,""]
["M100",null,null,null,null,null,null,0,null,null,null,null,null,0,null,null,null,null,null,null,null,null,null,null,null,""]
["M101",null,null,null,null,null,null,0,null,null,null,null,null,0,null,null,null,null,null,null,null,null,null,null,null,""]
["M102",null,null,null,null,null,null,0,null,null,null,null,null,0,null,null,null,null,null,null,null,null,null,null,null,""]
["M103",null,null,null,null,null,null,0,null,null,null,null,null,0,null,null,null,null,null,null,null,null,null,null,null,""]
["M104",null,null,null,null,null,null,0,null,null,null,null,null,0,null,null,null,null,null,null,null,null,null,null,null,""]
["M105",null,null,null,null,null,null,0,null,null,null,null,null,0,null,null,null,null,null,null,null,null,null,null,null,""]
["M106",null,null,null,null,null,null,0,null,null,null,null,null,0,null,null,null,null,null,null,null,null,null,null,null,""]
["M107",null,null,null,null,null,null,0,null,null,null,null,null,0,null,null,null,null,null,null,null,null,null,null,null,""]
["M108",null,null,null,null,null,null,0,null,null,null,null,null,0,null,null,null,null,null,null,null,null,null,null,null,""]
["M109",null,null,null,null,null,null,0,null,null,null,null,null,0,null,null,null,null,null,null,null,null,null,null,null,""]
["M110",null,null,null,null,null,null,0,null,null,null,null,null,0,null,null,null,null,null,null,null,null,null,null,null,""]
["M111",null,null,null,null,null,null,0,null,null,null,null,null,0,null,null,null,null,null,null,null,null,null,null,null,""]
["M112",null,null,null,null,null,null,0,null,null,null,null,null,0,null,null,null,null,null,null,null,null,null,null,null,""]
["M113",null,null,null,null,null,null,0,null,null,null,null,null,0,null,null,null,null,null,null,null,null,null,null,null,""]
["M114",null,null,null,null,null,null,0,null,null,null,null,null,0,null,null,null,null,null,null,null,null,null,null,null,""]
["M115",null,null,null,null,null,null,0,null,null,null,null,null,0,null,null,null,null,null,null,null,null,null,null,null,""]
["M116",null,null,null,null,null,null,0,null,null,null,null,null,0,null,null,null,null,null,null,null,null,null,null,null,""]
["M117",null,null,null,null,null,null,0,null,null,null,null,null,0,null,null,null,null,null,null,null,null,null,null,null,""]
["M118",null,null,null,null,null,null,0,null,null,null,null,null,0,null,null,null,null,null,null,null,null,null,null,null,""]
["M119",null,null,null,null,null,null,0,null,null,null,null,null,0,null,null,null,null,null,null,null,null,null,null,null,""]
["M120",null,null,null,null,null,null,0,null,null,null,null,null,0,null,null,null,null,null,null,null,null,null,null,null,""]
["M121",null,null,null,null,null,null,0,null,null,null,null,null,0,null,null,null,null,null,null,null,null,null,null,null,""]
["M122",null,null,null,null,null,null,0,null,null,null,null,null,0,null,null,null,null,null,null,null,null,null,null,null,""]
["M123",null,null,null,null,null,null,0,null,null,null,null,null,0,null,null,null,null,null,null,null,null,null,null,null,""]
["M124",null,null,null,null,null,null,0,null,null,null,null,null,0,null,null,null,null,null,null,null,null,null,null,null,""]
["M125",null,null,null,null,null,null,0,null,null,null,null,null,0,null,null,null,null,null,null,null,null,null,null,null,""]
["M126",null,null,null,null,null,null,0,null,null,null,null,null,0,null,null,null,null,null,null,null,null,null,null,null,""]
["M127",null,null,null,null,null,null,0,null,null,null,null,null,0,null,null,null,null,null,null,null,null,null,null,null,""]
["M128",null,null,null,null,null,null,0,null,null,null,null,null,0,null,null,null,null,null,null,null,null,null,null,null,{"$f":"SUBSTITUTE(B137,\" \",\"_\")","v":""}]
["M129",null,null,null,null,null,null,0,null,null,null,null,null,{"$f":"IF(I137=\"Sim\",L137*M137,K137*J137)","v":0},null,null,null,null,null,null,null,null,null,null,null,""]
["M130",null,null,null,null,null,null,{"$f":"(E138+F138+G138)/3","v":0},null,null,null,null,null,0,null,null,null,null,null,null,null,null,null,null,null,""]
["M131",null,null,null,null,null,null,0,null,null,null,null,null,0,null,null,null,null,null,null,null,null,null,null,null,""]
["M132",null,null,null,null,null,null,0,null,null,null,null,null,0,null,null,null,null,null,null,null,null,null,null,null,""]
["M133",null,null,null,null,null,null,0,null,null,null,null,null,0,null,null,null,null,null,null,null,null,null,null,null,""]
["M134",null,null,null,null,null,null,0,null,null,null,null,null,0,null,null,null,null,null,null,null,null,null,null,null,""]
["M135",null,null,null,null,null,null,0,null,null,null,null,null,0,null,null,null,null,null,null,null,null,null,null,null,""]
["M136",null,null,null,null,null,null,0,null,null,null,null,null,0,null,null,null,null,null,null,null,null,null,null,null,""]
["M137",null,null,null,null,null,null,0,null,null,null,null,null,0,null,null,null,null,null,null,null,null,null,null,null,""]
["M138",null,null,null,null,null,null,0,null,null,null,null,null,0,null,null,null,null,null,null,null,null,null,null,null,""]
["M139",null,null,null,null,null,null,0,null,null,null,null,null,0,null,null,null,null,null,null,null,null,null,null,null,""]
["M140",null,null,null,null,null,null,0,null,null,null,null,null,0,null,null,null,null,null,null,null,null,null,null,null,""]
["M141",null,null,null,null,null,null,0,null,null,null,null,null,0,null,null,null,null,null,null,null,null,null,null,null,""]
["M142",null,null,null,null,null,null,0,null,null,null,null,null,0,null,null,null,null,null,null,null,null,null,null,null,""]
["M143",null,null,null,null,null,null,0,null,null,null,null,null,0,null,null,null,null,null,null,null,null,null,null,null,""]
["M144",null,null,null,null,null,null,0,null,null,null,null,null,0,null,null,null,null,null,null,null,null,null,null,null,""]
["M145",null,null,null,null,null,null,0,null,null,null,null,null,0,null,null,null,null,null,null,null,null,null,null,null,""]
["M146",null,null,null,null,null,null,0,null,null,null,null,null,0,null,null,null,null,null,null,null,null,null,null,null,""]
["M147",null,null,null,null,null,null,0,null,null,null,null,null,0,null,null,null,null,null,null,null,null,null,null,null,""]
["M148",null,null,null,null,null,null,0,null,null,null,null,null,0,null,null,null,null,null,null,null,null,null,null,null,""]
["M149",null,null,null,null,null,null,0,null,null,null,null,null,0,null,null,null,null,null,null,null,null,null,null,null,""]
["M150",null,null,null,null,null,null,0,null,null,null,null,null,0,null,null,null,null,null,null,null,null,null,null,null,""]
["M151",null,null,null,null,null,null,0,null,null,null,null,null,0,null,null,null,null,null,null,null,null,null,null,null,""]
["M152",null,null,null,null,null,null,0,null,null,null,null,null,0,null,null,null,null,null,null,null,null,null,null,null,""]
["M153",null,null,null,null,null,null,0,null,null,null,null,null,0,null,null,null,null,null,null,null,null,null,null,null,""]
["M154",null,null,null,null,null,null,0,null,null,null,null,null,0,null,null,null,null,null,null,null,null,null,null,null,""]
["M155",null,null,null,null,null,null,0,null,null,null,null,null,0,null,null,null,null,null,null,null,null,null,null,null,""]
["M156",null,null,null,null,null,null,0,null,null,null,null,null,0,null,null,null,null,null,null,null,null,null,null,null,""]
["M157",null,null,null,null,null,null,0,null,null,null,null,null,0,null,null,null,null,null,null,null,null,null,null,null,""]
["M158",null,null,null,null,null,null,0,null,null,null,null,null,0,null,null,null,null,null,null,null,null,null,null,null,""]
["M159",null,null,null,null,null,null,0,null,null,null,null,null,0,null,null,null,null,null,null,null,null,null,null,null,""]
["M160",null,null,null,null,null,null,0,null,null,null,null,null,0,null,null,null,null,null,null,null,null,null,null,null,""]
["M161",null,null,null,null,null,null,0,null,null,null,null,null,0,null,null,null,null,null,null,null,null,null,null,null,""]
["M162",null,null,null,null,null,null,0,null,null,null,null,null,0,null,null,null,null,null,null,null,null,null,null,null,""]
["M163",null,null,null,null,null,null,0,null,null,null,null,null,0,null,null,null,null,null,null,null,null,null,null,null,""]
["M164",null,null,null,null,null,null,0,null,null,null,null,null,0,null,null,null,null,null,null,null,null,null,null,null,""]
["M165",null,null,null,null,null,null,0,null,null,null,null,null,0,null,null,null,null,null,null,null,null,null,null,null,""]
["M166",null,null,null,null,null,null,0,null,null,null,null,null,0,null,null,null,null,null,null,null,null,null,null,null,""]
["M167",null,null,null,null,null,null,0,null,null,null,null,null,0,null,null,null,null,null,null,null,null,null,null,null,""]
["M168",null,null,null,null,null,null,0,null,null,null,null,null,0,null,null,null,null,null,null,null,null,null,null,null,""]
["M169",null,null,null,null,null,null,0,null,null,null,null,null,0,null,null,null,null,null,null,null,null,null,null,null,""]
["M170",null,null,null,null,null,null,0,null,null,null,null,null,0,null,null,null,null,null,null,null,null,null,null,null,""]
["M171",null,null,null,null,null,null,0,null,null,null,null,null,0,null,null,null,null,null,null,null,null,null,null,null,""]
["M172",null,null,null,null,null,null,0,null,null,null,null,null,0,null,null,null,null,null,null,null,null,null,null,null,""]
["M173",null,null,null,null,null,null,0,null,null,null,null,null,0,null,null,null,null,null,null,null,null,null,null,null,""]
["M174",null,null,null,null,null,null,0,null,null,null,null,null,0,null,null,null,null,null,null,null,null,null,null,null,""]
["M175",null,null,null,null,null,null,0,null,null,null,null,null,0,null,null,null,null,null,null,null,null,null,null,null,""]
["M176",null,null,null,null,null,null,0,null,null,null,null,null,0,null,null,null,null,null,null,null,null,null,null,null,""]
["M177",null,null,null,null,null,null,0,null,null,null,null,null,0,null,null,null,null,null,null,null,null,null,null,null,""]
["M178",null,null,null,null,null,null,0,null,null,null,null,null,0,null,null,null,null,null,null,null,null,null,null,null,""]
["M179",null,null,null,null,null,null,0,null,null,null,null,null,0,null,null,null,null,null,null,null,null,null,null,null,""]
["M180",null,null,null,null,null,null,0,null,null,null,null,null,0,null,null,null,null,null,null,null,null,null,null,null,""]
["M181",null,null,null,null,null,null,0,null,null,null,null,null,0,null,null,null,null,null,null,null,null,null,null,null,""]
["M182",null,null,null,null,null,null,0,null,null,null,null,null,0,null,null,null,null,null,null,null,null,null,null,null,""]
["M183",null,null,null,null,null,null,0,null,null,null,null,null,0,null,null,null,null,null,null,null,null,null,null,null,""]
["M184",null,null,null,null,null,null,0,null,null,null,null,null,0,null,null,null,null,null,null,null,null,null,null,null,""]
["M185",null,null,null,null,null,null,0,null,null,null,null,null,0,null,null,null,null,null,null,null,null,null,null,null,""]
["M186",null,null,null,null,null,null,0,null,null,null,null,null,0,null,null,null,null,null,null,null,null,null,null,null,""]
["M187",null,null,null,null,null,null,0,null,null,null,null,null,0,null,null,null,null,null,null,null,null,null,null,null,""]
["M188",null,null,null,null,null,null,0,null,null,null,null,null,0,null,null,null,null,null,null,null,null,null,null,null,""]
["M189",null,null,null,null,null,null,0,null,null,null,null,null,0,null,null,null,null,null,null,null,null,null,null,null,""]
["M190",null,null,null,null,null,null,0,null,null,null,null,null,0,null,null,null,null,null,null,null,null,null,null,null,""]
["M191",null,null,null,null,null,null,0,null,null,null,null,null,0,null,null,null,null,null,null,null,null,null,null,null,""]
["M192",null,null,null,null,null,null,0,null,null,null,null,null,0,null,null,null,null,null,null,null,null,null,null,null,{"$f":"SUBSTITUTE(B201,\" \",\"_\")","v":""}]
["M193",null,null,null,null,null,null,0,null,null,null,null,null,{"$f":"IF(I201=\"Sim\",L201*M201,K201*J201)","v":0},null,null,null,null,null,null,null,null,null,null,null,""]
["M194",null,null,null,null,null,null,{"$f":"(E202+F202+G202)/3","v":0},null,null,null,null,null,0,null,null,null,null,null,null,null,null,null,null,null,""]
["M195",null,null,null,null,null,null,0,null,null,null,null,null,0,null,null,null,null,null,null,null,null,null,null,null,""]
["M196",null,null,null,null,null,null,0,null,null,null,null,null,0,null,null,null,null,null,null,null,null,null,null,null,""]
["M197",null,null,null,null,null,null,0,null,null,null,null,null,0,null,null,null,null,null,null,null,null,null,null,null,""]
["M198",null,null,null,null,null,null,0,null,null,null,null,null,0,null,null,null,null,null,null,null,null,null,null,null,""]
["M199",null,null,null,null,null,null,0,null,null,null,null,null,0,null,null,null,null,null,null,null,null,null,null,null,""]
["M200",null,null,null,null,null,null,0,null,null,null,null,null,0,null,null,null,null,null,null,null,null,null,null,null,""]
["M201",null,null,null,null,null,null,0,null,null,null,null,null,0,null,null,null,null,null,null,null,null,null,null,null,""]
["M202",null,null,null,null,null,null,0,null,null,null,null,null,0,null,null,null,null,null,null,null,null,null,null,null,""]
["M203",null,null,null,null,null,null,0,null,null,null,null,null,0,null,null,null,null,null,null,null,null,null,null,null,""]
["M204",null,null,null,null,null,null,0,null,null,null,null,null,0,null,null,null,null,null,null,null,null,null,null,null,""]
["M205",null,null,null,null,null,null,0,null,null,null,null,null,0,null,null,null,null,null,null,null,null,null,null,null,""]
["M206",null,null,null,null,null,null,0,null,null,null,null,null,0,null,null,null,null,null,null,null,null,null,null,null,""]
["M207",null,null,null,null,null,null,0,null,null,null,null,null,0,null,null,null,null,null,null,null,null,null,null,null,""]
["M208",null,null,null,null,null,null,0,null,null,null,null,null,0,null,null,null,null,null,null,null,null,null,null,null,""]
["M209",null,null,null,null,null,null,0,null,null,null,null,null,0,null,null,null,null,null,null,null,null,null,null,null,""]
["M210",null,null,null,null,null,null,0,null,null,null,null,null,0,null,null,null,null,null,null,null,null,null,null,null,""]
["M211",null,null,null,null,null,null,0,null,null,null,null,null,0,null,null,null,null,null,null,null,null,null,null,null,""]
["M212",null,null,null,null,null,null,0,null,null,null,null,null,0,null,null,null,null,null,null,null,null,null,null,null,""]
["M213",null,null,null,null,null,null,0,null,null,null,null,null,0,null,null,null,null,null,null,null,null,null,null,null,""]
["M214",null,null,null,null,null,null,0,null,null,null,null,null,0,null,null,null,null,null,null,null,null,null,null,null,""]
["M215",null,null,null,null,null,null,0,null,null,null,null,null,0,null,null,null,null,null,null,null,null,null,null,null,""]
["M216",null,null,null,null,null,null,0,null,null,null,null,null,0,null,null,null,null,null,null,null,null,null,null,null,""]
["M217",null,null,null,null,null,null,0,null,null,null,null,null,0,null,null,null,null,null,null,null,null,null,null,null,""]
["M218",null,null,null,null,null,null,0,null,null,null,null,null,0,null,null,null,null,null,null,null,null,null,null,null,""]
["M219",null,null,null,null,null,null,0,null,null,null,null,null,0,null,null,null,null,null,null,null,null,null,null,null,""]
["M220",null,null,null,null,null,null,0,null,null,null,null,null,0,null,null,null,null,null,null,null,null,null,null,null,""]
["M221",null,null,null,null,null,null,0,null,null,null,null,null,0,null,null,null,null,null,null,null,null,null,null,null,""]
["M222",null,null,null,null,null,null,0,null,null,null,null,null,0,null,null,null,null,null,null,null,null,null,null,null,""]
["M223",null,null,null,null,null,null,0,null,null,null,null,null,0,null,null,null,null,null,null,null,null,null,null,null,""]
["M224",null,null,null,null,null,null,0,null,null,null,null,null,0,null,null,null,null,null,null,null,null,null,null,null,""]
["M225",null,null,null,null,null,null,0,null,null,null,null,null,0,null,null,null,null,null,null,null,null,null,null,null,""]
["M226",null,null,null,null,null,null,0,null,null,null,null,null,0,null,null,null,null,null,null,null,null,null,null,null,""]
["M227",null,null,null,null,null,null,0,null,null,null,null,null,0,null,null,null,null,null,null,null,null,null,null,null,""]
["M228",null,null,null,null,null,null,0,null,null,null,null,null,0,null,null,null,null,null,null,null,null,null,null,null,""]
["M229",null,null,null,null,null,null,0,null,null,null,null,null,0,null,null,null,null,null,null,null,null,null,null,null,""]
["M230",null,null,null,null,null,null,0,null,null,null,null,null,0,null,null,null,null,null,null,null,null,null,null,null,""]
["M231",null,null,null,null,null,null,0,null,null,null,null,null,0,null,null,null,null,null,null,null,null,null,null,null,""]
["M232",null,null,null,null,null,null,0,null,null,null,null,null,0,null,null,null,null,null,null,null,null,null,null,null,""]
["M233",null,null,null,null,null,null,0,null,null,null,null,null,0,null,null,null,null,null,null,null,null,null,null,null,""]
["M234",null,null,null,null,null,null,0,null,null,null,null,null,0,null,null,null,null,null,null,null,null,null,null,null,""]
["M235",null,null,null,null,null,null,0,null,null,null,null,null,0,null,null,null,null,null,null,null,null,null,null,null,""]
["M236",null,null,null,null,null,null,0,null,null,null,null,null,0,null,null,null,null,null,null,null,null,null,null,null,""]
["M237",null,null,null,null,null,null,0,null,null,null,null,null,0,null,null,null,null,null,null,null,null,null,null,null,""]
["M238",null,null,null,null,null,null,0,null,null,null,null,null,0,null,null,null,null,null,null,null,null,null,null,null,""]
["M239",null,null,null,null,null,null,0,null,null,null,null,null,0,null,null,null,null,null,null,null,null,null,null,null,""]
["M240",null,null,null,null,null,null,0,null,null,null,null,null,0,null,null,null,null,null,null,null,null,null,null,null,""]
["M241",null,null,null,null,null,null,0,null,null,null,null,null,0,null,null,null,null,null,null,null,null,null,null,null,""]
["M242",null,null,null,null,null,null,0,null,null,null,null,null,0,null,null,null,null,null,null,null,null,null,null,null,""]
["M243",null,null,null,null,null,null,0,null,null,null,null,null,0,null,null,null,null,null,null,null,null,null,null,null,""]
["M244",null,null,null,null,null,null,0,null,null,null,null,null,0,null,null,null,null,null,null,null,null,null,null,null,""]
["M245",null,null,null,null,null,null,0,null,null,null,null,null,0,null,null,null,null,null,null,null,null,null,null,null,""]
["M246",null,null,null,null,null,null,0,null,null,null,null,null,0,null,null,null,null,null,null,null,null,null,null,null,""]
["M247",null,null,null,null,null,null,0,null,null,null,null,null,0,null,null,null,null,null,null,null,null,null,null,null,""]
["M248",null,null,null,null,null,null,0,null,null,null,null,null,0,null,null,null,null,null,null,null,null,null,null,null,""]
["M249",null,null,null,null,null,null,0,null,null,null,null,null,0,null,null,null,null,null,null,null,null,null,null,null,""]
["M250",null,null,null,null,null,null,0,null,null,null,null,null,0,null,null,null,null,null,null,null,null,null,null,null,""]
["M251",null,null,null,null,null,null,0,null,null,null,null,null,0,null,null,null,null,null,null,null,null,null,null,null,""]
["M252",null,null,null,null,null,null,0,null,null,null,null,null,0,null,null,null,null,null,null,null,null,null,null,null,""]
["M253",null,null,null,null,null,null,0,null,null,null,null,null,0,null,null,null,null,null,null,null,null,null,null,null,""]
["M254",null,null,null,null,null,null,0,null,null,null,null,null,0,null,null,null,null,null,null,null,null,null,null,null,""]
["M255",null,null,null,null,null,null,0,null,null,null,null,null,0,null,null,null,null,null,null,null,null,null,null,null,""]
["M256",null,null,null,null,null,null,0,null,null,null,null,null,0,null,null,null,null,null,null,null,null,null,null,null,{"$f":"SUBSTITUTE(B265,\" \",\"_\")","v":""}]
["M257",null,null,null,null,null,null,0,null,null,null,null,null,{"$f":"IF(I265=\"Sim\",L265*M265,K265*J265)","v":0},null,null,null,null,null,null,null,null,null,null,null,""]
["M258",null,null,null,null,null,null,{"$f":"(E266+F266+G266)/3","v":0},null,null,null,null,null,0,null,null,null,null,null,null,null,null,null,null,null,""]
["M259",null,null,null,null,null,null,0,null,null,null,null,null,0,null,null,null,null,null,null,null,null,null,null,null,""]
["M260",null,null,null,null,null,null,0,null,null,null,null,null,0,null,null,null,null,null,null,null,null,null,null,null,""]
["M261",null,null,null,null,null,null,0,null,null,null,null,null,0,null,null,null,null,null,null,null,null,null,null,null,""]
["M262",null,null,null,null,null,null,0,null,null,null,null,null,0,null,null,null,null,null,null,null,null,null,null,null,""]
["M263",null,null,null,null,null,null,0,null,null,null,null,null,0,null,null,null,null,null,null,null,null,null,null,null,""]
["M264",null,null,null,null,null,null,0,null,null,null,null,null,0,null,null,null,null,null,null,null,null,null,null,null,""]
["M265",null,null,null,null,null,null,0,null,null,null,null,null,0,null,null,null,null,null,null,null,null,null,null,null,""]
["M266",null,null,null,null,null,null,0,null,null,null,null,null,0,null,null,null,null,null,null,null,null,null,null,null,""]
["M267",null,null,null,null,null,null,0,null,null,null,null,null,0,null,null,null,null,null,null,null,null,null,null,null,""]
["M268",null,null,null,null,null,null,0,null,null,null,null,null,0,null,null,null,null,null,null,null,null,null,null,null,""]
["M269",null,null,null,null,null,null,0,null,null,null,null,null,0,null,null,null,null,null,null,null,null,null,null,null,""]
["M270",null,null,null,null,null,null,0,null,null,null,null,null,0,null,null,null,null,null,null,null,null,null,null,null,""]
["M271",null,null,null,null,null,null,0,null,null,null,null,null,0,null,null,null,null,null,null,null,null,null,null,null,""]
["M272",null,null,null,null,null,null,0,null,null,null,null,null,0,null,null,null,null,null,null,null,null,null,null,null,""]
["M273",null,null,null,null,null,null,0,null,null,null,null,null,0,null,null,null,null,null,null,null,null,null,null,null,""]
["M274",null,null,null,null,null,null,0,null,null,null,null,null,0,null,null,null,null,null,null,null,null,null,null,null,""]
["M275",null,null,null,null,null,null,0,null,null,null,null,null,0,null,null,null,null,null,null,null,null,null,null,null,""]
["M276",null,null,null,null,null,null,0,null,null,null,null,null,0,null,null,null,null,null,null,null,null,null,null,null,""]
["M277",null,null,null,null,null,null,0,null,null,null,null,null,0,null,null,null,null,null,null,null,null,null,null,null,""]
["M278",null,null,null,null,null,null,0,null,null,null,null,null,0,null,null,null,null,null,null,null,null,null,null,null,""]
["M279",null,null,null,null,null,null,0,null,null,null,null,null,0,null,null,null,null,null,null,null,null,null,null,null,""]
["M280",null,null,null,null,null,null,0,null,null,null,null,null,0,null,null,null,null,null,null,null,null,null,null,null,""]
["M281",null,null,null,null,null,null,0,null,null,null,null,null,0,null,null,null,null,null,null,null,null,null,null,null,""]
["M282",null,null,null,null,null,null,0,null,null,null,null,null,0,null,null,null,null,null,null,null,null,null,null,null,""]
["M283",null,null,null,null,null,null,0,null,null,null,null,null,0,null,null,null,null,null,null,null,null,null,null,null,""]
["M284",null,null,null,null,null,null,0,null,null,null,null,null,0,null,null,null,null,null,null,null,null,null,null,null,""]
["M285",null,null,null,null,null,null,0,null,null,null,null,null,0,null,null,null,null,null,null,null,null,null,null,null,""]
["M286",null,null,null,null,null,null,0,null,null,null,null,null,0,null,null,null,null,null,null,null,null,null,null,null,""]
["M287",null,null,null,null,null,null,0,null,null,null,null,null,0,null,null,null,null,null,null,null,null,null,null,null,""]
["M288",null,null,null,null,null,null,0,null,null,null,null,null,0,null,null,null,null,null,null,null,null,null,null,null,""]
["M289",null,null,null,null,null,null,0,null,null,null,null,null,0,null,null,null,null,null,null,null,null,null,null,null,""]
["M290",null,null,null,null,null,null,0,null,null,null,null,null,0,null,null,null,null,null,null,null,null,null,null,null,""]
["M291",null,null,null,null,null,null,0,null,null,null,null,null,0,null,null,null,null,null,null,null,null,null,null,null,""]
["M292",null,null,null,null,null,null,0,null,null,null,null,null,0,null,null,null,null,null,null,null,null,null,null,null,""]
["M293",null,null,null,null,null,null,0,null,null,null,null,null,0,null,null,null,null,null,null,null,null,null,null,null,""]
["M294",null,null,null,null,null,null,0,null,null,null,null,null,0,null,null,null,null,null,null,null,null,null,null,null,""]
["M295",null,null,null,null,null,null,0,null,null,null,null,null,0,null,null,null,null,null,null,null,null,null,null,null,""]
["M296",null,null,null,null,null,null,0,null,null,null,null,null,0,null,null,null,null,null,null,null,null,null,null,null,""]
["M297",null,null,null,null,null,null,0,null,null,null,null,null,0,null,null,null,null,null,null,null,null,null,null,null,""]
["M298",null,null,null,null,null,null,0,null,null,null,null,null,0,null,null,null,null,null,null,null,null,null,null,null,""]
["M299",null,null,null,null,null,null,0,null,null,null,null,null,0,null,null,null,null,null,null,null,null,null,null,null,""]
["M300",null,null,null,null,null,null,0,null,null,null,null,null,0,null,null,null,null,null,null,null,null,null,null,null,""]
["M301",null,null,null,null,null,null,0,null,null,null,null,null,0,null,null,null,null,null,null,null,null,null,null,null,""]
["M302",null,null,null,null,null,null,0,null,null,null,null,null,0,null,null,null,null,null,null,null,null,null,null,null,""]
["M303",null,null,null,null,null,null,0,null,null,null,null,null,0,null,null,null,null,null,null,null,null,null,null,null,""]
["M304",null,null,null,null,null,null,0,null,null,null,null,null,0,null,null,null,null,null,null,null,null,null,null,null,""]
["M305",null,null,null,null,null,null,0,null,null,null,null,null,0,null,null,null,null,null,null,null,null,null,null,null,""]
["M306",null,null,null,null,null,null,0,null,null,null,null,null,0,null,null,null,null,null,null,null,null,null,null,null,""]
["M307",null,null,null,null,null,null,0,null,null,null,null,null,0,null,null,null,null,null,null,null,null,null,null,null,""]
["M308",null,null,null,null,null,null,0,null,null,null,null,null,0,null,null,null,null,null,null,null,null,null,null,null,""]
["M309",null,null,null,null,null,null,0,null,null,null,null,null,0,null,null,null,null,null,null,null,null,null,null,null,""]
["M310",null,null,null,null,null,null,0,null,null,null,null,null,0,null,null,null,null,null,null,null,null,null,null,null,""]
["M311",null,null,null,null,null,null,0,null,null,null,null,null,0,null,null,null,null,null,null,null,null,null,null,null,""]
["M312",null,null,null,null,null,null,0,null,null,null,null,null,0,null,null,null,null,null,null,null,null,null,null,null,""]
["M313",null,null,null,null,null,null,0,null,null,null,null,null,0,null,null,null,null,null,null,null,null,null,null,null,""]
["M314",null,null,null,null,null,null,0,null,null,null,null,null,0,null,null,null,null,null,null,null,null,null,null,null,""]
["M315",null,null,null,null,null,null,0,null,null,null,null,null,0,null,null,null,null,null,null,null,null,null,null,null,""]
["M316",null,null,null,null,null,null,0,null,null,null,null,null,0,null,null,null,null,null,null,null,null,null,null,null,""]
["M317",null,null,null,null,null,null,0,null,null,null,null,null,0,null,null,null,null,null,null,null,null,null,null,null,""]
["M318",null,null,null,null,null,null,0,null,null,null,null,null,0,null,null,null,null,null,null,null,null,null,null,null,""]
["M319",null,null,null,null,null,null,0,null,null,null,null,null,0,null,null,null,null,null,null,null,null,null,null,null,""]
["M320",null,null,null,null,null,null,0,null,null,null,null,null,0,null,null,null,null,null,null,null,null,null,null,null,{"$f":"SUBSTITUTE(B329,\" \",\"_\")","v":""}]
["M321",null,null,null,null,null,null,0,null,null,null,null,null,{"$f":"IF(I329=\"Sim\",L329*M329,K329*J329)","v":0},null,null,null,null,null,null,null,null,null,null,null,""]
["M322",null,null,null,null,null,null,{"$f":"(E330+F330+G330)/3","v":0},null,null,null,null,null,0,null,null,null,null,null,null,null,null,null,null,null,""]
["M323",null,null,null,null,null,null,0,null,null,null,null,null,0,null,null,null,null,null,null,null,null,null,null,null,""]
["M324",null,null,null,null,null,null,0,null,null,null,null,null,0,null,null,null,null,null,null,null,null,null,null,null,""]
["M325",null,null,null,null,null,null,0,null,null,null,null,null,0,null,null,null,null,null,null,null,null,null,null,null,""]
["M326",null,null,null,null,null,null,0,null,null,null,null,null,0,null,null,null,null,null,null,null,null,null,null,null,""]
["M327",null,null,null,null,null,null,0,null,null,null,null,null,0,null,null,null,null,null,null,null,null,null,null,null,""]
["M328",null,null,null,null,null,null,0,null,null,null,null,null,0,null,null,null,null,null,null,null,null,null,null,null,""]
["M329",null,null,null,null,null,null,0,null,null,null,null,null,0,null,null,null,null,null,null,null,null,null,null,null,""]
["M330",null,null,null,null,null,null,0,null,null,null,null,null,0,null,null,null,null,null,null,null,null,null,null,null,""]
["M331",null,null,null,null,null,null,0,null,null,null,null,null,0,null,null,null,null,null,null,null,null,null,null,null,""]
["M332",null,null,null,null,null,null,0,null,null,null,null,null,0,null,null,null,null,null,null,null,null,null,null,null,""]
["M333",null,null,null,null,null,null,0,null,null,null,null,null,0,null,null,null,null,null,null,null,null,null,null,null,""]
["M334",null,null,null,null,null,null,0,null,null,null,null,null,0,null,null,null,null,null,null,null,null,null,null,null,""]
["M335",null,null,null,null,null,null,0,null,null,null,null,null,0,null,null,null,null,null,null,null,null,null,null,null,""]
["M336",null,null,null,null,null,null,0,null,null,null,null,null,0,null,null,null,null,null,null,null,null,null,null,null,""]
["M337",null,null,null,null,null,null,0,null,null,null,null,null,0,null,null,null,null,null,null,null,null,null,null,null,""]
["M338",null,null,null,null,null,null,0,null,null,null,null,null,0,null,null,null,null,null,null,null,null,null,null,null,""]
["M339",null,null,null,null,null,null,0,null,null,null,null,null,0,null,null,null,null,null,null,null,null,null,null,null,""]
["M340",null,null,null,null,null,null,0,null,null,null,null,null,0,null,null,null,null,null,null,null,null,null,null,null,""]
["M341",null,null,null,null,null,null,0,null,null,null,null,null,0,null,null,null,null,null,null,null,null,null,null,null,""]
["M342",null,null,null,null,null,null,0,null,null,null,null,null,0,null,null,null,null,null,null,null,null,null,null,null,""]
["M343",null,null,null,null,null,null,0,null,null,null,null,null,0,null,null,null,null,null,null,null,null,null,null,null,""]
["M344",null,null,null,null,null,null,0,null,null,null,null,null,0,null,null,null,null,null,null,null,null,null,null,null,""]
["M345",null,null,null,null,null,null,0,null,null,null,null,null,0,null,null,null,null,null,null,null,null,null,null,null,""]
["M346",null,null,null,null,null,null,0,null,null,null,null,null,0,null,null,null,null,null,null,null,null,null,null,null,""]
["M347",null,null,null,null,null,null,0,null,null,null,null,null,0,null,null,null,null,null,null,null,null,null,null,null,""]
["M348",null,null,null,null,null,null,0,null,null,null,null,null,0,null,null,null,null,null,null,null,null,null,null,null,""]
["M349",null,null,null,null,null,null,0,null,null,null,null,null,0,null,null,null,null,null,null,null,null,null,null,null,""]
["M350",null,null,null,null,null,null,0,null,null,null,null,null,0,null,null,null,null,null,null,null,null,null,null,null,""]
["M351",null,null,null,null,null,null,0,null,null,null,null,null,0,null,null,null,null,null,null,null,null,null,null,null,""]
["M352",null,null,null,null,null,null,0,null,null,null,null,null,0,null,null,null,null,null,null,null,null,null,null,null,""]
["M353",null,null,null,null,null,null,0,null,null,null,null,null,0,null,null,null,null,null,null,null,null,null,null,null,""]
["M354",null,null,null,null,null,null,0,null,null,null,null,null,0,null,null,null,null,null,null,null,null,null,null,null,""]
["M355",null,null,null,null,null,null,0,null,null,null,null,null,0,null,null,null,null,null,null,null,null,null,null,null,""]
["M356",null,null,null,null,null,null,0,null,null,null,null,null,0,null,null,null,null,null,null,null,null,null,null,null,""]
["M357",null,null,null,null,null,null,0,null,null,null,null,null,0,null,null,null,null,null,null,null,null,null,null,null,""]
["M358",null,null,null,null,null,null,0,null,null,null,null,null,0,null,null,null,null,null,null,null,null,null,null,null,""]
["M359",null,null,null,null,null,null,0,null,null,null,null,null,0,null,null,null,null,null,null,null,null,null,null,null,""]
["M360",null,null,null,null,null,null,0,null,null,null,null,null,0,null,null,null,null,null,null,null,null,null,null,null,""]
["M361",null,null,null,null,null,null,0,null,null,null,null,null,0,null,null,null,null,null,null,null,null,null,null,null,""]
["M362",null,null,null,null,null,null,0,null,null,null,null,null,0,null,null,null,null,null,null,null,null,null,null,null,""]
["M363",null,null,null,null,null,null,0,null,null,null,null,null,0,null,null,null,null,null,null,null,null,null,null,null,""]
["M364",null,null,null,null,null,null,0,null,null,null,null,null,0,null,null,null,null,null,null,null,null,null,null,null,""]
["M365",null,null,null,null,null,null,0,null,null,null,null,null,0,null,null,null,null,null,null,null,null,null,null,null,""]
["M366",null,null,null,null,null,null,0,null,null,null,null,null,0,null,null,null,null,null,null,null,null,null,null,null,""]
["M367",null,null,null,null,null,null,0,null,null,null,null,null,0,null,null,null,null,null,null,null,null,null,null,null,""]
["M368",null,null,null,null,null,null,0,null,null,null,null,null,0,null,null,null,null,null,null,null,null,null,null,null,""]
["M369",null,null,null,null,null,null,0,null,null,null,null,null,0,null,null,null,null,null,null,null,null,null,null,null,""]
["M370",null,null,null,null,null,null,0,null,null,null,null,null,0,null,null,null,null,null,null,null,null,null,null,null,""]
["M371",null,null,null,null,null,null,0,null,null,null,null,null,0,null,null,null,null,null,null,null,null,null,null,null,""]
["M372",null,null,null,null,null,null,0,null,null,null,null,null,0,null,null,null,null,null,null,null,null,null,null,null,""]
["M373",null,null,null,null,null,null,0,null,null,null,null,null,0,null,null,null,null,null,null,null,null,null,null,null,""]
["M374",null,null,null,null,null,null,0,null,null,null,null,null,0,null,null,null,null,null,null,null,null,null,null,null,""]
["M375",null,null,null,null,null,null,0,null,null,null,null,null,0,null,null,null,null,null,null,null,null,null,null,null,""]
["M376",null,null,null,null,null,null,0,null,null,null,null,null,0,null,null,null,null,null,null,null,null,null,null,null,""]
["M377",null,null,null,null,null,null,0,null,null,null,null,null,0,null,null,null,null,null,null,null,null,null,null,null,""]
["M378",null,null,null,null,null,null,0,null,null,null,null,null,0,null,null,null,null,null,null,null,null,null,null,null,""]
["M379",null,null,null,null,null,null,0,null,null,null,null,null,0,null,null,null,null,null,null,null,null,null,null,null,""]
["M380",null,null,null,null,null,null,0,null,null,null,null,null,0,null,null,null,null,null,null,null,null,null,null,null,""]
["M381",null,null,null,null,null,null,0,null,null,null,null,null,0,null,null,null,null,null,null,null,null,null,null,null,""]
["M382",null,null,null,null,null,null,0,null,null,null,null,null,0,null,null,null,null,null,null,null,null,null,null,null,""]
["M383",null,null,null,null,null,null,0,null,null,null,null,null,0,null,null,null,null,null,null,null,null,null,null,null,""]
["M384",null,null,null,null,null,null,0,null,null,null,null,null,0,null,null,null,null,null,null,null,null,null,null,null,{"$f":"SUBSTITUTE(B393,\" \",\"_\")","v":""}]
["M385",null,null,null,null,null,null,0,null,null,null,null,null,{"$f":"IF(I393=\"Sim\",L393*M393,K393*J393)","v":0},null,null,null,null,null,null,null,null,null,null,null,""]
["M386",null,null,null,null,null,null,{"$f":"(E394+F394+G394)/3","v":0},null,null,null,null,null,0,null,null,null,null,null,null,null,null,null,null,null,""]
["M387",null,null,null,null,null,null,0,null,null,null,null,null,0,null,null,null,null,null,null,null,null,null,null,null,""]
["M388",null,null,null,null,null,null,0,null,null,null,null,null,0,null,null,null,null,null,null,null,null,null,null,null,""]
["M389",null,null,null,null,null,null,0,null,null,null,null,null,0,null,null,null,null,null,null,null,null,null,null,null,""]
["M390",null,null,null,null,null,null,0,null,null,null,null,null,0,null,null,null,null,null,null,null,null,null,null,null,""]
["M391",null,null,null,null,null,null,0,null,null,null,null,null,0,null,null,null,null,null,null,null,null,null,null,null,""]
["M392",null,null,null,null,null,null,0,null,null,null,null,null,0,null,null,null,null,null,null,null,null,null,null,null,""]
["M393",null,null,null,null,null,null,0,null,null,null,null,null,0,null,null,null,null,null,null,null,null,null,null,null,""]
["M394",null,null,null,null,null,null,0,null,null,null,null,null,0,null,null,null,null,null,null,null,null,null,null,null,""]
["M395",null,null,null,null,null,null,0,null,null,null,null,null,0,null,null,null,null,null,null,null,null,null,null,null,""]
["M396",null,null,null,null,null,null,0,null,null,null,null,null,0,null,null,null,null,null,null,null,null,null,null,null,""]
["M397",null,null,null,null,null,null,0,null,null,null,null,null,0,null,null,null,null,null,null,null,null,null,null,null,""]
["M398",null,null,null,null,null,null,0,null,null,null,null,null,0,null,null,null,null,null,null,null,null,null,null,null,""]
["M399",null,null,null,null,null,null,0,null,null,null,null,null,0,null,null,null,null,null,null,null,null,null,null,null,""]
["M400",null,null,null,null,null,null,0,null,null,null,null,null,0,null,null,null,null,null,null,null,null,null,null,null,""]
["M401",null,null,null,null,null,null,0,null,null,null,null,null,0,null,null,null,null,null,null,null,null,null,null,null,""]
["M402",null,null,null,null,null,null,0,null,null,null,null,null,0,null,null,null,null,null,null,null,null,null,null,null,""]
["M403",null,null,null,null,null,null,0,null,null,null,null,null,0,null,null,null,null,null,null,null,null,null,null,null,""]
["M404",null,null,null,null,null,null,0,null,null,null,null,null,0,null,null,null,null,null,null,null,null,null,null,null,""]
["M405",null,null,null,null,null,null,0,null,null,null,null,null,0,null,null,null,null,null,null,null,null,null,null,null,""]
["M406",null,null,null,null,null,null,0,null,null,null,null,null,0,null,null,null,null,null,null,null,null,null,null,null,""]
["M407",null,null,null,null,null,null,0,null,null,null,null,null,0,null,null,null,null,null,null,null,null,null,null,null,""]
["M408",null,null,null,null,null,null,0,null,null,null,null,null,0,null,null,null,null,null,null,null,null,null,null,null,""]
["M409",null,null,null,null,null,null,0,null,null,null,null,null,0,null,null,null,null,null,null,null,null,null,null,null,""]
["M410",null,null,null,null,null,null,0,null,null,null,null,null,0,null,null,null,null,null,null,null,null,null,null,null,""]
["M411",null,null,null,null,null,null,0,null,null,null,null,null,0,null,null,null,null,null,null,null,null,null,null,null,""]
["M412",null,null,null,null,null,null,0,null,null,null,null,null,0,null,null,null,null,null,null,null,null,null,null,null,""]
["M413",null,null,null,null,null,null,0,null,null,null,null,null,0,null,null,null,null,null,null,null,null,null,null,null,""]
["M414",null,null,null,null,null,null,0,null,null,null,null,null,0,null,null,null,null,null,null,null,null,null,null,null,""]
["M415",null,null,null,null,null,null,0,null,null,null,null,null,0,null,null,null,null,null,null,null,null,null,null,null,""]
["M416",null,null,null,null,null,null,0,null,null,null,null,null,0,null,null,null,null,null,null,null,null,null,null,null,""]
["M417",null,null,null,null,null,null,0,null,null,null,null,null,0,null,null,null,null,null,null,null,null,null,null,null,""]
["M418",null,null,null,null,null,null,0,null,null,null,null,null,0,null,null,null,null,null,null,null,null,null,null,null,""]
["M419",null,null,null,null,null,null,0,null,null,null,null,null,0,null,null,null,null,null,null,null,null,null,null,null,""]
["M420",null,null,null,null,null,null,0,null,null,null,null,null,0,null,null,null,null,null,null,null,null,null,null,null,""]
["M421",null,null,null,null,null,null,0,null,null,null,null,null,0,null,null,null,null,null,null,null,null,null,null,null,""]
["M422",null,null,null,null,null,null,0,null,null,null,null,null,0,null,null,null,null,null,null,null,null,null,null,null,""]
["M423",null,null,null,null,null,null,0,null,null,null,null,null,0,null,null,null,null,null,null,null,null,null,null,null,""]
["M424",null,null,null,null,null,null,0,null,null,null,null,null,0,null,null,null,null,null,null,null,null,null,null,null,""]
["M425",null,null,null,null,null,null,0,null,null,null,null,null,0,null,null,null,null,null,null,null,null,null,null,null,""]
["M426",null,null,null,null,null,null,0,null,null,null,null,null,0,null,null,null,null,null,null,null,null,null,null,null,""]
["M427",null,null,null,null,null,null,0,null,null,null,null,null,0,null,null,null,null,null,null,null,null,null,null,null,""]
["M428",null,null,null,null,null,null,0,null,null,null,null,null,0,null,null,null,null,null,null,null,null,null,null,null,""]
["M429",null,null,null,null,null,null,0,null,null,null,null,null,0,null,null,null,null,null,null,null,null,null,null,null,""]
["M430",null,null,null,null,null,null,0,null,null,null,null,null,0,null,null,null,null,null,null,null,null,null,null,null,""]
["M431",null,null,null,null,null,null,0,null,null,null,null,null,0,null,null,null,null,null,null,null,null,null,null,null,""]
["M432",null,null,null,null,null,null,0,null,null,null,null,null,0,null,null,null,null,null,null,null,null,null,null,null,""]
["M433",null,null,null,null,null,null,0,null,null,null,null,null,0,null,null,null,null,null,null,null,null,null,null,null,""]
["M434",null,null,null,null,null,null,0,null,null,null,null,null,0,null,null,null,null,null,null,null,null,null,null,null,""]
["M435",null,null,null,null,null,null,0,null,null,null,null,null,0,null,null,null,null,null,null,null,null,null,null,null,""]
["M436",null,null,null,null,null,null,0,null,null,null,null,null,0,null,null,null,null,null,null,null,null,null,null,null,""]
["M437",null,null,null,null,null,null,0,null,null,null,null,null,0,null,null,null,null,null,null,null,null,null,null,null,""]
["M438",null,null,null,null,null,null,0,null,null,null,null,null,0,null,null,null,null,null,null,null,null,null,null,null,""]
["M439",null,null,null,null,null,null,0,null,null,null,null,null,0,null,null,null,null,null,null,null,null,null,null,null,""]
["M440",null,null,null,null,null,null,0,null,null,null,null,null,0,null,null,null,null,null,null,null,null,null,null,null,""]
["M441",null,null,null,null,null,null,0,null,null,null,null,null,0,null,null,null,null,null,null,null,null,null,null,null,""]
["M442",null,null,null,null,null,null,0,null,null,null,null,null,0,null,null,null,null,null,null,null,null,null,null,null,""]
["M443",null,null,null,null,null,null,0,null,null,null,null,null,0,null,null,null,null,null,null,null,null,null,null,null,""]
["M444",null,null,null,null,null,null,0,null,null,null,null,null,0,null,null,null,null,null,null,null,null,null,null,null,""]
["M445",null,null,null,null,null,null,0,null,null,null,null,null,0,null,null,null,null,null,null,null,null,null,null,null,""]
["M446",null,null,null,null,null,null,0,null,null,null,null,null,0,null,null,null,null,null,null,null,null,null,null,null,""]
["M447",null,null,null,null,null,null,0,null,null,null,null,null,0,null,null,null,null,null,null,null,null,null,null,null,""]
["M448",null,null,null,null,null,null,0,null,null,null,null,null,0,null,null,null,null,null,null,null,null,null,null,null,{"$f":"SUBSTITUTE(B457,\" \",\"_\")","v":""}]
["M449",null,null,null,null,null,null,0,null,null,null,null,null,{"$f":"IF(I457=\"Sim\",L457*M457,K457*J457)","v":0},null,null,null,null,null,null,null,null,null,null,null,""]
["M450",null,null,null,null,null,null,{"$f":"(E458+F458+G458)/3","v":0},null,null,null,null,null,0,null,null,null,null,null,null,null,null,null,null,null,""]
["M451",null,null,null,null,null,null,0,null,null,null,null,null,0,null,null,null,null,null,null,null,null,null,null,null,""]
["M452",null,null,null,null,null,null,0,null,null,null,null,null,0,null,null,null,null,null,null,null,null,null,null,null,""]
["M453",null,null,null,null,null,null,0,null,null,null,null,null,0,null,null,null,null,null,null,null,null,null,null,null,""]
["M454",null,null,null,null,null,null,0,null,null,null,null,null,0,null,null,null,null,null,null,null,null,null,null,null,""]
["M455",null,null,null,null,null,null,0,null,null,null,null,null,0,null,null,null,null,null,null,null,null,null,null,null,""]
["M456",null,null,null,null,null,null,0,null,null,null,null,null,0,null,null,null,null,null,null,null,null,null,null,null,""]
["M457",null,null,null,null,null,null,0,null,null,null,null,null,0,null,null,null,null,null,null,null,null,null,null,null,""]
["M458",null,null,null,null,null,null,0,null,null,null,null,null,0,null,null,null,null,null,null,null,null,null,null,null,""]
["M459",null,null,null,null,null,null,0,null,null,null,null,null,0,null,null,null,null,null,null,null,null,null,null,null,""]
["M460",null,null,null,null,null,null,0,null,null,null,null,null,0,null,null,null,null,null,null,null,null,null,null,null,""]
["M461",null,null,null,null,null,null,0,null,null,null,null,null,0,null,null,null,null,null,null,null,null,null,null,null,""]
["M462",null,null,null,null,null,null,0,null,null,null,null,null,0,null,null,null,null,null,null,null,null,null,null,null,""]
["M463",null,null,null,null,null,null,0,null,null,null,null,null,0,null,null,null,null,null,null,null,null,null,null,null,""]
["M464",null,null,null,null,null,null,0,null,null,null,null,null,0,null,null,null,null,null,null,null,null,null,null,null,""]
["M465",null,null,null,null,null,null,0,null,null,null,null,null,0,null,null,null,null,null,null,null,null,null,null,null,""]
["M466",null,null,null,null,null,null,0,null,null,null,null,null,0,null,null,null,null,null,null,null,null,null,null,null,""]
["M467",null,null,null,null,null,null,0,null,null,null,null,null,0,null,null,null,null,null,null,null,null,null,null,null,""]
["M468",null,null,null,null,null,null,0,null,null,null,null,null,0,null,null,null,null,null,null,null,null,null,null,null,""]
["M469",null,null,null,null,null,null,0,null,null,null,null,null,0,null,null,null,null,null,null,null,null,null,null,null,""]
["M470",null,null,null,null,null,null,0,null,null,null,null,null,0,null,null,null,null,null,null,null,null,null,null,null,""]
["M471",null,null,null,null,null,null,0,null,null,null,null,null,0,null,null,null,null,null,null,null,null,null,null,null,""]
["M472",null,null,null,null,null,null,0,null,null,null,null,null,0,null,null,null,null,null,null,null,null,null,null,null,""]
["M473",null,null,null,null,null,null,0,null,null,null,null,null,0,null,null,null,null,null,null,null,null,null,null,null,""]
["M474",null,null,null,null,null,null,0,null,null,null,null,null,0,null,null,null,null,null,null,null,null,null,null,null,""]
["M475",null,null,null,null,null,null,0,null,null,null,null,null,0,null,null,null,null,null,null,null,null,null,null,null,""]
["M476",null,null,null,null,null,null,0,null,null,null,null,null,0,null,null,null,null,null,null,null,null,null,null,null,""]
["M477",null,null,null,null,null,null,0,null,null,null,null,null,0,null,null,null,null,null,null,null,null,null,null,null,""]
["M478",null,null,null,null,null,null,0,null,null,null,null,null,0,null,null,null,null,null,null,null,null,null,null,null,""]
["M479",null,null,null,null,null,null,0,null,null,null,null,null,0,null,null,null,null,null,null,null,null,null,null,null,""]
["M480",null,null,null,null,null,null,0,null,null,null,null,null,0,null,null,null,null,null,null,null,null,null,null,null,""]
["M481",null,null,null,null,null,null,0,null,null,null,null,null,0,null,null,null,null,null,null,null,null,null,null,null,""]
["M482",null,null,null,null,null,null,0,null,null,null,null,null,0,null,null,null,null,null,null,null,null,null,null,null,""]
["M483",null,null,null,null,null,null,0,null,null,null,null,null,0,null,null,null,null,null,null,null,null,null,null,null,""]
["M484",null,null,null,null,null,null,0,null,null,null,null,null,0,null,null,null,null,null,null,null,null,null,null,null,""]
["M485",null,null,null,null,null,null,0,null,null,null,null,null,0,null,null,null,null,null,null,null,null,null,null,null,""]
["M486",null,null,null,null,null,null,0,null,null,null,null,null,0,null,null,null,null,null,null,null,null,null,null,null,""]
["M487",null,null,null,null,null,null,0,null,null,null,null,null,0,null,null,null,null,null,null,null,null,null,null,null,""]
["M488",null,null,null,null,null,null,0,null,null,null,null,null,0,null,null,null,null,null,null,null,null,null,null,null,""]
["M489",null,null,null,null,null,null,0,null,null,null,null,null,0,null,null,null,null,null,null,null,null,null,null,null,""]
["M490",null,null,null,null,null,null,0,null,null,null,null,null,0,null,null,null,null,null,null,null,null,null,null,null,""]
["M491",null,null,null,null,null,null,0,null,null,null,null,null,0,null,null,null,null,null,null,null,null,null,null,null,""]
["M492",null,null,null,null,null,null,0,null,null,null,null,null,0,null,null,null,null,null,null,null,null,null,null,null,""]
["M493",null,null,null,null,null,null,0,null,null,null,null,null,0,null,null,null,null,null,null,null,null,null,null,null,""]
["M494",null,null,null,null,null,null,0,null,null,null,null,null,0,null,null,null,null,null,null,null,null,null,null,null,""]
["M495",null,null,null,null,null,null,0,null,null,null,null,null,0,null,null,null,null,null,null,null,null,null,null,null,""]
["M496",null,null,null,null,null,null,0,null,null,null,null,null,0,null,null,null,null,null,null,null,null,null,null,null,""]
["M497",null,null,null,null,null,null,0,null,null,null,null,null,0,null,null,null,null,null,null,null,null,null,null,null,""]
["M498",null,null,null,null,null,null,0,null,null,null,null,null,0,null,null,null,null,null,null,null,null,null,null,null,""]
["M499",null,null,null,null,null,null,0,null,null,null,null,null,0,null,null,null,null,null,null,null,null,null,null,null,""]
["M500",null,null,null,null,null,null,0,null,null,null,null,null,0,null,null,null,null,null,null,null,null,null,null,null,""]
["M501",null,null,null,null,null,null,0,null,null,null,null,null,0,null,null,null,null,null,null,null,null,null,null,null,""]
["M502",null,null,null,null,null,null,0,null,null,null,null,null,0,null,null,null,null,null,null,null,null,null,null,null,""]
["M503",null,null,null,null,null,null,0,null,null,null,null,null,0,null,null,null,null,null,null,null,null,null,null,null,""]
["M504",null,null,null,null,null,null,0,null,null,null,null,null,0,null,null,null,null,null,null,null,null,null,null,null,""]
["M505",null,null,null,null,null,null,0,null,null,null,null,null,0,null,null,null,null,null,null,null,null,null,null,null,""]
["M506",null,null,null,null,null,null,0,null,null,null,null,null,0,null,null,null,null,null,null,null,null,null,null,null,""]
["M507",null,null,null,null,null,null,0,null,null,null,null,null,0,null,null,null,null,null,null,null,null,null,null,null,""]
["M508",null,null,null,null,null,null,0,null,null,null,null,null,0,null,null,null,null,null,null,null,null,null,null,null,""]
["M509",null,null,null,null,null,null,0,null,null,null,null,null,0,null,null,null,null,null,null,null,null,null,null,null,""]
["M510",null,null,null,null,null,null,0,null,null,null,null,null,0,null,null,null,null,null,null,null,null,null,null,null,""]
["M511",null,null,null,null,null,null,0,null,null,null,null,null,0,null,null,null,null,null,null,null,null,null,null,null,""]
["M512",null,null,null,null,null,null,0,null,null,null,null,null,0,null,null,null,null,null,null,null,null,null,null,null,{"$f":"SUBSTITUTE(B521,\" \",\"_\")","v":""}]
["M513",null,null,null,null,null,null,0,null,null,null,null,null,{"$f":"IF(I521=\"Sim\",L521*M521,K521*J521)","v":0},null,null,null,null,null,null,null,null,null,null,null,""]
["M514",null,null,null,null,null,null,{"$f":"(E522+F522+G522)/3","v":0},null,null,null,null,null,0,null,null,null,null,null,null,null,null,null,null,null,""]
["M515",null,null,null,null,null,null,0,null,null,null,null,null,0,null,null,null,null,null,null,null,null,null,null,null,""]
["M516",null,null,null,null,null,null,0,null,null,null,null,null,0,null,null,null,null,null,null,null,null,null,null,null,""]
["M517",null,null,null,null,null,null,0,null,null,null,null,null,0,null,null,null,null,null,null,null,null,null,null,null,""]
["M518",null,null,null,null,null,null,0,null,null,null,null,null,0,null,null,null,null,null,null,null,null,null,null,null,""]
["M519",null,null,null,null,null,null,0,null,null,null,null,null,0,null,null,null,null,null,null,null,null,null,null,null,""]
["M520",null,null,null,null,null,null,0,null,null,null,null,null,0,null,null,null,null,null,null,null,null,null,null,null,""]
["M521",null,null,null,null,null,null,0,null,null,null,null,null,0,null,null,null,null,null,null,null,null,null,null,null,""]
["M522",null,null,null,null,null,null,0,null,null,null,null,null,0,null,null,null,null,null,null,null,null,null,null,null,""]
["M523",null,null,null,null,null,null,0,null,null,null,null,null,0,null,null,null,null,null,null,null,null,null,null,null,""]
["M524",null,null,null,null,null,null,0,null,null,null,null,null,0,null,null,null,null,null,null,null,null,null,null,null,""]
["M525",null,null,null,null,null,null,0,null,null,null,null,null,0,null,null,null,null,null,null,null,null,null,null,null,""]
["M526",null,null,null,null,null,null,0,null,null,null,null,null,0,null,null,null,null,null,null,null,null,null,null,null,""]
["M527",null,null,null,null,null,null,0,null,null,null,null,null,0,null,null,null,null,null,null,null,null,null,null,null,""]
["M528",null,null,null,null,null,null,0,null,null,null,null,null,0,null,null,null,null,null,null,null,null,null,null,null,""]
["M529",null,null,null,null,null,null,0,null,null,null,null,null,0,null,null,null,null,null,null,null,null,null,null,null,""]
["M530",null,null,null,null,null,null,0,null,null,null,null,null,0,null,null,null,null,null,null,null,null,null,null,null,""]
["M531",null,null,null,null,null,null,0,null,null,null,null,null,0,null,null,null,null,null,null,null,null,null,null,null,""]
["M532",null,null,null,null,null,null,0,null,null,null,null,null,0,null,null,null,null,null,null,null,null,null,null,null,""]
["M533",null,null,null,null,null,null,0,null,null,null,null,null,0,null,null,null,null,null,null,null,null,null,null,null,""]
["M534",null,null,null,null,null,null,0,null,null,null,null,null,0,null,null,null,null,null,null,null,null,null,null,null,""]
["M535",null,null,null,null,null,null,0,null,null,null,null,null,0,null,null,null,null,null,null,null,null,null,null,null,""]
["M536",null,null,null,null,null,null,0,null,null,null,null,null,0,null,null,null,null,null,null,null,null,null,null,null,""]
["M537",null,null,null,null,null,null,0,null,null,null,null,null,0,null,null,null,null,null,null,null,null,null,null,null,""]
["M538",null,null,null,null,null,null,0,null,null,null,null,null,0,null,null,null,null,null,null,null,null,null,null,null,""]
["M539",null,null,null,null,null,null,0,null,null,null,null,null,0,null,null,null,null,null,null,null,null,null,null,null,""]
["M540",null,null,null,null,null,null,0,null,null,null,null,null,0,null,null,null,null,null,null,null,null,null,null,null,""]
["M541",null,null,null,null,null,null,0,null,null,null,null,null,0,null,null,null,null,null,null,null,null,null,null,null,""]
["M542",null,null,null,null,null,null,0,null,null,null,null,null,0,null,null,null,null,null,null,null,null,null,null,null,""]
["M543",null,null,null,null,null,null,0,null,null,null,null,null,0,null,null,null,null,null,null,null,null,null,null,null,""]
["M544",null,null,null,null,null,null,0,null,null,null,null,null,0,null,null,null,null,null,null,null,null,null,null,null,""]
["M545",null,null,null,null,null,null,0,null,null,null,null,null,0,null,null,null,null,null,null,null,null,null,null,null,""]
["M546",null,null,null,null,null,null,0,null,null,null,null,null,0,null,null,null,null,null,null,null,null,null,null,null,""]
["M547",null,null,null,null,null,null,0,null,null,null,null,null,0,null,null,null,null,null,null,null,null,null,null,null,""]
["M548",null,null,null,null,null,null,0,null,null,null,null,null,0,null,null,null,null,null,null,null,null,null,null,null,""]
["M549",null,null,null,null,null,null,0,null,null,null,null,null,0,null,null,null,null,null,null,null,null,null,null,null,""]
["M550",null,null,null,null,null,null,0,null,null,null,null,null,0,null,null,null,null,null,null,null,null,null,null,null,""]
["M551",null,null,null,null,null,null,0,null,null,null,null,null,0,null,null,null,null,null,null,null,null,null,null,null,""]
["M552",null,null,null,null,null,null,0,null,null,null,null,null,0,null,null,null,null,null,null,null,null,null,null,null,""]
["M553",null,null,null,null,null,null,0,null,null,null,null,null,0,null,null,null,null,null,null,null,null,null,null,null,""]
["M554",null,null,null,null,null,null,0,null,null,null,null,null,0,null,null,null,null,null,null,null,null,null,null,null,""]
["M555",null,null,null,null,null,null,0,null,null,null,null,null,0,null,null,null,null,null,null,null,null,null,null,null,""]
["M556",null,null,null,null,null,null,0,null,null,null,null,null,0,null,null,null,null,null,null,null,null,null,null,null,""]
["M557",null,null,null,null,null,null,0,null,null,null,null,null,0,null,null,null,null,null,null,null,null,null,null,null,""]
["M558",null,null,null,null,null,null,0,null,null,null,null,null,0,null,null,null,null,null,null,null,null,null,null,null,""]
["M559",null,null,null,null,null,null,0,null,null,null,null,null,0,null,null,null,null,null,null,null,null,null,null,null,""]
["M560",null,null,null,null,null,null,0,null,null,null,null,null,0,null,null,null,null,null,null,null,null,null,null,null,""]
["M561",null,null,null,null,null,null,0,null,null,null,null,null,0,null,null,null,null,null,null,null,null,null,null,null,""]
["M562",null,null,null,null,null,null,0,null,null,null,null,null,0,null,null,null,null,null,null,null,null,null,null,null,""]
["M563",null,null,null,null,null,null,0,null,null,null,null,null,0,null,null,null,null,null,null,null,null,null,null,null,""]
["M564",null,null,null,null,null,null,0,null,null,null,null,null,0,null,null,null,null,null,null,null,null,null,null,null,""]
["M565",null,null,null,null,null,null,0,null,null,null,null,null,0,null,null,null,null,null,null,null,null,null,null,null,""]
["M566",null,null,null,null,null,null,0,null,null,null,null,null,0,null,null,null,null,null,null,null,null,null,null,null,""]
["M567",null,null,null,null,null,null,0,null,null,null,null,null,0,null,null,null,null,null,null,null,null,null,null,null,""]
["M568",null,null,null,null,null,null,0,null,null,null,null,null,0,null,null,null,null,null,null,null,null,null,null,null,""]
["M569",null,null,null,null,null,null,0,null,null,null,null,null,0,null,null,null,null,null,null,null,null,null,null,null,""]
["M570",null,null,null,null,null,null,0,null,null,null,null,null,0,null,null,null,null,null,null,null,null,null,null,null,""]
["M571",null,null,null,null,null,null,0,null,null,null,null,null,0,null,null,null,null,null,null,null,null,null,null,null,""]
["M572",null,null,null,null,null,null,0,null,null,null,null,null,0,null,null,null,null,null,null,null,null,null,null,null,""]
["M573",null,null,null,null,null,null,0,null,null,null,null,null,0,null,null,null,null,null,null,null,null,null,null,null,""]
["M574",null,null,null,null,null,null,0,null,null,null,null,null,0,null,null,null,null,null,null,null,null,null,null,null,""]
["M575",null,null,null,null,null,null,0,null,null,null,null,null,0,null,null,null,null,null,null,null,null,null,null,null,""]
["M576",null,null,null,null,null,null,0,null,null,null,null,null,0,null,null,null,null,null,null,null,null,null,null,null,{"$f":"SUBSTITUTE(B585,\" \",\"_\")","v":""}]
["M577",null,null,null,null,null,null,0,null,null,null,null,null,{"$f":"IF(I585=\"Sim\",L585*M585,K585*J585)","v":0},null,null,null,null,null,null,null,null,null,null,null,""]
["M578",null,null,null,null,null,null,{"$f":"(E586+F586+G586)/3","v":0},null,null,null,null,null,0,null,null,null,null,null,null,null,null,null,null,null,""]
["M579",null,null,null,null,null,null,0,null,null,null,null,null,0,null,null,null,null,null,null,null,null,null,null,null,""]
["M580",null,null,null,null,null,null,0,null,null,null,null,null,0,null,null,null,null,null,null,null,null,null,null,null,""]
["M581",null,null,null,null,null,null,0,null,null,null,null,null,0,null,null,null,null,null,null,null,null,null,null,null,""]
["M582",null,null,null,null,null,null,0,null,null,null,null,null,0,null,null,null,null,null,null,null,null,null,null,null,""]
["M583",null,null,null,null,null,null,0,null,null,null,null,null,0,null,null,null,null,null,null,null,null,null,null,null,""]
["M584",null,null,null,null,null,null,0,null,null,null,null,null,0,null,null,null,null,null,null,null,null,null,null,null,""]
["M585",null,null,null,null,null,null,0,null,null,null,null,null,0,null,null,null,null,null,null,null,null,null,null,null,""]
["M586",null,null,null,null,null,null,0,null,null,null,null,null,0,null,null,null,null,null,null,null,null,null,null,null,""]
["M587",null,null,null,null,null,null,0,null,null,null,null,null,0,null,null,null,null,null,null,null,null,null,null,null,""]
["M588",null,null,null,null,null,null,0,null,null,null,null,null,0,null,null,null,null,null,null,null,null,null,null,null,""]
["M589",null,null,null,null,null,null,0,null,null,null,null,null,0,null,null,null,null,null,null,null,null,null,null,null,""]
["M590",null,null,null,null,null,null,0,null,null,null,null,null,0,null,null,null,null,null,null,null,null,null,null,null,""]
["M591",null,null,null,null,null,null,0,null,null,null,null,null,0,null,null,null,null,null,null,null,null,null,null,null,""]
["M592",null,null,null,null,null,null,0,null,null,null,null,null,0,null,null,null,null,null,null,null,null,null,null,null,""]
["M593",null,null,null,null,null,null,0,null,null,null,null,null,0,null,null,null,null,null,null,null,null,null,null,null,""]
["M594",null,null,null,null,null,null,0,null,null,null,null,null,0,null,null,null,null,null,null,null,null,null,null,null,""]
["M595",null,null,null,null,null,null,0,null,null,null,null,null,0,null,null,null,null,null,null,null,null,null,null,null,""]
["M596",null,null,null,null,null,null,0,null,null,null,null,null,0,null,null,null,null,null,null,null,null,null,null,null,""]
["M597",null,null,null,null,null,null,0,null,null,null,null,null,0,null,null,null,null,null,null,null,null,null,null,null,""]
["M598",null,null,null,null,null,null,0,null,null,null,null,null,0,null,null,null,null,null,null,null,null,null,null,null,""]
["M599",null,null,null,null,null,null,0,null,null,null,null,null,0,null,null,null,null,null,null,null,null,null,null,null,""]
["M600",null,null,null,null,null,null,0,null,null,null,null,null,0,null,null,null,null,null,null,null,null,null,null,null,""]
["M601",null,null,null,null,null,null,0,null,null,null,null,null,0,null,null,null,null,null,null,null,null,null,null,null,""]
["M602",null,null,null,null,null,null,0,null,null,null,null,null,0,null,null,null,null,null,null,null,null,null,null,null,""]
["M603",null,null,null,null,null,null,0,null,null,null,null,null,0,null,null,null,null,null,null,null,null,null,null,null,""]
["M604",null,null,null,null,null,null,0,null,null,null,null,null,0,null,null,null,null,null,null,null,null,null,null,null,""]
["M605",null,null,null,null,null,null,0,null,null,null,null,null,0,null,null,null,null,null,null,null,null,null,null,null,""]
["M606",null,null,null,null,null,null,0,null,null,null,null,null,0,null,null,null,null,null,null,null,null,null,null,null,""]
["M607",null,null,null,null,null,null,0,null,null,null,null,null,0,null,null,null,null,null,null,null,null,null,null,null,""]
["M608",null,null,null,null,null,null,0,null,null,null,null,null,0,null,null,null,null,null,null,null,null,null,null,null,""]
["M609",null,null,null,null,null,null,0,null,null,null,null,null,0,null,null,null,null,null,null,null,null,null,null,null,""]
["M610",null,null,null,null,null,null,0,null,null,null,null,null,0,null,null,null,null,null,null,null,null,null,null,null,""]
["M611",null,null,null,null,null,null,0,null,null,null,null,null,0,null,null,null,null,null,null,null,null,null,null,null,""]
["M612",null,null,null,null,null,null,0,null,null,null,null,null,0,null,null,null,null,null,null,null,null,null,null,null,""]
["M613",null,null,null,null,null,null,0,null,null,null,null,null,0,null,null,null,null,null,null,null,null,null,null,null,""]
["M614",null,null,null,null,null,null,0,null,null,null,null,null,0,null,null,null,null,null,null,null,null,null,null,null,""]
["M615",null,null,null,null,null,null,0,null,null,null,null,null,0,null,null,null,null,null,null,null,null,null,null,null,""]
["M616",null,null,null,null,null,null,0,null,null,null,null,null,0,null,null,null,null,null,null,null,null,null,null,null,""]
["M617",null,null,null,null,null,null,0,null,null,null,null,null,0,null,null,null,null,null,null,null,null,null,null,null,""]
["M618",null,null,null,null,null,null,0,null,null,null,null,null,0,null,null,null,null,null,null,null,null,null,null,null,""]
["M619",null,null,null,null,null,null,0,null,null,null,null,null,0,null,null,null,null,null,null,null,null,null,null,null,""]
["M620",null,null,null,null,null,null,0,null,null,null,null,null,0,null,null,null,null,null,null,null,null,null,null,null,""]
["M621",null,null,null,null,null,null,0,null,null,null,null,null,0,null,null,null,null,null,null,null,null,null,null,null,""]
["M622",null,null,null,null,null,null,0,null,null,null,null,null,0,null,null,null,null,null,null,null,null,null,null,null,""]
["M623",null,null,null,null,null,null,0,null,null,null,null,null,0,null,null,null,null,null,null,null,null,null,null,null,""]
["M624",null,null,null,null,null,null,0,null,null,null,null,null,0,null,null,null,null,null,null,null,null,null,null,null,""]
["M625",null,null,null,null,null,null,0,null,null,null,null,null,0,null,null,null,null,null,null,null,null,null,null,null,""]
["M626",null,null,null,null,null,null,0,null,null,null,null,null,0,null,null,null,null,null,null,null,null,null,null,null,""]
["M627",null,null,null,null,null,null,0,null,null,null,null,null,0,null,null,null,null,null,null,null,null,null,null,null,""]
["M628",null,null,null,null,null,null,0,null,null,null,null,null,0,null,null,null,null,null,null,null,null,null,null,null,""]
["M629",null,null,null,null,null,null,0,null,null,null,null,null,0,null,null,null,null,null,null,null,null,null,null,null,""]
["M630",null,null,null,null,null,null,0,null,null,null,null,null,0,null,null,null,null,null,null,null,null,null,null,null,""]
["M631",null,null,null,null,null,null,0,null,null,null,null,null,0,null,null,null,null,null,null,null,null,null,null,null,""]
["M632",null,null,null,null,null,null,0,null,null,null,null,null,0,null,null,null,null,null,null,null,null,null,null,null,""]
["M633",null,null,null,null,null,null,0,null,null,null,null,null,0,null,null,null,null,null,null,null,null,null,null,null,""]
["M634",null,null,null,null,null,null,0,null,null,null,null,null,0,null,null,null,null,null,null,null,null,null,null,null,""]
["M635",null,null,null,null,null,null,0,null,null,null,null,null,0,null,null,null,null,null,null,null,null,null,null,null,""]
["M636",null,null,null,null,null,null,0,null,null,null,null,null,0,null,null,null,null,null,null,null,null,null,null,null,""]
["M637",null,null,null,null,null,null,0,null,null,null,null,null,0,null,null,null,null,null,null,null,null,null,null,null,""]
["M638",null,null,null,null,null,null,0,null,null,null,null,null,0,null,null,null,null,null,null,null,null,null,null,null,""]
["M639",null,null,null,null,null,null,0,null,null,null,null,null,0,null,null,null,null,null,null,null,null,null,null,null,""]
["M640",null,null,null,null,null,null,0,null,null,null,null,null,0,null,null,null,null,null,null,null,null,null,null,null,{"$f":"SUBSTITUTE(B649,\" \",\"_\")","v":""}]
["M641",null,null,null,null,null,null,0,null,null,null,null,null,{"$f":"IF(I649=\"Sim\",L649*M649,K649*J649)","v":0},null,null,null,null,null,null,null,null,null,null,null,""]
["M642",null,null,null,null,null,null,{"$f":"(E650+F650+G650)/3","v":0},null,null,null,null,null,0,null,null,null,null,null,null,null,null,null,null,null,""]
["M643",null,null,null,null,null,null,0,null,null,null,null,null,0,null,null,null,null,null,null,null,null,null,null,null,""]
["M644",null,null,null,null,null,null,0,null,null,null,null,null,0,null,null,null,null,null,null,null,null,null,null,null,""]
["M645",null,null,null,null,null,null,0,null,null,null,null,null,0,null,null,null,null,null,null,null,null,null,null,null,""]
["M646",null,null,null,null,null,null,0,null,null,null,null,null,0,null,null,null,null,null,null,null,null,null,null,null,""]
["M647",null,null,null,null,null,null,0,null,null,null,null,null,0,null,null,null,null,null,null,null,null,null,null,null,""]
["M648",null,null,null,null,null,null,0,null,null,null,null,null,0,null,null,null,null,null,null,null,null,null,null,null,""]
["M649",null,null,null,null,null,null,0,null,null,null,null,null,0,null,null,null,null,null,null,null,null,null,null,null,""]
["M650",null,null,null,null,null,null,0,null,null,null,null,null,0,null,null,null,null,null,null,null,null,null,null,null,""]
["M651",null,null,null,null,null,null,0,null,null,null,null,null,0,null,null,null,null,null,null,null,null,null,null,null,""]
["M652",null,null,null,null,null,null,0,null,null,null,null,null,0,null,null,null,null,null,null,null,null,null,null,null,""]
["M653",null,null,null,null,null,null,0,null,null,null,null,null,0,null,null,null,null,null,null,null,null,null,null,null,""]
["M654",null,null,null,null,null,null,0,null,null,null,null,null,0,null,null,null,null,null,null,null,null,null,null,null,""]
["M655",null,null,null,null,null,null,0,null,null,null,null,null,0,null,null,null,null,null,null,null,null,null,null,null,""]
["M656",null,null,null,null,null,null,0,null,null,null,null,null,0,null,null,null,null,null,null,null,null,null,null,null,""]
["M657",null,null,null,null,null,null,0,null,null,null,null,null,0,null,null,null,null,null,null,null,null,null,null,null,""]
["M658",null,null,null,null,null,null,0,null,null,null,null,null,0,null,null,null,null,null,null,null,null,null,null,null,""]
["M659",null,null,null,null,null,null,0,null,null,null,null,null,0,null,null,null,null,null,null,null,null,null,null,null,""]
["M660",null,null,null,null,null,null,0,null,null,null,null,null,0,null,null,null,null,null,null,null,null,null,null,null,""]
["M661",null,null,null,null,null,null,0,null,null,null,null,null,0,null,null,null,null,null,null,null,null,null,null,null,""]
["M662",null,null,null,null,null,null,0,null,null,null,null,null,0,null,null,null,null,null,null,null,null,null,null,null,""]
["M663",null,null,null,null,null,null,0,null,null,null,null,null,0,null,null,null,null,null,null,null,null,null,null,null,""]
["M664",null,null,null,null,null,null,0,null,null,null,null,null,0,null,null,null,null,null,null,null,null,null,null,null,""]
["M665",null,null,null,null,null,null,0,null,null,null,null,null,0,null,null,null,null,null,null,null,null,null,null,null,""]
["M666",null,null,null,null,null,null,0,null,null,null,null,null,0,null,null,null,null,null,null,null,null,null,null,null,""]
["M667",null,null,null,null,null,null,0,null,null,null,null,null,0,null,null,null,null,null,null,null,null,null,null,null,""]
["M668",null,null,null,null,null,null,0,null,null,null,null,null,0,null,null,null,null,null,null,null,null,null,null,null,""]
["M669",null,null,null,null,null,null,0,null,null,null,null,null,0,null,null,null,null,null,null,null,null,null,null,null,""]
["M670",null,null,null,null,null,null,0,null,null,null,null,null,0,null,null,null,null,null,null,null,null,null,null,null,""]
["M671",null,null,null,null,null,null,0,null,null,null,null,null,0,null,null,null,null,null,null,null,null,null,null,null,""]
["M672",null,null,null,null,null,null,0,null,null,null,null,null,0,null,null,null,null,null,null,null,null,null,null,null,""]
["M673",null,null,null,null,null,null,0,null,null,null,null,null,0,null,null,null,null,null,null,null,null,null,null,null,""]
["M674",null,null,null,null,null,null,0,null,null,null,null,null,0,null,null,null,null,null,null,null,null,null,null,null,""]
["M675",null,null,null,null,null,null,0,null,null,null,null,null,0,null,null,null,null,null,null,null,null,null,null,null,""]
["M676",null,null,null,null,null,null,0,null,null,null,null,null,0,null,null,null,null,null,null,null,null,null,null,null,""]
["M677",null,null,null,null,null,null,0,null,null,null,null,null,0,null,null,null,null,null,null,null,null,null,null,null,""]
["M678",null,null,null,null,null,null,0,null,null,null,null,null,0,null,null,null,null,null,null,null,null,null,null,null,""]
["M679",null,null,null,null,null,null,0,null,null,null,null,null,0,null,null,null,null,null,null,null,null,null,null,null,""]
["M680",null,null,null,null,null,null,0,null,null,null,null,null,0,null,null,null,null,null,null,null,null,null,null,null,""]
["M681",null,null,null,null,null,null,0,null,null,null,null,null,0,null,null,null,null,null,null,null,null,null,null,null,""]
["M682",null,null,null,null,null,null,0,null,null,null,null,null,0,null,null,null,null,null,null,null,null,null,null,null,""]
["M683",null,null,null,null,null,null,0,null,null,null,null,null,0,null,null,null,null,null,null,null,null,null,null,null,""]
["M684",null,null,null,null,null,null,0,null,null,null,null,null,0,null,null,null,null,null,null,null,null,null,null,null,""]
["M685",null,null,null,null,null,null,0,null,null,null,null,null,0,null,null,null,null,null,null,null,null,null,null,null,""]
["M686",null,null,null,null,null,null,0,null,null,null,null,null,0,null,null,null,null,null,null,null,null,null,null,null,""]
["M687",null,null,null,null,null,null,0,null,null,null,null,null,0,null,null,null,null,null,null,null,null,null,null,null,""]
["M688",null,null,null,null,null,null,0,null,null,null,null,null,0,null,null,null,null,null,null,null,null,null,null,null,""]
["M689",null,null,null,null,null,null,0,null,null,null,null,null,0,null,null,null,null,null,null,null,null,null,null,null,""]
["M690",null,null,null,null,null,null,0,null,null,null,null,null,0,null,null,null,null,null,null,null,null,null,null,null,""]
["M691",null,null,null,null,null,null,0,null,null,null,null,null,0,null,null,null,null,null,null,null,null,null,null,null,""]
["M692",null,null,null,null,null,null,0,null,null,null,null,null,0,null,null,null,null,null,null,null,null,null,null,null,""]
["M693",null,null,null,null,null,null,0,null,null,null,null,null,0,null,null,null,null,null,null,null,null,null,null,null,""]
["M694",null,null,null,null,null,null,0,null,null,null,null,null,0,null,null,null,null,null,null,null,null,null,null,null,""]
["M695",null,null,null,null,null,null,0,null,null,null,null,null,0,null,null,null,null,null,null,null,null,null,null,null,""]
["M696",null,null,null,null,null,null,0,null,null,null,null,null,0,null,null,null,null,null,null,null,null,null,null,null,""]
["M697",null,null,null,null,null,null,0,null,null,null,null,null,0,null,null,null,null,null,null,null,null,null,null,null,""]
["M698",null,null,null,null,null,null,0,null,null,null,null,null,0,null,null,null,null,null,null,null,null,null,null,null,""]
["M699",null,null,null,null,null,null,0,null,null,null,null,null,0,null,null,null,null,null,null,null,null,null,null,null,""]
["M700",null,null,null,null,null,null,0,null,null,null,null,null,0,null,null,null,null,null,null,null,null,null,null,null,""]
["M701",null,null,null,null,null,null,0,null,null,null,null,null,0,null,null,null,null,null,null,null,null,null,null,null,""]
["M702",null,null,null,null,null,null,0,null,null,null,null,null,0,null,null,null,null,null,null,null,null,null,null,null,""]
["M703",null,null,null,null,null,null,0,null,null,null,null,null,0,null,null,null,null,null,null,null,null,null,null,null,""]
["M704",null,null,null,null,null,null,0,null,null,null,null,null,0,null,null,null,null,null,null,null,null,null,null,null,{"$f":"SUBSTITUTE(B713,\" \",\"_\")","v":""}]
["M705",null,null,null,null,null,null,0,null,null,null,null,null,{"$f":"IF(I713=\"Sim\",L713*M713,K713*J713)","v":0},null,null,null,null,null,null,null,null,null,null,null,""]
["M706",null,null,null,null,null,null,{"$f":"(E714+F714+G714)/3","v":0},null,null,null,null,null,0,null,null,null,null,null,null,null,null,null,null,null,""]
["M707",null,null,null,null,null,null,0,null,null,null,null,null,0,null,null,null,null,null,null,null,null,null,null,null,""]
["M708",null,null,null,null,null,null,0,null,null,null,null,null,0,null,null,null,null,null,null,null,null,null,null,null,""]
["M709",null,null,null,null,null,null,0,null,null,null,null,null,0,null,null,null,null,null,null,null,null,null,null,null,""]
["M710",null,null,null,null,null,null,0,null,null,null,null,null,0,null,null,null,null,null,null,null,null,null,null,null,""]
["M711",null,null,null,null,null,null,0,null,null,null,null,null,0,null,null,null,null,null,null,null,null,null,null,null,""]
["M712",null,null,null,null,null,null,0,null,null,null,null,null,0,null,null,null,null,null,null,null,null,null,null,null,""]
["M713",null,null,null,null,null,null,0,null,null,null,null,null,0,null,null,null,null,null,null,null,null,null,null,null,""]
["M714",null,null,null,null,null,null,0,null,null,null,null,null,0,null,null,null,null,null,null,null,null,null,null,null,""]
["M715",null,null,null,null,null,null,0,null,null,null,null,null,0,null,null,null,null,null,null,null,null,null,null,null,""]
["M716",null,null,null,null,null,null,0,null,null,null,null,null,0,null,null,null,null,null,null,null,null,null,null,null,""]
["M717",null,null,null,null,null,null,0,null,null,null,null,null,0,null,null,null,null,null,null,null,null,null,null,null,""]
["M718",null,null,null,null,null,null,0,null,null,null,null,null,0,null,null,null,null,null,null,null,null,null,null,null,""]
["M719",null,null,null,null,null,null,0,null,null,null,null,null,0,null,null,null,null,null,null,null,null,null,null,null,""]
["M720",null,null,null,null,null,null,0,null,null,null,null,null,0,null,null,null,null,null,null,null,null,null,null,null,""]
["M721",null,null,null,null,null,null,0,null,null,null,null,null,0,null,null,null,null,null,null,null,null,null,null,null,""]
["M722",null,null,null,null,null,null,0,null,null,null,null,null,0,null,null,null,null,null,null,null,null,null,null,null,""]
["M723",null,null,null,null,null,null,0,null,null,null,null,null,0,null,null,null,null,null,null,null,null,null,null,null,""]
["M724",null,null,null,null,null,null,0,null,null,null,null,null,0,null,null,null,null,null,null,null,null,null,null,null,""]
["M725",null,null,null,null,null,null,0,null,null,null,null,null,0,null,null,null,null,null,null,null,null,null,null,null,""]
["M726",null,null,null,null,null,null,0,null,null,null,null,null,0,null,null,null,null,null,null,null,null,null,null,null,""]
["M727",null,null,null,null,null,null,0,null,null,null,null,null,0,null,null,null,null,null,null,null,null,null,null,null,""]
["M728",null,null,null,null,null,null,0,null,null,null,null,null,0,null,null,null,null,null,null,null,null,null,null,null,""]
["M729",null,null,null,null,null,null,0,null,null,null,null,null,0,null,null,null,null,null,null,null,null,null,null,null,""]
["M730",null,null,null,null,null,null,0,null,null,null,null,null,0,null,null,null,null,null,null,null,null,null,null,null,""]
["M731",null,null,null,null,null,null,0,null,null,null,null,null,0,null,null,null,null,null,null,null,null,null,null,null,""]
["M732",null,null,null,null,null,null,0,null,null,null,null,null,0,null,null,null,null,null,null,null,null,null,null,null,""]
["M733",null,null,null,null,null,null,0,null,null,null,null,null,0,null,null,null,null,null,null,null,null,null,null,null,""]
["M734",null,null,null,null,null,null,0,null,null,null,null,null,0,null,null,null,null,null,null,null,null,null,null,null,""]
["M735",null,null,null,null,null,null,0,null,null,null,null,null,0,null,null,null,null,null,null,null,null,null,null,null,""]
["M736",null,null,null,null,null,null,0,null,null,null,null,null,0,null,null,null,null,null,null,null,null,null,null,null,""]
["M737",null,null,null,null,null,null,0,null,null,null,null,null,0,null,null,null,null,null,null,null,null,null,null,null,""]
["M738",null,null,null,null,null,null,0,null,null,null,null,null,0,null,null,null,null,null,null,null,null,null,null,null,""]
["M739",null,null,null,null,null,null,0,null,null,null,null,null,0,null,null,null,null,null,null,null,null,null,null,null,""]
["M740",null,null,null,null,null,null,0,null,null,null,null,null,0,null,null,null,null,null,null,null,null,null,null,null,""]
["M741",null,null,null,null,null,null,0,null,null,null,null,null,0,null,null,null,null,null,null,null,null,null,null,null,""]
["M742",null,null,null,null,null,null,0,null,null,null,null,null,0,null,null,null,null,null,null,null,null,null,null,null,""]
["M743",null,null,null,null,null,null,0,null,null,null,null,null,0,null,null,null,null,null,null,null,null,null,null,null,""]
["M744",null,null,null,null,null,null,0,null,null,null,null,null,0,null,null,null,null,null,null,null,null,null,null,null,""]
["M745",null,null,null,null,null,null,0,null,null,null,null,null,0,null,null,null,null,null,null,null,null,null,null,null,""]
["M746",null,null,null,null,null,null,0,null,null,null,null,null,0,null,null,null,null,null,null,null,null,null,null,null,""]
["M747",null,null,null,null,null,null,0,null,null,null,null,null,0,null,null,null,null,null,null,null,null,null,null,null,""]
["M748",null,null,null,null,null,null,0,null,null,null,null,null,0,null,null,null,null,null,null,null,null,null,null,null,""]
["M749",null,null,null,null,null,null,0,null,null,null,null,null,0,null,null,null,null,null,null,null,null,null,null,null,""]
["M750",null,null,null,null,null,null,0,null,null,null,null,null,0,null,null,null,null,null,null,null,null,null,null,null,""]
["M751",null,null,null,null,null,null,0,null,null,null,null,null,0,null,null,null,null,null,null,null,null,null,null,null,""]
["M752",null,null,null,null,null,null,0,null,null,null,null,null,0,null,null,null,null,null,null,null,null,null,null,null,""]
["M753",null,null,null,null,null,null,0,null,null,null,null,null,0,null,null,null,null,null,null,null,null,null,null,null,""]
["M754",null,null,null,null,null,null,0,null,null,null,null,null,0,null,null,null,null,null,null,null,null,null,null,null,""]
["M755",null,null,null,null,null,null,0,null,null,null,null,null,0,null,null,null,null,null,null,null,null,null,null,null,""]
["M756",null,null,null,null,null,null,0,null,null,null,null,null,0,null,null,null,null,null,null,null,null,null,null,null,""]
["M757",null,null,null,null,null,null,0,null,null,null,null,null,0,null,null,null,null,null,null,null,null,null,null,null,""]
["M758",null,null,null,null,null,null,0,null,null,null,null,null,0,null,null,null,null,null,null,null,null,null,null,null,""]
["M759",null,null,null,null,null,null,0,null,null,null,null,null,0,null,null,null,null,null,null,null,null,null,null,null,""]
["M760",null,null,null,null,null,null,0,null,null,null,null,null,0,null,null,null,null,null,null,null,null,null,null,null,""]
["M761",null,null,null,null,null,null,0,null,null,null,null,null,0,null,null,null,null,null,null,null,null,null,null,null,""]
["M762",null,null,null,null,null,null,0,null,null,null,null,null,0,null,null,null,null,null,null,null,null,null,null,null,""]
["M763",null,null,null,null,null,null,0,null,null,null,null,null,0,null,null,null,null,null,null,null,null,null,null,null,""]
["M764",null,null,null,null,null,null,0,null,null,null,null,null,0,null,null,null,null,null,null,null,null,null,null,null,""]
["M765",null,null,null,null,null,null,0,null,null,null,null,null,0,null,null,null,null,null,null,null,null,null,null,null,""]
["M766",null,null,null,null,null,null,0,null,null,null,null,null,0,null,null,null,null,null,null,null,null,null,null,null,""]
["M767",null,null,null,null,null,null,0,null,null,null,null,null,0,null,null,null,null,null,null,null,null,null,null,null,""]
["M768",null,null,null,null,null,null,0,null,null,null,null,null,0,null,null,null,null,null,null,null,null,null,null,null,{"$f":"SUBSTITUTE(B777,\" \",\"_\")","v":""}]
["M769",null,null,null,null,null,null,0,null,null,null,null,null,{"$f":"IF(I777=\"Sim\",L777*M777,K777*J777)","v":0},null,null,null,null,null,null,null,null,null,null,null,""]
["M770",null,null,null,null,null,null,{"$f":"(E778+F778+G778)/3","v":0},null,null,null,null,null,0,null,null,null,null,null,null,null,null,null,null,null,""]
["M771",null,null,null,null,null,null,0,null,null,null,null,null,0,null,null,null,null,null,null,null,null,null,null,null,""]
["M772",null,null,null,null,null,null,0,null,null,null,null,null,0,null,null,null,null,null,null,null,null,null,null,null,""]
["M773",null,null,null,null,null,null,0,null,null,null,null,null,0,null,null,null,null,null,null,null,null,null,null,null,""]
["M774",null,null,null,null,null,null,0,null,null,null,null,null,0,null,null,null,null,null,null,null,null,null,null,null,""]
["M775",null,null,null,null,null,null,0,null,null,null,null,null,0,null,null,null,null,null,null,null,null,null,null,null,""]
["M776",null,null,null,null,null,null,0,null,null,null,null,null,0,null,null,null,null,null,null,null,null,null,null,null,""]
["M777",null,null,null,null,null,null,0,null,null,null,null,null,0,null,null,null,null,null,null,null,null,null,null,null,""]
["M778",null,null,null,null,null,null,0,null,null,null,null,null,0,null,null,null,null,null,null,null,null,null,null,null,""]
["M779",null,null,null,null,null,null,0,null,null,null,null,null,0,null,null,null,null,null,null,null,null,null,null,null,""]
["M780",null,null,null,null,null,null,0,null,null,null,null,null,0,null,null,null,null,null,null,null,null,null,null,null,""]
["M781",null,null,null,null,null,null,0,null,null,null,null,null,0,null,null,null,null,null,null,null,null,null,null,null,""]
["M782",null,null,null,null,null,null,0,null,null,null,null,null,0,null,null,null,null,null,null,null,null,null,null,null,""]
["M783",null,null,null,null,null,null,0,null,null,null,null,null,0,null,null,null,null,null,null,null,null,null,null,null,""]
["M784",null,null,null,null,null,null,0,null,null,null,null,null,0,null,null,null,null,null,null,null,null,null,null,null,""]
["M785",null,null,null,null,null,null,0,null,null,null,null,null,0,null,null,null,null,null,null,null,null,null,null,null,""]
["M786",null,null,null,null,null,null,0,null,null,null,null,null,0,null,null,null,null,null,null,null,null,null,null,null,""]
["M787",null,null,null,null,null,null,0,null,null,null,null,null,0,null,null,null,null,null,null,null,null,null,null,null,""]
["M788",null,null,null,null,null,null,0,null,null,null,null,null,0,null,null,null,null,null,null,null,null,null,null,null,""]
["M789",null,null,null,null,null,null,0,null,null,null,null,null,0,null,null,null,null,null,null,null,null,null,null,null,""]
["M790",null,null,null,null,null,null,0,null,null,null,null,null,0,null,null,null,null,null,null,null,null,null,null,null,""]
["M791",null,null,null,null,null,null,0,null,null,null,null,null,0,null,null,null,null,null,null,null,null,null,null,null,""]
["M792",null,null,null,null,null,null,0,null,null,null,null,null,0,null,null,null,null,null,null,null,null,null,null,null,""]
["M793",null,null,null,null,null,null,0,null,null,null,null,null,0,null,null,null,null,null,null,null,null,null,null,null,""]
["M794",null,null,null,null,null,null,0,null,null,null,null,null,0,null,null,null,null,null,null,null,null,null,null,null,""]
["M795",null,null,null,null,null,null,0,null,null,null,null,null,0,null,null,null,null,null,null,null,null,null,null,null,""]
["M796",null,null,null,null,null,null,0,null,null,null,null,null,0,null,null,null,null,null,null,null,null,null,null,null,""]
["M797",null,null,null,null,null,null,0,null,null,null,null,null,0,null,null,null,null,null,null,null,null,null,null,null,""]
["M798",null,null,null,null,null,null,0,null,null,null,null,null,0,null,null,null,null,null,null,null,null,null,null,null,""]
["M799",null,null,null,null,null,null,0,null,null,null,null,null,0,null,null,null,null,null,null,null,null,null,null,null,""]
["M800",null,null,null,null,null,null,0,null,null,null,null,null,0,null,null,null,null,null,null,null,null,null,null,null,""]
["M801",null,null,null,null,null,null,0,null,null,null,null,null,0,null,null,null,null,null,null,null,null,null,null,null,""]
["M802",null,null,null,null,null,null,0,null,null,null,null,null,0,null,null,null,null,null,null,null,null,null,null,null,""]
["M803",null,null,null,null,null,null,0,null,null,null,null,null,0,null,null,null,null,null,null,null,null,null,null,null,""]
["M804",null,null,null,null,null,null,0,null,null,null,null,null,0,null,null,null,null,null,null,null,null,null,null,null,""]
["M805",null,null,null,null,null,null,0,null,null,null,null,null,0,null,null,null,null,null,null,null,null,null,null,null,""]
["M806",null,null,null,null,null,null,0,null,null,null,null,null,0,null,null,null,null,null,null,null,null,null,null,null,""]
["M807",null,null,null,null,null,null,0,null,null,null,null,null,0,null,null,null,null,null,null,null,null,null,null,null,""]
["M808",null,null,null,null,null,null,0,null,null,null,null,null,0,null,null,null,null,null,null,null,null,null,null,null,""]
["M809",null,null,null,null,null,null,0,null,null,null,null,null,0,null,null,null,null,null,null,null,null,null,null,null,""]
["M810",null,null,null,null,null,null,0,null,null,null,null,null,0,null,null,null,null,null,null,null,null,null,null,null,""]
["M811",null,null,null,null,null,null,0,null,null,null,null,null,0,null,null,null,null,null,null,null,null,null,null,null,""]
["M812",null,null,null,null,null,null,0,null,null,null,null,null,0,null,null,null,null,null,null,null,null,null,null,null,""]
["M813",null,null,null,null,null,null,0,null,null,null,null,null,0,null,null,null,null,null,null,null,null,null,null,null,""]
["M814",null,null,null,null,null,null,0,null,null,null,null,null,0,null,null,null,null,null,null,null,null,null,null,null,""]
["M815",null,null,null,null,null,null,0,null,null,null,null,null,0,null,null,null,null,null,null,null,null,null,null,null,""]
["M816",null,null,null,null,null,null,0,null,null,null,null,null,0,null,null,null,null,null,null,null,null,null,null,null,""]
["M817",null,null,null,null,null,null,0,null,null,null,null,null,0,null,null,null,null,null,null,null,null,null,null,null,""]
["M818",null,null,null,null,null,null,0,null,null,null,null,null,0,null,null,null,null,null,null,null,null,null,null,null,""]
["M819",null,null,null,null,null,null,0,null,null,null,null,null,0,null,null,null,null,null,null,null,null,null,null,null,""]
["M820",null,null,null,null,null,null,0,null,null,null,null,null,0,null,null,null,null,null,null,null,null,null,null,null,""]
["M821",null,null,null,null,null,null,0,null,null,null,null,null,0,null,null,null,null,null,null,null,null,null,null,null,""]
["M822",null,null,null,null,null,null,0,null,null,null,null,null,0,null,null,null,null,null,null,null,null,null,null,null,""]
["M823",null,null,null,null,null,null,0,null,null,null,null,null,0,null,null,null,null,null,null,null,null,null,null,null,""]
["M824",null,null,null,null,null,null,0,null,null,null,null,null,0,null,null,null,null,null,null,null,null,null,null,null,""]
["M825",null,null,null,null,null,null,0,null,null,null,null,null,0,null,null,null,null,null,null,null,null,null,null,null,""]
["M826",null,null,null,null,null,null,0,null,null,null,null,null,0,null,null,null,null,null,null,null,null,null,null,null,""]
["M827",null,null,null,null,null,null,0,null,null,null,null,null,0,null,null,null,null,null,null,null,null,null,null,null,""]
["M828",null,null,null,null,null,null,0,null,null,null,null,null,0,null,null,null,null,null,null,null,null,null,null,null,""]
["M829",null,null,null,null,null,null,0,null,null,null,null,null,0,null,null,null,null,null,null,null,null,null,null,null,""]
["M830",null,null,null,null,null,null,0,null,null,null,null,null,0,null,null,null,null,null,null,null,null,null,null,null,""]
["M831",null,null,null,null,null,null,0,null,null,null,null,null,0,null,null,null,null,null,null,null,null,null,null,null,""]
["M832",null,null,null,null,null,null,0,null,null,null,null,null,0,null,null,null,null,null,null,null,null,null,null,null,{"$f":"SUBSTITUTE(B841,\" \",\"_\")","v":""}]
["M833",null,null,null,null,null,null,0,null,null,null,null,null,{"$f":"IF(I841=\"Sim\",L841*M841,K841*J841)","v":0},null,null,null,null,null,null,null,null,null,null,null,""]
["M834",null,null,null,null,null,null,{"$f":"(E842+F842+G842)/3","v":0},null,null,null,null,null,0,null,null,null,null,null,null,null,null,null,null,null,""]
["M835",null,null,null,null,null,null,0,null,null,null,null,null,0,null,null,null,null,null,null,null,null,null,null,null,""]
["M836",null,null,null,null,null,null,0,null,null,null,null,null,0,null,null,null,null,null,null,null,null,null,null,null,""]
["M837",null,null,null,null,null,null,0,null,null,null,null,null,0,null,null,null,null,null,null,null,null,null,null,null,""]
["M838",null,null,null,null,null,null,0,null,null,null,null,null,0,null,null,null,null,null,null,null,null,null,null,null,""]
["M839",null,null,null,null,null,null,0,null,null,null,null,null,0,null,null,null,null,null,null,null,null,null,null,null,""]
["M840",null,null,null,null,null,null,0,null,null,null,null,null,0,null,null,null,null,null,null,null,null,null,null,null,""]
["M841",null,null,null,null,null,null,0,null,null,null,null,null,0,null,null,null,null,null,null,null,null,null,null,null,""]
["M842",null,null,null,null,null,null,0,null,null,null,null,null,0,null,null,null,null,null,null,null,null,null,null,null,""]
["M843",null,null,null,null,null,null,0,null,null,null,null,null,0,null,null,null,null,null,null,null,null,null,null,null,""]
["M844",null,null,null,null,null,null,0,null,null,null,null,null,0,null,null,null,null,null,null,null,null,null,null,null,""]
["M845",null,null,null,null,null,null,0,null,null,null,null,null,0,null,null,null,null,null,null,null,null,null,null,null,""]
["M846",null,null,null,null,null,null,0,null,null,null,null,null,0,null,null,null,null,null,null,null,null,null,null,null,""]
["M847",null,null,null,null,null,null,0,null,null,null,null,null,0,null,null,null,null,null,null,null,null,null,null,null,""]
["M848",null,null,null,null,null,null,0,null,null,null,null,null,0,null,null,null,null,null,null,null,null,null,null,null,""]
["M849",null,null,null,null,null,null,0,null,null,null,null,null,0,null,null,null,null,null,null,null,null,null,null,null,""]
["M850",null,null,null,null,null,null,0,null,null,null,null,null,0,null,null,null,null,null,null,null,null,null,null,null,""]
["M851",null,null,null,null,null,null,0,null,null,null,null,null,0,null,null,null,null,null,null,null,null,null,null,null,""]
["M852",null,null,null,null,null,null,0,null,null,null,null,null,0,null,null,null,null,null,null,null,null,null,null,null,""]
["M853",null,null,null,null,null,null,0,null,null,null,null,null,0,null,null,null,null,null,null,null,null,null,null,null,""]
["M854",null,null,null,null,null,null,0,null,null,null,null,null,0,null,null,null,null,null,null,null,null,null,null,null,""]
["M855",null,null,null,null,null,null,0,null,null,null,null,null,0,null,null,null,null,null,null,null,null,null,null,null,""]
["M856",null,null,null,null,null,null,0,null,null,null,null,null,0,null,null,null,null,null,null,null,null,null,null,null,""]
["M857",null,null,null,null,null,null,0,null,null,null,null,null,0,null,null,null,null,null,null,null,null,null,null,null,""]
["M858",null,null,null,null,null,null,0,null,null,null,null,null,0,null,null,null,null,null,null,null,null,null,null,null,""]
["M859",null,null,null,null,null,null,0,null,null,null,null,null,0,null,null,null,null,null,null,null,null,null,null,null,""]
["M860",null,null,null,null,null,null,0,null,null,null,null,null,0,null,null,null,null,null,null,null,null,null,null,null,""]
["M861",null,null,null,null,null,null,0,null,null,null,null,null,0,null,null,null,null,null,null,null,null,null,null,null,""]
["M862",null,null,null,null,null,null,0,null,null,null,null,null,0,null,null,null,null,null,null,null,null,null,null,null,""]
["M863",null,null,null,null,null,null,0,null,null,null,null,null,0,null,null,null,null,null,null,null,null,null,null,null,""]
["M864",null,null,null,null,null,null,0,null,null,null,null,null,0,null,null,null,null,null,null,null,null,null,null,null,""]
["M865",null,null,null,null,null,null,0,null,null,null,null,null,0,null,null,null,null,null,null,null,null,null,null,null,""]
["M866",null,null,null,null,null,null,0,null,null,null,null,null,0,null,null,null,null,null,null,null,null,null,null,null,""]
["M867",null,null,null,null,null,null,0,null,null,null,null,null,0,null,null,null,null,null,null,null,null,null,null,null,""]
["M868",null,null,null,null,null,null,0,null,null,null,null,null,0,null,null,null,null,null,null,null,null,null,null,null,""]
["M869",null,null,null,null,null,null,0,null,null,null,null,null,0,null,null,null,null,null,null,null,null,null,null,null,""]
["M870",null,null,null,null,null,null,0,null,null,null,null,null,0,null,null,null,null,null,null,null,null,null,null,null,""]
["M871",null,null,null,null,null,null,0,null,null,null,null,null,0,null,null,null,null,null,null,null,null,null,null,null,""]
["M872",null,null,null,null,null,null,0,null,null,null,null,null,0,null,null,null,null,null,null,null,null,null,null,null,""]
["M873",null,null,null,null,null,null,0,null,null,null,null,null,0,null,null,null,null,null,null,null,null,null,null,null,""]
["M874",null,null,null,null,null,null,0,null,null,null,null,null,0,null,null,null,null,null,null,null,null,null,null,null,""]
["M875",null,null,null,null,null,null,0,null,null,null,null,null,0,null,null,null,null,null,null,null,null,null,null,null,""]
["M876",null,null,null,null,null,null,0,null,null,null,null,null,0,null,null,null,null,null,null,null,null,null,null,null,""]
["M877",null,null,null,null,null,null,0,null,null,null,null,null,0,null,null,null,null,null,null,null,null,null,null,null,""]
["M878",null,null,null,null,null,null,0,null,null,null,null,null,0,null,null,null,null,null,null,null,null,null,null,null,""]
["M879",null,null,null,null,null,null,0,null,null,null,null,null,0,null,null,null,null,null,null,null,null,null,null,null,""]
["M880",null,null,null,null,null,null,0,null,null,null,null,null,0,null,null,null,null,null,null,null,null,null,null,null,""]
["M881",null,null,null,null,null,null,0,null,null,null,null,null,0,null,null,null,null,null,null,null,null,null,null,null,""]
["M882",null,null,null,null,null,null,0,null,null,null,null,null,0,null,null,null,null,null,null,null,null,null,null,null,""]
["M883",null,null,null,null,null,null,0,null,null,null,null,null,0,null,null,null,null,null,null,null,null,null,null,null,""]
["M884",null,null,null,null,null,null,0,null,null,null,null,null,0,null,null,null,null,null,null,null,null,null,null,null,""]
["M885",null,null,null,null,null,null,0,null,null,null,null,null,0,null,null,null,null,null,null,null,null,null,null,null,""]
["M886",null,null,null,null,null,null,0,null,null,null,null,null,0,null,null,null,null,null,null,null,null,null,null,null,""]
["M887",null,null,null,null,null,null,0,null,null,null,null,null,0,null,null,null,null,null,null,null,null,null,null,null,""]
["M888",null,null,null,null,null,null,0,null,null,null,null,null,0,null,null,null,null,null,null,null,null,null,null,null,""]
["M889",null,null,null,null,null,null,0,null,null,null,null,null,0,null,null,null,null,null,null,null,null,null,null,null,""]
["M890",null,null,null,null,null,null,0,null,null,null,null,null,0,null,null,null,null,null,null,null,null,null,null,null,""]
["M891",null,null,null,null,null,null,0,null,null,null,null,null,0,null,null,null,null,null,null,null,null,null,null,null,""]
["M892",null,null,null,null,null,null,0,null,null,null,null,null,0,null,null,null,null,null,null,null,null,null,null,null,""]
["M893",null,null,null,null,null,null,0,null,null,null,null,null,0,null,null,null,null,null,null,null,null,null,null,null,""]
["M894",null,null,null,null,null,null,0,null,null,null,null,null,0,null,null,null,null,null,null,null,null,null,null,null,""]
["M895",null,null,null,null,null,null,0,null,null,null,null,null,0,null,null,null,null,null,null,null,null,null,null,null,""]
["M896",null,null,null,null,null,null,0,null,null,null,null,null,0,null,null,null,null,null,null,null,null,null,null,null,{"$f":"SUBSTITUTE(B905,\" \",\"_\")","v":""}]
["M897",null,null,null,null,null,null,0,null,null,null,null,null,{"$f":"IF(I905=\"Sim\",L905*M905,K905*J905)","v":0},null,null,null,null,null,null,null,null,null,null,null,""]
["M898",null,null,null,null,null,null,{"$f":"(E906+F906+G906)/3","v":0},null,null,null,null,null,0,null,null,null,null,null,null,null,null,null,null,null,""]
["M899",null,null,null,null,null,null,0,null,null,null,null,null,0,null,null,null,null,null,null,null,null,null,null,null,""]
["M900",null,null,null,null,null,null,0,null,null,null,null,null,0,null,null,null,null,null,null,null,null,null,null,null,""]
["M901",null,null,null,null,null,null,0,null,null,null,null,null,0,null,null,null,null,null,null,null,null,null,null,null,""]
["M902",null,null,null,null,null,null,0,null,null,null,null,null,0,null,null,null,null,null,null,null,null,null,null,null,""]
["M903",null,null,null,null,null,null,0,null,null,null,null,null,0,null,null,null,null,null,null,null,null,null,null,null,""]
["M904",null,null,null,null,null,null,0,null,null,null,null,null,0,null,null,null,null,null,null,null,null,null,null,null,""]
["M905",null,null,null,null,null,null,0,null,null,null,null,null,0,null,null,null,null,null,null,null,null,null,null,null,""]
["M906",null,null,null,null,null,null,0,null,null,null,null,null,0,null,null,null,null,null,null,null,null,null,null,null,""]
["M907",null,null,null,null,null,null,0,null,null,null,null,null,0,null,null,null,null,null,null,null,null,null,null,null,""]
["M908",null,null,null,null,null,null,0,null,null,null,null,null,0,null,null,null,null,null,null,null,null,null,null,null,""]
["M909",null,null,null,null,null,null,0,null,null,null,null,null,0,null,null,null,null,null,null,null,null,null,null,null,""]
["M910",null,null,null,null,null,null,0,null,null,null,null,null,0,null,null,null,null,null,null,null,null,null,null,null,""]
["M911",null,null,null,null,null,null,0,null,null,null,null,null,0,null,null,null,null,null,null,null,null,null,null,null,""]
["M912",null,null,null,null,null,null,0,null,null,null,null,null,0,null,null,null,null,null,null,null,null,null,null,null,""]
["M913",null,null,null,null,null,null,0,null,null,null,null,null,0,null,null,null,null,null,null,null,null,null,null,null,""]
["M914",null,null,null,null,null,null,0,null,null,null,null,null,0,null,null,null,null,null,null,null,null,null,null,null,""]
["M915",null,null,null,null,null,null,0,null,null,null,null,null,0,null,null,null,null,null,null,null,null,null,null,null,""]
["M916",null,null,null,null,null,null,0,null,null,null,null,null,0,null,null,null,null,null,null,null,null,null,null,null,""]
["M917",null,null,null,null,null,null,0,null,null,null,null,null,0,null,null,null,null,null,null,null,null,null,null,null,""]
["M918",null,null,null,null,null,null,0,null,null,null,null,null,0,null,null,null,null,null,null,null,null,null,null,null,""]
["M919",null,null,null,null,null,null,0,null,null,null,null,null,0,null,null,null,null,null,null,null,null,null,null,null,""]
["M920",null,null,null,null,null,null,0,null,null,null,null,null,0,null,null,null,null,null,null,null,null,null,null,null,""]
["M921",null,null,null,null,null,null,0,null,null,null,null,null,0,null,null,null,null,null,null,null,null,null,null,null,""]
["M922",null,null,null,null,null,null,0,null,null,null,null,null,0,null,null,null,null,null,null,null,null,null,null,null,""]
["M923",null,null,null,null,null,null,0,null,null,null,null,null,0,null,null,null,null,null,null,null,null,null,null,null,""]
["M924",null,null,null,null,null,null,0,null,null,null,null,null,0,null,null,null,null,null,null,null,null,null,null,null,""]
["M925",null,null,null,null,null,null,0,null,null,null,null,null,0,null,null,null,null,null,null,null,null,null,null,null,""]
["M926",null,null,null,null,null,null,0,null,null,null,null,null,0,null,null,null,null,null,null,null,null,null,null,null,""]
["M927",null,null,null,null,null,null,0,null,null,null,null,null,0,null,null,null,null,null,null,null,null,null,null,null,""]
["M928",null,null,null,null,null,null,0,null,null,null,null,null,0,null,null,null,null,null,null,null,null,null,null,null,""]
["M929",null,null,null,null,null,null,0,null,null,null,null,null,0,null,null,null,null,null,null,null,null,null,null,null,""]
["M930",null,null,null,null,null,null,0,null,null,null,null,null,0,null,null,null,null,null,null,null,null,null,null,null,""]
["M931",null,null,null,null,null,null,0,null,null,null,null,null,0,null,null,null,null,null,null,null,null,null,null,null,""]
["M932",null,null,null,null,null,null,0,null,null,null,null,null,0,null,null,null,null,null,null,null,null,null,null,null,""]
["M933",null,null,null,null,null,null,0,null,null,null,null,null,0,null,null,null,null,null,null,null,null,null,null,null,""]
["M934",null,null,null,null,null,null,0,null,null,null,null,null,0,null,null,null,null,null,null,null,null,null,null,null,""]
["M935",null,null,null,null,null,null,0,null,null,null,null,null,0,null,null,null,null,null,null,null,null,null,null,null,""]
["M936",null,null,null,null,null,null,0,null,null,null,null,null,0,null,null,null,null,null,null,null,null,null,null,null,""]
["M937",null,null,null,null,null,null,0,null,null,null,null,null,0,null,null,null,null,null,null,null,null,null,null,null,""]
["M938",null,null,null,null,null,null,0,null,null,null,null,null,0,null,null,null,null,null,null,null,null,null,null,null,""]
["M939",null,null,null,null,null,null,0,null,null,null,null,null,0,null,null,null,null,null,null,null,null,null,null,null,""]
["M940",null,null,null,null,null,null,0,null,null,null,null,null,0,null,null,null,null,null,null,null,null,null,null,null,""]
["M941",null,null,null,null,null,null,0,null,null,null,null,null,0,null,null,null,null,null,null,null,null,null,null,null,""]
["M942",null,null,null,null,null,null,0,null,null,null,null,null,0,null,null,null,null,null,null,null,null,null,null,null,""]
["M943",null,null,null,null,null,null,0,null,null,null,null,null,0,null,null,null,null,null,null,null,null,null,null,null,""]
["M944",null,null,null,null,null,null,0,null,null,null,null,null,0,null,null,null,null,null,null,null,null,null,null,null,""]
["M945",null,null,null,null,null,null,0,null,null,null,null,null,0,null,null,null,null,null,null,null,null,null,null,null,""]
["M946",null,null,null,null,null,null,0,null,null,null,null,null,0,null,null,null,null,null,null,null,null,null,null,null,""]
["M947",null,null,null,null,null,null,0,null,null,null,null,null,0,null,null,null,null,null,null,null,null,null,null,null,""]
["M948",null,null,null,null,null,null,0,null,null,null,null,null,0,null,null,null,null,null,null,null,null,null,null,null,""]
["M949",null,null,null,null,null,null,0,null,null,null,null,null,0,null,null,null,null,null,null,null,null,null,null,null,""]
["M950",null,null,null,null,null,null,0,null,null,null,null,null,0,null,null,null,null,null,null,null,null,null,null,null,""]
["M951",null,null,null,null,null,null,0,null,null,null,null,null,0,null,null,null,null,null,null,null,null,null,null,null,""]
["M952",null,null,null,null,null,null,0,null,null,null,null,null,0,null,null,null,null,null,null,null,null,null,null,null,""]
["M953",null,null,null,null,null,null,0,null,null,null,null,null,0,null,null,null,null,null,null,null,null,null,null,null,""]
["M954",null,null,null,null,null,null,0,null,null,null,null,null,0,null,null,null,null,null,null,null,null,null,null,null,""]
["M955",null,null,null,null,null,null,0,null,null,null,null,null,0,null,null,null,null,null,null,null,null,null,null,null,""]
["M956",null,null,null,null,null,null,0,null,null,null,null,null,0,null,null,null,null,null,null,null,null,null,null,null,""]
["M957",null,null,null,null,null,null,0,null,null,null,null,null,0,null,null,null,null,null,null,null,null,null,null,null,""]
["M958",null,null,null,null,null,null,0,null,null,null,null,null,0,null,null,null,null,null,null,null,null,null,null,null,""]
["M959",null,null,null,null,null,null,0,null,null,null,null,null,0,null,null,null,null,null,null,null,null,null,null,null,""]
["M960",null,null,null,null,null,null,0,null,null,null,null,null,0,null,null,null,null,null,null,null,null,null,null,null,{"$f":"SUBSTITUTE(B969,\" \",\"_\")","v":""}]
["M961",null,null,null,null,null,null,0,null,null,null,null,null,{"$f":"IF(I969=\"Sim\",L969*M969,K969*J969)","v":0},null,null,null,null,null,null,null,null,null,null,null,""]
["M962",null,null,null,null,null,null,{"$f":"(E970+F970+G970)/3","v":0},null,null,null,null,null,0,null,null,null,null,null,null,null,null,null,null,null,""]
["M963",null,null,null,null,null,null,0,null,null,null,null,null,0,null,null,null,null,null,null,null,null,null,null,null,""]
["M964",null,null,null,null,null,null,0,null,null,null,null,null,0,null,null,null,null,null,null,null,null,null,null,null,""]
["M965",null,null,null,null,null,null,0,null,null,null,null,null,0,null,null,null,null,null,null,null,null,null,null,null,""]
["M966",null,null,null,null,null,null,0,null,null,null,null,null,0,null,null,null,null,null,null,null,null,null,null,null,""]
["M967",null,null,null,null,null,null,0,null,null,null,null,null,0,null,null,null,null,null,null,null,null,null,null,null,""]
["M968",null,null,null,null,null,null,0,null,null,null,null,null,0,null,null,null,null,null,null,null,null,null,null,null,""]
["M969",null,null,null,null,null,null,0,null,null,null,null,null,0,null,null,null,null,null,null,null,null,null,null,null,""]
["M970",null,null,null,null,null,null,0,null,null,null,null,null,0,null,null,null,null,null,null,null,null,null,null,null,""]
["M971",null,null,null,null,null,null,0,null,null,null,null,null,0,null,null,null,null,null,null,null,null,null,null,null,""]
["M972",null,null,null,null,null,null,0,null,null,null,null,null,0,null,null,null,null,null,null,null,null,null,null,null,""]
["M973",null,null,null,null,null,null,0,null,null,null,null,null,0,null,null,null,null,null,null,null,null,null,null,null,""]
["M974",null,null,null,null,null,null,0,null,null,null,null,null,0,null,null,null,null,null,null,null,null,null,null,null,""]
["M975",null,null,null,null,null,null,0,null,null,null,null,null,0,null,null,null,null,null,null,null,null,null,null,null,""]
["M976",null,null,null,null,null,null,0,null,null,null,null,null,0,null,null,null,null,null,null,null,null,null,null,null,""]
["M977",null,null,null,null,null,null,0,null,null,null,null,null,0,null,null,null,null,null,null,null,null,null,null,null,""]
["M978",null,null,null,null,null,null,0,null,null,null,null,null,0,null,null,null,null,null,null,null,null,null,null,null,""]
["M979",null,null,null,null,null,null,0,null,null,null,null,null,0,null,null,null,null,null,null,null,null,null,null,null,""]
["M980",null,null,null,null,null,null,0,null,null,null,null,null,0,null,null,null,null,null,null,null,null,null,null,null,""]
["M981",null,null,null,null,null,null,0,null,null,null,null,null,0,null,null,null,null,null,null,null,null,null,null,null,""]
["M982",null,null,null,null,null,null,0,null,null,null,null,null,0,null,null,null,null,null,null,null,null,null,null,null,""]
["M983",null,null,null,null,null,null,0,null,null,null,null,null,0,null,null,null,null,null,null,null,null,null,null,null,""]
["M984",null,null,null,null,null,null,0,null,null,null,null,null,0,null,null,null,null,null,null,null,null,null,null,null,""]
["M985",null,null,null,null,null,null,0,null,null,null,null,null,0,null,null,null,null,null,null,null,null,null,null,null,""]
["M986",null,null,null,null,null,null,0,null,null,null,null,null,0,null,null,null,null,null,null,null,null,null,null,null,""]
["M987",null,null,null,null,null,null,0,null,null,null,null,null,0,null,null,null,null,null,null,null,null,null,null,null,""]
["M988",null,null,null,null,null,null,0,null,null,null,null,null,0,null,null,null,null,null,null,null,null,null,null,null,""]
["M989",null,null,null,null,null,null,0,null,null,null,null,null,0,null,null,null,null,null,null,null,null,null,null,null,""]
["M990",null,null,null,null,null,null,0,null,null,null,null,null,0,null,null,null,null,null,null,null,null,null,null,null,""]
["M991",null,null,null,null,null,null,0,null,null,null,null,null,0,null,null,null,null,null,null,null,null,null,null,null,""]
["M992",null,null,null,null,null,null,0,null,null,null,null,null,0,null,null,null,null,null,null,null,null,null,null,null,""]
["M993",null,null,null,null,null,null,0,null,null,null,null,null,0,null,null,null,null,null,null,null,null,null,null,null,""]
["M994",null,null,null,null,null,null,0,null,null,null,null,null,0,null,null,null,null,null,null,null,null,null,null,null,""]
["M995",null,null,null,null,null,null,0,null,null,null,null,null,0,null,null,null,null,null,null,null,null,null,null,null,""]
["M996",null,null,null,null,null,null,0,null,null,null,null,null,0,null,null,null,null,null,null,null,null,null,null,null,""]
["M997",null,null,null,null,null,null,0,null,null,null,null,null,0,null,null,null,null,null,null,null,null,null,null,null,""]
["M998",null,null,null,null,null,null,0,null,null,null,null,null,0,null,null,null,null,null,null,null,null,null,null,null,""]
["M999",null,null,null,null,null,null,0,null,null,null,null,null,0,null,null,null,null,null,null,null,null,null,null,null,""]
["M1000",null,null,null,null,null,null,0,null,null,null,null,null,0,null,null,null,null,null,null,null,null,null,null,null,""]
["TOTAL MATERIAIS",null,null,null,null,null,null,null,null,null,null,null,null,{"$f":"SUM(N9:N1008)","v":0},null,null,null,null,null,null,null,null,null,null,null,""]
["SERVIÇOS",null,null,null,null,null,null,null,null,null,null,null,null,null,null,null,null,null,null,null,null,null,null,null,null,""]
["S1",null,null,null,null,null,null,0,null,null,null,null,null,{"$f":"IF(I1011=\"Sim\",L1011*M1011,K1011*J1011)","v":0},null,null,null,null,null,null,null,null,null,null,null,""]
["S2",null,null,null,null,null,null,0,null,null,null,null,null,0,null,null,null,null,null,null,null,null,null,null,null,""]
["S3",null,null,null,null,null,null,0,null,null,null,null,null,0,null,null,null,null,null,null,null,null,null,null,null,""]
["S4",null,null,null,null,null,null,0,null,null,null,null,null,0,null,null,null,null,null,null,null,null,null,null,null,""]
["S5",null,null,null,null,null,null,0,null,null,null,null,null,0,null,null,null,null,null,null,null,null,null,null,null,""]
["S6",null,null,null,null,null,null,0,null,null,null,null,null,0,null,null,null,null,null,null,null,null,null,null,null,""]
["S7",null,null,null,null,null,null,0,null,null,null,null,null,0,null,null,null,null,null,null,null,null,null,null,null,""]
["S8",null,null,null,null,null,null,0,null,null,null,null,null,0,null,null,null,null,null,null,null,null,null,null,null,""]
["S9",null,null,null,null,null,null,0,null,null,null,null,null,0,null,null,null,null,null,null,null,null,null,null,null,""]
["S10",null,null,null,null,null,null,0,null,null,null,null,null,0,null,null,null,null,null,null,null,null,null,null,null,""]
["S11",null,null,null,null,null,null,0,null,null,null,null,null,0,null,null,null,null,null,null,null,null,null,null,null,""]
["S12",null,null,null,null,null,null,0,null,null,null,null,null,0,null,null,null,null,null,null,null,null,null,null,null,""]
["S13",null,null,null,null,null,null,0,null,null,null,null,null,0,null,null,null,null,null,null,null,null,null,null,null,""]
["S14",null,null,null,null,null,null,0,null,null,null,null,null,0,null,null,null,null,null,null,null,null,null,null,null,""]
["S15",null,null,null,null,null,null,0,null,null,null,null,null,0,null,null,null,null,null,null,null,null,null,null,null,""]
["S16",null,null,null,null,null,null,0,null,null,null,null,null,0,null,null,null,null,null,null,null,null,null,null,null,""]
["S17",null,null,null,null,null,null,0,null,null,null,null,null,0,null,null,null,null,null,null,null,null,null,null,null,""]
["S18",null,null,null,null,null,null,0,null,null,null,null,null,0,null,null,null,null,null,null,null,null,null,null,null,""]
["S19",null,null,null,null,null,null,0,null,null,null,null,null,0,null,null,null,null,null,null,null,null,null,null,null,""]
["S20",null,null,null,null,null,null,0,null,null,null,null,null,0,null,null,null,null,null,null,null,null,null,null,null,""]
["S21",null,null,null,null,null,null,0,null,null,null,null,null,0,null,null,null,null,null,null,null,null,null,null,null,""]
["S22",null,null,null,null,null,null,0,null,null,null,null,null,0,null,null,null,null,null,null,null,null,null,null,null,{"$f":"SUBSTITUTE(B1033,\" \",\"_\")","v":""}]
["S23",null,null,null,null,null,null,0,null,null,null,null,null,0,null,null,null,null,null,null,null,null,null,null,null,""]
["S24",null,null,null,null,null,null,{"$f":"(E1034+F1034+G1034)/3","v":0},null,null,null,null,null,0,null,null,null,null,null,null,null,null,null,null,null,""]
["S25",null,null,null,null,null,null,0,null,null,null,null,null,0,null,null,null,null,null,null,null,null,null,null,null,""]
["S26",null,null,null,null,null,null,0,null,null,null,null,null,0,null,null,null,null,null,null,null,null,null,null,null,""]
["S27",null,null,null,null,null,null,0,null,null,null,null,null,0,null,null,null,null,null,null,null,null,null,null,null,""]
["S28",null,null,null,null,null,null,0,null,null,null,null,null,0,null,null,null,null,null,null,null,null,null,null,null,""]
["S29",null,null,null,null,null,null,0,null,null,null,null,null,0,null,null,null,null,null,null,null,null,null,null,null,""]
["S30",null,null,null,null,null,null,0,null,null,null,null,null,0,null,null,null,null,null,null,null,null,null,null,null,""]
["S31",null,null,null,null,null,null,0,null,null,null,null,null,0,null,null,null,null,null,null,null,null,null,null,null,""]
["S32",null,null,null,null,null,null,0,null,null,null,null,null,0,null,null,null,null,null,null,null,null,null,null,null,""]
["S33",null,null,null,null,null,null,0,null,null,null,null,null,0,null,null,null,null,null,null,null,null,null,null,null,""]
["S34",null,null,null,null,null,null,0,null,null,null,null,null,0,null,null,null,null,null,null,null,null,null,null,null,""]
["S35",null,null,null,null,null,null,0,null,null,null,null,null,0,null,null,null,null,null,null,null,null,null,null,null,""]
["S36",null,null,null,null,null,null,0,null,null,null,null,null,0,null,null,null,null,null,null,null,null,null,null,null,""]
["S37",null,null,null,null,null,null,0,null,null,null,null,null,0,null,null,null,null,null,null,null,null,null,null,null,""]
["S38",null,null,null,null,null,null,0,null,null,null,null,null,0,null,null,null,null,null,null,null,null,null,null,null,""]
["S39",null,null,null,null,null,null,0,null,null,null,null,null,0,null,null,null,null,null,null,null,null,null,null,null,""]
["S40",null,null,null,null,null,null,0,null,null,null,null,null,0,null,null,null,null,null,null,null,null,null,null,null,""]
["S41",null,null,null,null,null,null,0,null,null,null,null,null,0,null,null,null,null,null,null,null,null,null,null,null,""]
["S42",null,null,null,null,null,null,0,null,null,null,null,null,0,null,null,null,null,null,null,null,null,null,null,null,""]
["S43",null,null,null,null,null,null,0,null,null,null,null,null,0,null,null,null,null,null,null,null,null,null,null,null,""]
["S44",null,null,null,null,null,null,0,null,null,null,null,null,0,null,null,null,null,null,null,null,null,null,null,null,""]
["S45",null,null,null,null,null,null,0,null,null,null,null,null,0,null,null,null,null,null,null,null,null,null,null,null,""]
["S46",null,null,null,null,null,null,0,null,null,null,null,null,0,null,null,null,null,null,null,null,null,null,null,null,""]
["S47",null,null,null,null,null,null,0,null,null,null,null,null,0,null,null,null,null,null,null,null,null,null,null,null,""]
["S48",null,null,null,null,null,null,0,null,null,null,null,null,0,null,null,null,null,null,null,null,null,null,null,null,""]
["S49",null,null,null,null,null,null,0,null,null,null,null,null,0,null,null,null,null,null,null,null,null,null,null,null,""]
["S50",null,null,null,null,null,null,0,null,null,null,null,null,0,null,null,null,null,null,null,null,null,null,null,null,""]
["S51",null,null,null,null,null,null,0,null,null,null,null,null,0,null,null,null,null,null,null,null,null,null,null,null,""]
["S52",null,null,null,null,null,null,0,null,null,null,null,null,0,null,null,null,null,null,null,null,null,null,null,null,""]
["S53",null,null,null,null,null,null,0,null,null,null,null,null,0,null,null,null,null,null,null,null,null,null,null,null,""]
["S54",null,null,null,null,null,null,0,null,null,null,null,null,0,null,null,null,null,null,null,null,null,null,null,null,""]
["S55",null,null,null,null,null,null,0,null,null,null,null,null,0,null,null,null,null,null,null,null,null,null,null,null,""]
["S56",null,null,null,null,null,null,0,null,null,null,null,null,0,null,null,null,null,null,null,null,null,null,null,null,""]
["S57",null,null,null,null,null,null,0,null,null,null,null,null,0,null,null,null,null,null,null,null,null,null,null,null,""]
["S58",null,null,null,null,null,null,0,null,null,null,null,null,0,null,null,null,null,null,null,null,null,null,null,null,""]
["S59",null,null,null,null,null,null,0,null,null,null,null,null,0,null,null,null,null,null,null,null,null,null,null,null,""]
["S60",null,null,null,null,null,null,0,null,null,null,null,null,0,null,null,null,null,null,null,null,null,null,null,null,""]
["S61",null,null,null,null,null,null,0,null,null,null,null,null,0,null,null,null,null,null,null,null,null,null,null,null,""]
["S62",null,null,null,null,null,null,0,null,null,null,null,null,0,null,null,null,null,null,null,null,null,null,null,null,""]
["S63",null,null,null,null,null,null,0,null,null,null,null,null,0,null,null,null,null,null,null,null,null,null,null,null,""]
["S64",null,null,null,null,null,null,0,null,null,null,null,null,0,null,null,null,null,null,null,null,null,null,null,null,""]
["S65",null,null,null,null,null,null,0,null,null,null,null,null,{"$f":"IF(I1075=\"Sim\",L1075*M1075,K1075*J1075)","v":0},null,null,null,null,null,null,null,null,null,null,null,""]
["S66",null,null,null,null,null,null,0,null,null,null,null,null,0,null,null,null,null,null,null,null,null,null,null,null,""]
["S67",null,null,null,null,null,null,0,null,null,null,null,null,0,null,null,null,null,null,null,null,null,null,null,null,""]
["S68",null,null,null,null,null,null,0,null,null,null,null,null,0,null,null,null,null,null,null,null,null,null,null,null,""]
["S69",null,null,null,null,null,null,0,null,null,null,null,null,0,null,null,null,null,null,null,null,null,null,null,null,""]
["S70",null,null,null,null,null,null,0,null,null,null,null,null,0,null,null,null,null,null,null,null,null,null,null,null,""]
["S71",null,null,null,null,null,null,0,null,null,null,null,null,0,null,null,null,null,null,null,null,null,null,null,null,""]
["S72",null,null,null,null,null,null,0,null,null,null,null,null,0,null,null,null,null,null,null,null,null,null,null,null,""]
["S73",null,null,null,null,null,null,0,null,null,null,null,null,0,null,null,null,null,null,null,null,null,null,null,null,""]
["S74",null,null,null,null,null,null,0,null,null,null,null,null,0,null,null,null,null,null,null,null,null,null,null,null,""]
["S75",null,null,null,null,null,null,0,null,null,null,null,null,0,null,null,null,null,null,null,null,null,null,null,null,""]
["S76",null,null,null,null,null,null,0,null,null,null,null,null,0,null,null,null,null,null,null,null,null,null,null,null,""]
["S77",null,null,null,null,null,null,0,null,null,null,null,null,0,null,null,null,null,null,null,null,null,null,null,null,""]
["S78",null,null,null,null,null,null,0,null,null,null,null,null,0,null,null,null,null,null,null,null,null,null,null,null,""]
["S79",null,null,null,null,null,null,0,null,null,null,null,null,0,null,null,null,null,null,null,null,null,null,null,null,""]
["S80",null,null,null,null,null,null,0,null,null,null,null,null,0,null,null,null,null,null,null,null,null,null,null,null,""]
["S81",null,null,null,null,null,null,0,null,null,null,null,null,0,null,null,null,null,null,null,null,null,null,null,null,""]
["S82",null,null,null,null,null,null,0,null,null,null,null,null,0,null,null,null,null,null,null,null,null,null,null,null,""]
["S83",null,null,null,null,null,null,0,null,null,null,null,null,0,null,null,null,null,null,null,null,null,null,null,null,""]
["S84",null,null,null,null,null,null,0,null,null,null,null,null,0,null,null,null,null,null,null,null,null,null,null,null,""]
["S85",null,null,null,null,null,null,0,null,null,null,null,null,0,null,null,null,null,null,null,null,null,null,null,null,""]
["S86",null,null,null,null,null,null,0,null,null,null,null,null,0,null,null,null,null,null,null,null,null,null,null,null,{"$f":"SUBSTITUTE(B1097,\" \",\"_\")","v":""}]
["S87",null,null,null,null,null,null,0,null,null,null,null,null,0,null,null,null,null,null,null,null,null,null,null,null,""]
["S88",null,null,null,null,null,null,{"$f":"(E1098+F1098+G1098)/3","v":0},null,null,null,null,null,0,null,null,null,null,null,null,null,null,null,null,null,""]
["S89",null,null,null,null,null,null,0,null,null,null,null,null,0,null,null,null,null,null,null,null,null,null,null,null,""]
["S90",null,null,null,null,null,null,0,null,null,null,null,null,0,null,null,null,null,null,null,null,null,null,null,null,""]
["S91",null,null,null,null,null,null,0,null,null,null,null,null,0,null,null,null,null,null,null,null,null,null,null,null,""]
["S92",null,null,null,null,null,null,0,null,null,null,null,null,0,null,null,null,null,null,null,null,null,null,null,null,""]
["S93",null,null,null,null,null,null,0,null,null,null,null,null,0,null,null,null,null,null,null,null,null,null,null,null,""]
["S94",null,null,null,null,null,null,0,null,null,null,null,null,0,null,null,null,null,null,null,null,null,null,null,null,""]
["S95",null,null,null,null,null,null,0,null,null,null,null,null,0,null,null,null,null,null,null,null,null,null,null,null,""]
["S96",null,null,null,null,null,null,0,null,null,null,null,null,0,null,null,null,null,null,null,null,null,null,null,null,""]
["S97",null,null,null,null,null,null,0,null,null,null,null,null,0,null,null,null,null,null,null,null,null,null,null,null,""]
["S98",null,null,null,null,null,null,0,null,null,null,null,null,0,null,null,null,null,null,null,null,null,null,null,null,""]
["S99",null,null,null,null,null,null,0,null,null,null,null,null,0,null,null,null,null,null,null,null,null,null,null,null,""]
["S100",null,null,null,null,null,null,0,null,null,null,null,null,0,null,null,null,null,null,null,null,null,null,null,null,""]
["S101",null,null,null,null,null,null,0,null,null,null,null,null,0,null,null,null,null,null,null,null,null,null,null,null,""]
["S102",null,null,null,null,null,null,0,null,null,null,null,null,0,null,null,null,null,null,null,null,null,null,null,null,""]
["S103",null,null,null,null,null,null,0,null,null,null,null,null,0,null,null,null,null,null,null,null,null,null,null,null,""]
["S104",null,null,null,null,null,null,0,null,null,null,null,null,0,null,null,null,null,null,null,null,null,null,null,null,""]
["S105",null,null,null,null,null,null,0,null,null,null,null,null,0,null,null,null,null,null,null,null,null,null,null,null,""]
["S106",null,null,null,null,null,null,0,null,null,null,null,null,0,null,null,null,null,null,null,null,null,null,null,null,""]
["S107",null,null,null,null,null,null,0,null,null,null,null,null,0,null,null,null,null,null,null,null,null,null,null,null,""]
["S108",null,null,null,null,null,null,0,null,null,null,null,null,0,null,null,null,null,null,null,null,null,null,null,null,""]
["S109",null,null,null,null,null,null,0,null,null,null,null,null,0,null,null,null,null,null,null,null,null,null,null,null,""]
["S110",null,null,null,null,null,null,0,null,null,null,null,null,0,null,null,null,null,null,null,null,null,null,null,null,""]
["S111",null,null,null,null,null,null,0,null,null,null,null,null,0,null,null,null,null,null,null,null,null,null,null,null,""]
["S112",null,null,null,null,null,null,0,null,null,null,null,null,0,null,null,null,null,null,null,null,null,null,null,null,""]
["S113",null,null,null,null,null,null,0,null,null,null,null,null,0,null,null,null,null,null,null,null,null,null,null,null,""]
["S114",null,null,null,null,null,null,0,null,null,null,null,null,0,null,null,null,null,null,null,null,null,null,null,null,""]
["S115",null,null,null,null,null,null,0,null,null,null,null,null,0,null,null,null,null,null,null,null,null,null,null,null,""]
["S116",null,null,null,null,null,null,0,null,null,null,null,null,0,null,null,null,null,null,null,null,null,null,null,null,""]
["S117",null,null,null,null,null,null,0,null,null,null,null,null,0,null,null,null,null,null,null,null,null,null,null,null,""]
["S118",null,null,null,null,null,null,0,null,null,null,null,null,0,null,null,null,null,null,null,null,null,null,null,null,""]
["S119",null,null,null,null,null,null,0,null,null,null,null,null,0,null,null,null,null,null,null,null,null,null,null,null,""]
["S120",null,null,null,null,null,null,0,null,null,null,null,null,0,null,null,null,null,null,null,null,null,null,null,null,""]
["S121",null,null,null,null,null,null,0,null,null,null,null,null,0,null,null,null,null,null,null,null,null,null,null,null,""]
["S122",null,null,null,null,null,null,0,null,null,null,null,null,0,null,null,null,null,null,null,null,null,null,null,null,""]
["S123",null,null,null,null,null,null,0,null,null,null,null,null,0,null,null,null,null,null,null,null,null,null,null,null,""]
["S124",null,null,null,null,null,null,0,null,null,null,null,null,0,null,null,null,null,null,null,null,null,null,null,null,""]
["S125",null,null,null,null,null,null,0,null,null,null,null,null,0,null,null,null,null,null,null,null,null,null,null,null,""]
["S126",null,null,null,null,null,null,0,null,null,null,null,null,0,null,null,null,null,null,null,null,null,null,null,null,""]
["S127",null,null,null,null,null,null,0,null,null,null,null,null,0,null,null,null,null,null,null,null,null,null,null,null,""]
["S128",null,null,null,null,null,null,0,null,null,null,null,null,0,null,null,null,null,null,null,null,null,null,null,null,""]
["S129",null,null,null,null,null,null,0,null,null,null,null,null,{"$f":"IF(I1139=\"Sim\",L1139*M1139,K1139*J1139)","v":0},null,null,null,null,null,null,null,null,null,null,null,""]
["S130",null,null,null,null,null,null,0,null,null,null,null,null,0,null,null,null,null,null,null,null,null,null,null,null,""]
["S131",null,null,null,null,null,null,0,null,null,null,null,null,0,null,null,null,null,null,null,null,null,null,null,null,""]
["S132",null,null,null,null,null,null,0,null,null,null,null,null,0,null,null,null,null,null,null,null,null,null,null,null,""]
["S133",null,null,null,null,null,null,0,null,null,null,null,null,0,null,null,null,null,null,null,null,null,null,null,null,""]
["S134",null,null,null,null,null,null,0,null,null,null,null,null,0,null,null,null,null,null,null,null,null,null,null,null,""]
["S135",null,null,null,null,null,null,0,null,null,null,null,null,0,null,null,null,null,null,null,null,null,null,null,null,""]
["S136",null,null,null,null,null,null,0,null,null,null,null,null,0,null,null,null,null,null,null,null,null,null,null,null,""]
["S137",null,null,null,null,null,null,0,null,null,null,null,null,0,null,null,null,null,null,null,null,null,null,null,null,""]
["S138",null,null,null,null,null,null,0,null,null,null,null,null,0,null,null,null,null,null,null,null,null,null,null,null,""]
["S139",null,null,null,null,null,null,0,null,null,null,null,null,0,null,null,null,null,null,null,null,null,null,null,null,""]
["S140",null,null,null,null,null,null,0,null,null,null,null,null,0,null,null,null,null,null,null,null,null,null,null,null,""]
["S141",null,null,null,null,null,null,0,null,null,null,null,null,0,null,null,null,null,null,null,null,null,null,null,null,""]
["S142",null,null,null,null,null,null,0,null,null,null,null,null,0,null,null,null,null,null,null,null,null,null,null,null,""]
["S143",null,null,null,null,null,null,0,null,null,null,null,null,0,null,null,null,null,null,null,null,null,null,null,null,""]
["S144",null,null,null,null,null,null,0,null,null,null,null,null,0,null,null,null,null,null,null,null,null,null,null,null,""]
["S145",null,null,null,null,null,null,0,null,null,null,null,null,0,null,null,null,null,null,null,null,null,null,null,null,""]
["S146",null,null,null,null,null,null,0,null,null,null,null,null,0,null,null,null,null,null,null,null,null,null,null,null,""]
["S147",null,null,null,null,null,null,0,null,null,null,null,null,0,null,null,null,null,null,null,null,null,null,null,null,""]
["S148",null,null,null,null,null,null,0,null,null,null,null,null,0,null,null,null,null,null,null,null,null,null,null,null,""]
["S149",null,null,null,null,null,null,0,null,null,null,null,null,0,null,null,null,null,null,null,null,null,null,null,null,""]
["S150",null,null,null,null,null,null,0,null,null,null,null,null,0,null,null,null,null,null,null,null,null,null,null,null,{"$f":"SUBSTITUTE(B1161,\" \",\"_\")","v":""}]
["S151",null,null,null,null,null,null,0,null,null,null,null,null,0,null,null,null,null,null,null,null,null,null,null,null,""]
["S152",null,null,null,null,null,null,{"$f":"(E1162+F1162+G1162)/3","v":0},null,null,null,null,null,0,null,null,null,null,null,null,null,null,null,null,null,""]
["S153",null,null,null,null,null,null,0,null,null,null,null,null,0,null,null,null,null,null,null,null,null,null,null,null,""]
["S154",null,null,null,null,null,null,0,null,null,null,null,null,0,null,null,null,null,null,null,null,null,null,null,null,""]
["S155",null,null,null,null,null,null,0,null,null,null,null,null,0,null,null,null,null,null,null,null,null,null,null,null,""]
["S156",null,null,null,null,null,null,0,null,null,null,null,null,0,null,null,null,null,null,null,null,null,null,null,null,""]
["S157",null,null,null,null,null,null,0,null,null,null,null,null,0,null,null,null,null,null,null,null,null,null,null,null,""]
["S158",null,null,null,null,null,null,0,null,null,null,null,null,0,null,null,null,null,null,null,null,null,null,null,null,""]
["S159",null,null,null,null,null,null,0,null,null,null,null,null,0,null,null,null,null,null,null,null,null,null,null,null,""]
["S160",null,null,null,null,null,null,0,null,null,null,null,null,0,null,null,null,null,null,null,null,null,null,null,null,""]
["S161",null,null,null,null,null,null,0,null,null,null,null,null,0,null,null,null,null,null,null,null,null,null,null,null,""]
["S162",null,null,null,null,null,null,0,null,null,null,null,null,0,null,null,null,null,null,null,null,null,null,null,null,""]
["S163",null,null,null,null,null,null,0,null,null,null,null,null,0,null,null,null,null,null,null,null,null,null,null,null,""]
["S164",null,null,null,null,null,null,0,null,null,null,null,null,0,null,null,null,null,null,null,null,null,null,null,null,""]
["S165",null,null,null,null,null,null,0,null,null,null,null,null,0,null,null,null,null,null,null,null,null,null,null,null,""]
["S166",null,null,null,null,null,null,0,null,null,null,null,null,0,null,null,null,null,null,null,null,null,null,null,null,""]
["S167",null,null,null,null,null,null,0,null,null,null,null,null,0,null,null,null,null,null,null,null,null,null,null,null,""]
["S168",null,null,null,null,null,null,0,null,null,null,null,null,0,null,null,null,null,null,null,null,null,null,null,null,""]
["S169",null,null,null,null,null,null,0,null,null,null,null,null,0,null,null,null,null,null,null,null,null,null,null,null,""]
["S170",null,null,null,null,null,null,0,null,null,null,null,null,0,null,null,null,null,null,null,null,null,null,null,null,""]
["S171",null,null,null,null,null,null,0,null,null,null,null,null,0,null,null,null,null,null,null,null,null,null,null,null,""]
["S172",null,null,null,null,null,null,0,null,null,null,null,null,0,null,null,null,null,null,null,null,null,null,null,null,""]
["S173",null,null,null,null,null,null,0,null,null,null,null,null,0,null,null,null,null,null,null,null,null,null,null,null,""]
["S174",null,null,null,null,null,null,0,null,null,null,null,null,0,null,null,null,null,null,null,null,null,null,null,null,""]
["S175",null,null,null,null,null,null,0,null,null,null,null,null,0,null,null,null,null,null,null,null,null,null,null,null,""]
["S176",null,null,null,null,null,null,0,null,null,null,null,null,0,null,null,null,null,null,null,null,null,null,null,null,""]
["S177",null,null,null,null,null,null,0,null,null,null,null,null,0,null,null,null,null,null,null,null,null,null,null,null,""]
["S178",null,null,null,null,null,null,0,null,null,null,null,null,0,null,null,null,null,null,null,null,null,null,null,null,""]
["S179",null,null,null,null,null,null,0,null,null,null,null,null,0,null,null,null,null,null,null,null,null,null,null,null,""]
["S180",null,null,null,null,null,null,0,null,null,null,null,null,0,null,null,null,null,null,null,null,null,null,null,null,""]
["S181",null,null,null,null,null,null,0,null,null,null,null,null,0,null,null,null,null,null,null,null,null,null,null,null,""]
["S182",null,null,null,null,null,null,0,null,null,null,null,null,0,null,null,null,null,null,null,null,null,null,null,null,""]
["S183",null,null,null,null,null,null,0,null,null,null,null,null,0,null,null,null,null,null,null,null,null,null,null,null,""]
["S184",null,null,null,null,null,null,0,null,null,null,null,null,0,null,null,null,null,null,null,null,null,null,null,null,""]
["S185",null,null,null,null,null,null,0,null,null,null,null,null,0,null,null,null,null,null,null,null,null,null,null,null,""]
["S186",null,null,null,null,null,null,0,null,null,null,null,null,0,null,null,null,null,null,null,null,null,null,null,null,""]
["S187",null,null,null,null,null,null,0,null,null,null,null,null,0,null,null,null,null,null,null,null,null,null,null,null,""]
["S188",null,null,null,null,null,null,0,null,null,null,null,null,0,null,null,null,null,null,null,null,null,null,null,null,""]
["S189",null,null,null,null,null,null,0,null,null,null,null,null,0,null,null,null,null,null,null,null,null,null,null,null,""]
["S190",null,null,null,null,null,null,0,null,null,null,null,null,0,null,null,null,null,null,null,null,null,null,null,null,""]
["S191",null,null,null,null,null,null,0,null,null,null,null,null,0,null,null,null,null,null,null,null,null,null,null,null,""]
["S192",null,null,null,null,null,null,0,null,null,null,null,null,0,null,null,null,null,null,null,null,null,null,null,null,""]
["S193",null,null,null,null,null,null,0,null,null,null,null,null,{"$f":"IF(I1203=\"Sim\",L1203*M1203,K1203*J1203)","v":0},null,null,null,null,null,null,null,null,null,null,null,""]
["S194",null,null,null,null,null,null,0,null,null,null,null,null,0,null,null,null,null,null,null,null,null,null,null,null,""]
["S195",null,null,null,null,null,null,0,null,null,null,null,null,0,null,null,null,null,null,null,null,null,null,null,null,""]
["S196",null,null,null,null,null,null,0,null,null,null,null,null,0,null,null,null,null,null,null,null,null,null,null,null,""]
["S197",null,null,null,null,null,null,0,null,null,null,null,null,0,null,null,null,null,null,null,null,null,null,null,null,""]
["S198",null,null,null,null,null,null,0,null,null,null,null,null,0,null,null,null,null,null,null,null,null,null,null,null,""]
["S199",null,null,null,null,null,null,0,null,null,null,null,null,0,null,null,null,null,null,null,null,null,null,null,null,""]
["S200",null,null,null,null,null,null,0,null,null,null,null,null,0,null,null,null,null,null,null,null,null,null,null,null,""]
["S201",null,null,null,null,null,null,0,null,null,null,null,null,0,null,null,null,null,null,null,null,null,null,null,null,""]
["S202",null,null,null,null,null,null,0,null,null,null,null,null,0,null,null,null,null,null,null,null,null,null,null,null,""]
["S203",null,null,null,null,null,null,0,null,null,null,null,null,0,null,null,null,null,null,null,null,null,null,null,null,""]
["S204",null,null,null,null,null,null,0,null,null,null,null,null,0,null,null,null,null,null,null,null,null,null,null,null,""]
["S205",null,null,null,null,null,null,0,null,null,null,null,null,0,null,null,null,null,null,null,null,null,null,null,null,""]
["S206",null,null,null,null,null,null,0,null,null,null,null,null,0,null,null,null,null,null,null,null,null,null,null,null,""]
["S207",null,null,null,null,null,null,0,null,null,null,null,null,0,null,null,null,null,null,null,null,null,null,null,null,""]
["S208",null,null,null,null,null,null,0,null,null,null,null,null,0,null,null,null,null,null,null,null,null,null,null,null,""]
["S209",null,null,null,null,null,null,0,null,null,null,null,null,0,null,null,null,null,null,null,null,null,null,null,null,""]
["S210",null,null,null,null,null,null,0,null,null,null,null,null,0,null,null,null,null,null,null,null,null,null,null,null,""]
["S211",null,null,null,null,null,null,0,null,null,null,null,null,0,null,null,null,null,null,null,null,null,null,null,null,""]
["S212",null,null,null,null,null,null,0,null,null,null,null,null,0,null,null,null,null,null,null,null,null,null,null,null,""]
["S213",null,null,null,null,null,null,0,null,null,null,null,null,0,null,null,null,null,null,null,null,null,null,null,null,""]
["S214",null,null,null,null,null,null,0,null,null,null,null,null,0,null,null,null,null,null,null,null,null,null,null,null,{"$f":"SUBSTITUTE(B1225,\" \",\"_\")","v":""}]
["S215",null,null,null,null,null,null,0,null,null,null,null,null,0,null,null,null,null,null,null,null,null,null,null,null,""]
["S216",null,null,null,null,null,null,{"$f":"(E1226+F1226+G1226)/3","v":0},null,null,null,null,null,0,null,null,null,null,null,null,null,null,null,null,null,""]
["S217",null,null,null,null,null,null,0,null,null,null,null,null,0,null,null,null,null,null,null,null,null,null,null,null,""]
["S218",null,null,null,null,null,null,0,null,null,null,null,null,0,null,null,null,null,null,null,null,null,null,null,null,""]
["S219",null,null,null,null,null,null,0,null,null,null,null,null,0,null,null,null,null,null,null,null,null,null,null,null,""]
["S220",null,null,null,null,null,null,0,null,null,null,null,null,0,null,null,null,null,null,null,null,null,null,null,null,""]
["S221",null,null,null,null,null,null,0,null,null,null,null,null,0,null,null,null,null,null,null,null,null,null,null,null,""]
["S222",null,null,null,null,null,null,0,null,null,null,null,null,0,null,null,null,null,null,null,null,null,null,null,null,""]
["S223",null,null,null,null,null,null,0,null,null,null,null,null,0,null,null,null,null,null,null,null,null,null,null,null,""]
["S224",null,null,null,null,null,null,0,null,null,null,null,null,0,null,null,null,null,null,null,null,null,null,null,null,""]
["S225",null,null,null,null,null,null,0,null,null,null,null,null,0,null,null,null,null,null,null,null,null,null,null,null,""]
["S226",null,null,null,null,null,null,0,null,null,null,null,null,0,null,null,null,null,null,null,null,null,null,null,null,""]
["S227",null,null,null,null,null,null,0,null,null,null,null,null,0,null,null,null,null,null,null,null,null,null,null,null,""]
["S228",null,null,null,null,null,null,0,null,null,null,null,null,0,null,null,null,null,null,null,null,null,null,null,null,""]
["S229",null,null,null,null,null,null,0,null,null,null,null,null,0,null,null,null,null,null,null,null,null,null,null,null,""]
["S230",null,null,null,null,null,null,0,null,null,null,null,null,0,null,null,null,null,null,null,null,null,null,null,null,""]
["S231",null,null,null,null,null,null,0,null,null,null,null,null,0,null,null,null,null,null,null,null,null,null,null,null,""]
["S232",null,null,null,null,null,null,0,null,null,null,null,null,0,null,null,null,null,null,null,null,null,null,null,null,""]
["S233",null,null,null,null,null,null,0,null,null,null,null,null,0,null,null,null,null,null,null,null,null,null,null,null,""]
["S234",null,null,null,null,null,null,0,null,null,null,null,null,0,null,null,null,null,null,null,null,null,null,null,null,""]
["S235",null,null,null,null,null,null,0,null,null,null,null,null,0,null,null,null,null,null,null,null,null,null,null,null,""]
["S236",null,null,null,null,null,null,0,null,null,null,null,null,0,null,null,null,null,null,null,null,null,null,null,null,""]
["S237",null,null,null,null,null,null,0,null,null,null,null,null,0,null,null,null,null,null,null,null,null,null,null,null,""]
["S238",null,null,null,null,null,null,0,null,null,null,null,null,0,null,null,null,null,null,null,null,null,null,null,null,""]
["S239",null,null,null,null,null,null,0,null,null,null,null,null,0,null,null,null,null,null,null,null,null,null,null,null,""]
["S240",null,null,null,null,null,null,0,null,null,null,null,null,0,null,null,null,null,null,null,null,null,null,null,null,""]
["S241",null,null,null,null,null,null,0,null,null,null,null,null,0,null,null,null,null,null,null,null,null,null,null,null,""]
["S242",null,null,null,null,null,null,0,null,null,null,null,null,0,null,null,null,null,null,null,null,null,null,null,null,""]
["S243",null,null,null,null,null,null,0,null,null,null,null,null,0,null,null,null,null,null,null,null,null,null,null,null,""]
["S244",null,null,null,null,null,null,0,null,null,null,null,null,0,null,null,null,null,null,null,null,null,null,null,null,""]
["S245",null,null,null,null,null,null,0,null,null,null,null,null,0,null,null,null,null,null,null,null,null,null,null,null,""]
["S246",null,null,null,null,null,null,0,null,null,null,null,null,0,null,null,null,null,null,null,null,null,null,null,null,""]
["S247",null,null,null,null,null,null,0,null,null,null,null,null,0,null,null,null,null,null,null,null,null,null,null,null,""]
["S248",null,null,null,null,null,null,0,null,null,null,null,null,0,null,null,null,null,null,null,null,null,null,null,null,""]
["S249",null,null,null,null,null,null,0,null,null,null,null,null,0,null,null,null,null,null,null,null,null,null,null,null,""]
["S250",null,null,null,null,null,null,0,null,null,null,null,null,0,null,null,null,null,null,null,null,null,null,null,null,""]
["S251",null,null,null,null,null,null,0,null,null,null,null,null,0,null,null,null,null,null,null,null,null,null,null,null,""]
["S252",null,null,null,null,null,null,0,null,null,null,null,null,0,null,null,null,null,null,null,null,null,null,null,null,""]
["S253",null,null,null,null,null,null,0,null,null,null,null,null,0,null,null,null,null,null,null,null,null,null,null,null,""]
["S254",null,null,null,null,null,null,0,null,null,null,null,null,0,null,null,null,null,null,null,null,null,null,null,null,""]
["S255",null,null,null,null,null,null,0,null,null,null,null,null,0,null,null,null,null,null,null,null,null,null,null,null,""]
["S256",null,null,null,null,null,null,0,null,null,null,null,null,0,null,null,null,null,null,null,null,null,null,null,null,""]
["S257",null,null,null,null,null,null,0,null,null,null,null,null,{"$f":"IF(I1267=\"Sim\",L1267*M1267,K1267*J1267)","v":0},null,null,null,null,null,null,null,null,null,null,null,""]
["S258",null,null,null,null,null,null,0,null,null,null,null,null,0,null,null,null,null,null,null,null,null,null,null,null,""]
["S259",null,null,null,null,null,null,0,null,null,null,null,null,0,null,null,null,null,null,null,null,null,null,null,null,""]
["S260",null,null,null,null,null,null,0,null,null,null,null,null,0,null,null,null,null,null,null,null,null,null,null,null,""]
["S261",null,null,null,null,null,null,0,null,null,null,null,null,0,null,null,null,null,null,null,null,null,null,null,null,""]
["S262",null,null,null,null,null,null,0,null,null,null,null,null,0,null,null,null,null,null,null,null,null,null,null,null,""]
["S263",null,null,null,null,null,null,0,null,null,null,null,null,0,null,null,null,null,null,null,null,null,null,null,null,""]
["S264",null,null,null,null,null,null,0,null,null,null,null,null,0,null,null,null,null,null,null,null,null,null,null,null,""]
["S265",null,null,null,null,null,null,0,null,null,null,null,null,0,null,null,null,null,null,null,null,null,null,null,null,""]
["S266",null,null,null,null,null,null,0,null,null,null,null,null,0,null,null,null,null,null,null,null,null,null,null,null,""]
["S267",null,null,null,null,null,null,0,null,null,null,null,null,0,null,null,null,null,null,null,null,null,null,null,null,""]
["S268",null,null,null,null,null,null,0,null,null,null,null,null,0,null,null,null,null,null,null,null,null,null,null,null,""]
["S269",null,null,null,null,null,null,0,null,null,null,null,null,0,null,null,null,null,null,null,null,null,null,null,null,""]
["S270",null,null,null,null,null,null,0,null,null,null,null,null,0,null,null,null,null,null,null,null,null,null,null,null,""]
["S271",null,null,null,null,null,null,0,null,null,null,null,null,0,null,null,null,null,null,null,null,null,null,null,null,""]
["S272",null,null,null,null,null,null,0,null,null,null,null,null,0,null,null,null,null,null,null,null,null,null,null,null,""]
["S273",null,null,null,null,null,null,0,null,null,null,null,null,0,null,null,null,null,null,null,null,null,null,null,null,""]
["S274",null,null,null,null,null,null,0,null,null,null,null,null,0,null,null,null,null,null,null,null,null,null,null,null,""]
["S275",null,null,null,null,null,null,0,null,null,null,null,null,0,null,null,null,null,null,null,null,null,null,null,null,""]
["S276",null,null,null,null,null,null,0,null,null,null,null,null,0,null,null,null,null,null,null,null,null,null,null,null,""]
["S277",null,null,null,null,null,null,0,null,null,null,null,null,0,null,null,null,null,null,null,null,null,null,null,null,""]
["S278",null,null,null,null,null,null,0,null,null,null,null,null,0,null,null,null,null,null,null,null,null,null,null,null,{"$f":"SUBSTITUTE(B1289,\" \",\"_\")","v":""}]
["S279",null,null,null,null,null,null,0,null,null,null,null,null,0,null,null,null,null,null,null,null,null,null,null,null,""]
["S280",null,null,null,null,null,null,{"$f":"(E1290+F1290+G1290)/3","v":0},null,null,null,null,null,0,null,null,null,null,null,null,null,null,null,null,null,""]
["S281",null,null,null,null,null,null,0,null,null,null,null,null,0,null,null,null,null,null,null,null,null,null,null,null,""]
["S282",null,null,null,null,null,null,0,null,null,null,null,null,0,null,null,null,null,null,null,null,null,null,null,null,""]
["S283",null,null,null,null,null,null,0,null,null,null,null,null,0,null,null,null,null,null,null,null,null,null,null,null,""]
["S284",null,null,null,null,null,null,0,null,null,null,null,null,0,null,null,null,null,null,null,null,null,null,null,null,""]
["S285",null,null,null,null,null,null,0,null,null,null,null,null,0,null,null,null,null,null,null,null,null,null,null,null,""]
["S286",null,null,null,null,null,null,0,null,null,null,null,null,0,null,null,null,null,null,null,null,null,null,null,null,""]
["S287",null,null,null,null,null,null,0,null,null,null,null,null,0,null,null,null,null,null,null,null,null,null,null,null,""]
["S288",null,null,null,null,null,null,0,null,null,null,null,null,0,null,null,null,null,null,null,null,null,null,null,null,""]
["S289",null,null,null,null,null,null,0,null,null,null,null,null,0,null,null,null,null,null,null,null,null,null,null,null,""]
["S290",null,null,null,null,null,null,0,null,null,null,null,null,0,null,null,null,null,null,null,null,null,null,null,null,""]
["S291",null,null,null,null,null,null,0,null,null,null,null,null,0,null,null,null,null,null,null,null,null,null,null,null,""]
["S292",null,null,null,null,null,null,0,null,null,null,null,null,0,null,null,null,null,null,null,null,null,null,null,null,""]
["S293",null,null,null,null,null,null,0,null,null,null,null,null,0,null,null,null,null,null,null,null,null,null,null,null,""]
["S294",null,null,null,null,null,null,0,null,null,null,null,null,0,null,null,null,null,null,null,null,null,null,null,null,""]
["S295",null,null,null,null,null,null,0,null,null,null,null,null,0,null,null,null,null,null,null,null,null,null,null,null,""]
["S296",null,null,null,null,null,null,0,null,null,null,null,null,0,null,null,null,null,null,null,null,null,null,null,null,""]
["S297",null,null,null,null,null,null,0,null,null,null,null,null,0,null,null,null,null,null,null,null,null,null,null,null,""]
["S298",null,null,null,null,null,null,0,null,null,null,null,null,0,null,null,null,null,null,null,null,null,null,null,null,""]
["S299",null,null,null,null,null,null,0,null,null,null,null,null,0,null,null,null,null,null,null,null,null,null,null,null,""]
["S300",null,null,null,null,null,null,0,null,null,null,null,null,0,null,null,null,null,null,null,null,null,null,null,null,""]
["S301",null,null,null,null,null,null,0,null,null,null,null,null,0,null,null,null,null,null,null,null,null,null,null,null,""]
["S302",null,null,null,null,null,null,0,null,null,null,null,null,0,null,null,null,null,null,null,null,null,null,null,null,""]
["S303",null,null,null,null,null,null,0,null,null,null,null,null,0,null,null,null,null,null,null,null,null,null,null,null,""]
["S304",null,null,null,null,null,null,0,null,null,null,null,null,0,null,null,null,null,null,null,null,null,null,null,null,""]
["S305",null,null,null,null,null,null,0,null,null,null,null,null,0,null,null,null,null,null,null,null,null,null,null,null,""]
["S306",null,null,null,null,null,null,0,null,null,null,null,null,0,null,null,null,null,null,null,null,null,null,null,null,""]
["S307",null,null,null,null,null,null,0,null,null,null,null,null,0,null,null,null,null,null,null,null,null,null,null,null,""]
["S308",null,null,null,null,null,null,0,null,null,null,null,null,0,null,null,null,null,null,null,null,null,null,null,null,""]
["S309",null,null,null,null,null,null,0,null,null,null,null,null,0,null,null,null,null,null,null,null,null,null,null,null,""]
["S310",null,null,null,null,null,null,0,null,null,null,null,null,0,null,null,null,null,null,null,null,null,null,null,null,""]
["S311",null,null,null,null,null,null,0,null,null,null,null,null,0,null,null,null,null,null,null,null,null,null,null,null,""]
["S312",null,null,null,null,null,null,0,null,null,null,null,null,0,null,null,null,null,null,null,null,null,null,null,null,""]
["S313",null,null,null,null,null,null,0,null,null,null,null,null,0,null,null,null,null,null,null,null,null,null,null,null,""]
["S314",null,null,null,null,null,null,0,null,null,null,null,null,0,null,null,null,null,null,null,null,null,null,null,null,""]
["S315",null,null,null,null,null,null,0,null,null,null,null,null,0,null,null,null,null,null,null,null,null,null,null,null,""]
["S316",null,null,null,null,null,null,0,null,null,null,null,null,0,null,null,null,null,null,null,null,null,null,null,null,""]
["S317",null,null,null,null,null,null,0,null,null,null,null,null,0,null,null,null,null,null,null,null,null,null,null,null,""]
["S318",null,null,null,null,null,null,0,null,null,null,null,null,0,null,null,null,null,null,null,null,null,null,null,null,""]
["S319",null,null,null,null,null,null,0,null,null,null,null,null,0,null,null,null,null,null,null,null,null,null,null,null,""]
["S320",null,null,null,null,null,null,0,null,null,null,null,null,0,null,null,null,null,null,null,null,null,null,null,null,""]
["S321",null,null,null,null,null,null,0,null,null,null,null,null,{"$f":"IF(I1331=\"Sim\",L1331*M1331,K1331*J1331)","v":0},null,null,null,null,null,null,null,null,null,null,null,""]
["S322",null,null,null,null,null,null,0,null,null,null,null,null,0,null,null,null,null,null,null,null,null,null,null,null,""]
["S323",null,null,null,null,null,null,0,null,null,null,null,null,0,null,null,null,null,null,null,null,null,null,null,null,""]
["S324",null,null,null,null,null,null,0,null,null,null,null,null,0,null,null,null,null,null,null,null,null,null,null,null,""]
["S325",null,null,null,null,null,null,0,null,null,null,null,null,0,null,null,null,null,null,null,null,null,null,null,null,""]
["S326",null,null,null,null,null,null,0,null,null,null,null,null,0,null,null,null,null,null,null,null,null,null,null,null,""]
["S327",null,null,null,null,null,null,0,null,null,null,null,null,0,null,null,null,null,null,null,null,null,null,null,null,""]
["S328",null,null,null,null,null,null,0,null,null,null,null,null,0,null,null,null,null,null,null,null,null,null,null,null,""]
["S329",null,null,null,null,null,null,0,null,null,null,null,null,0,null,null,null,null,null,null,null,null,null,null,null,""]
["S330",null,null,null,null,null,null,0,null,null,null,null,null,0,null,null,null,null,null,null,null,null,null,null,null,""]
["S331",null,null,null,null,null,null,0,null,null,null,null,null,0,null,null,null,null,null,null,null,null,null,null,null,""]
["S332",null,null,null,null,null,null,0,null,null,null,null,null,0,null,null,null,null,null,null,null,null,null,null,null,""]
["S333",null,null,null,null,null,null,0,null,null,null,null,null,0,null,null,null,null,null,null,null,null,null,null,null,""]
["S334",null,null,null,null,null,null,0,null,null,null,null,null,0,null,null,null,null,null,null,null,null,null,null,null,""]
["S335",null,null,null,null,null,null,0,null,null,null,null,null,0,null,null,null,null,null,null,null,null,null,null,null,""]
["S336",null,null,null,null,null,null,0,null,null,null,null,null,0,null,null,null,null,null,null,null,null,null,null,null,""]
["S337",null,null,null,null,null,null,0,null,null,null,null,null,0,null,null,null,null,null,null,null,null,null,null,null,""]
["S338",null,null,null,null,null,null,0,null,null,null,null,null,0,null,null,null,null,null,null,null,null,null,null,null,""]
["S339",null,null,null,null,null,null,0,null,null,null,null,null,0,null,null,null,null,null,null,null,null,null,null,null,""]
["S340",null,null,null,null,null,null,0,null,null,null,null,null,0,null,null,null,null,null,null,null,null,null,null,null,""]
["S341",null,null,null,null,null,null,0,null,null,null,null,null,0,null,null,null,null,null,null,null,null,null,null,null,""]
["S342",null,null,null,null,null,null,0,null,null,null,null,null,0,null,null,null,null,null,null,null,null,null,null,null,{"$f":"SUBSTITUTE(B1353,\" \",\"_\")","v":""}]
["S343",null,null,null,null,null,null,0,null,null,null,null,null,0,null,null,null,null,null,null,null,null,null,null,null,""]
["S344",null,null,null,null,null,null,{"$f":"(E1354+F1354+G1354)/3","v":0},null,null,null,null,null,0,null,null,null,null,null,null,null,null,null,null,null,""]
["S345",null,null,null,null,null,null,0,null,null,null,null,null,0,null,null,null,null,null,null,null,null,null,null,null,""]
["S346",null,null,null,null,null,null,0,null,null,null,null,null,0,null,null,null,null,null,null,null,null,null,null,null,""]
["S347",null,null,null,null,null,null,0,null,null,null,null,null,0,null,null,null,null,null,null,null,null,null,null,null,""]
["S348",null,null,null,null,null,null,0,null,null,null,null,null,0,null,null,null,null,null,null,null,null,null,null,null,""]
["S349",null,null,null,null,null,null,0,null,null,null,null,null,0,null,null,null,null,null,null,null,null,null,null,null,""]
["S350",null,null,null,null,null,null,0,null,null,null,null,null,0,null,null,null,null,null,null,null,null,null,null,null,""]
["S351",null,null,null,null,null,null,0,null,null,null,null,null,0,null,null,null,null,null,null,null,null,null,null,null,""]
["S352",null,null,null,null,null,null,0,null,null,null,null,null,0,null,null,null,null,null,null,null,null,null,null,null,""]
["S353",null,null,null,null,null,null,0,null,null,null,null,null,0,null,null,null,null,null,null,null,null,null,null,null,""]
["S354",null,null,null,null,null,null,0,null,null,null,null,null,0,null,null,null,null,null,null,null,null,null,null,null,""]
["S355",null,null,null,null,null,null,0,null,null,null,null,null,0,null,null,null,null,null,null,null,null,null,null,null,""]
["S356",null,null,null,null,null,null,0,null,null,null,null,null,0,null,null,null,null,null,null,null,null,null,null,null,""]
["S357",null,null,null,null,null,null,0,null,null,null,null,null,0,null,null,null,null,null,null,null,null,null,null,null,""]
["S358",null,null,null,null,null,null,0,null,null,null,null,null,0,null,null,null,null,null,null,null,null,null,null,null,""]
["S359",null,null,null,null,null,null,0,null,null,null,null,null,0,null,null,null,null,null,null,null,null,null,null,null,""]
["S360",null,null,null,null,null,null,0,null,null,null,null,null,0,null,null,null,null,null,null,null,null,null,null,null,""]
["S361",null,null,null,null,null,null,0,null,null,null,null,null,0,null,null,null,null,null,null,null,null,null,null,null,""]
["S362",null,null,null,null,null,null,0,null,null,null,null,null,0,null,null,null,null,null,null,null,null,null,null,null,""]
["S363",null,null,null,null,null,null,0,null,null,null,null,null,0,null,null,null,null,null,null,null,null,null,null,null,""]
["S364",null,null,null,null,null,null,0,null,null,null,null,null,0,null,null,null,null,null,null,null,null,null,null,null,""]
["S365",null,null,null,null,null,null,0,null,null,null,null,null,0,null,null,null,null,null,null,null,null,null,null,null,""]
["S366",null,null,null,null,null,null,0,null,null,null,null,null,0,null,null,null,null,null,null,null,null,null,null,null,""]
["S367",null,null,null,null,null,null,0,null,null,null,null,null,0,null,null,null,null,null,null,null,null,null,null,null,""]
["S368",null,null,null,null,null,null,0,null,null,null,null,null,0,null,null,null,null,null,null,null,null,null,null,null,""]
["S369",null,null,null,null,null,null,0,null,null,null,null,null,0,null,null,null,null,null,null,null,null,null,null,null,""]
["S370",null,null,null,null,null,null,0,null,null,null,null,null,0,null,null,null,null,null,null,null,null,null,null,null,""]
["S371",null,null,null,null,null,null,0,null,null,null,null,null,0,null,null,null,null,null,null,null,null,null,null,null,""]
["S372",null,null,null,null,null,null,0,null,null,null,null,null,0,null,null,null,null,null,null,null,null,null,null,null,""]
["S373",null,null,null,null,null,null,0,null,null,null,null,null,0,null,null,null,null,null,null,null,null,null,null,null,""]
["S374",null,null,null,null,null,null,0,null,null,null,null,null,0,null,null,null,null,null,null,null,null,null,null,null,""]
["S375",null,null,null,null,null,null,0,null,null,null,null,null,0,null,null,null,null,null,null,null,null,null,null,null,""]
["S376",null,null,null,null,null,null,0,null,null,null,null,null,0,null,null,null,null,null,null,null,null,null,null,null,""]
["S377",null,null,null,null,null,null,0,null,null,null,null,null,0,null,null,null,null,null,null,null,null,null,null,null,""]
["S378",null,null,null,null,null,null,0,null,null,null,null,null,0,null,null,null,null,null,null,null,null,null,null,null,""]
["S379",null,null,null,null,null,null,0,null,null,null,null,null,0,null,null,null,null,null,null,null,null,null,null,null,""]
["S380",null,null,null,null,null,null,0,null,null,null,null,null,0,null,null,null,null,null,null,null,null,null,null,null,""]
["S381",null,null,null,null,null,null,0,null,null,null,null,null,0,null,null,null,null,null,null,null,null,null,null,null,""]
["S382",null,null,null,null,null,null,0,null,null,null,null,null,0,null,null,null,null,null,null,null,null,null,null,null,""]
["S383",null,null,null,null,null,null,0,null,null,null,null,null,0,null,null,null,null,null,null,null,null,null,null,null,""]
["S384",null,null,null,null,null,null,0,null,null,null,null,null,0,null,null,null,null,null,null,null,null,null,null,null,""]
["S385",null,null,null,null,null,null,0,null,null,null,null,null,{"$f":"IF(I1395=\"Sim\",L1395*M1395,K1395*J1395)","v":0},null,null,null,null,null,null,null,null,null,null,null,""]
["S386",null,null,null,null,null,null,0,null,null,null,null,null,0,null,null,null,null,null,null,null,null,null,null,null,""]
["S387",null,null,null,null,null,null,0,null,null,null,null,null,0,null,null,null,null,null,null,null,null,null,null,null,""]
["S388",null,null,null,null,null,null,0,null,null,null,null,null,0,null,null,null,null,null,null,null,null,null,null,null,""]
["S389",null,null,null,null,null,null,0,null,null,null,null,null,0,null,null,null,null,null,null,null,null,null,null,null,""]
["S390",null,null,null,null,null,null,0,null,null,null,null,null,0,null,null,null,null,null,null,null,null,null,null,null,""]
["S391",null,null,null,null,null,null,0,null,null,null,null,null,0,null,null,null,null,null,null,null,null,null,null,null,""]
["S392",null,null,null,null,null,null,0,null,null,null,null,null,0,null,null,null,null,null,null,null,null,null,null,null,""]
["S393",null,null,null,null,null,null,0,null,null,null,null,null,0,null,null,null,null,null,null,null,null,null,null,null,""]
["S394",null,null,null,null,null,null,0,null,null,null,null,null,0,null,null,null,null,null,null,null,null,null,null,null,""]
["S395",null,null,null,null,null,null,0,null,null,null,null,null,0,null,null,null,null,null,null,null,null,null,null,null,""]
["S396",null,null,null,null,null,null,0,null,null,null,null,null,0,null,null,null,null,null,null,null,null,null,null,null,""]
["S397",null,null,null,null,null,null,0,null,null,null,null,null,0,null,null,null,null,null,null,null,null,null,null,null,""]
["S398",null,null,null,null,null,null,0,null,null,null,null,null,0,null,null,null,null,null,null,null,null,null,null,null,""]
["S399",null,null,null,null,null,null,0,null,null,null,null,null,0,null,null,null,null,null,null,null,null,null,null,null,""]
["S400",null,null,null,null,null,null,0,null,null,null,null,null,0,null,null,null,null,null,null,null,null,null,null,null,""]
["S401",null,null,null,null,null,null,0,null,null,null,null,null,0,null,null,null,null,null,null,null,null,null,null,null,""]
["S402",null,null,null,null,null,null,0,null,null,null,null,null,0,null,null,null,null,null,null,null,null,null,null,null,""]
["S403",null,null,null,null,null,null,0,null,null,null,null,null,0,null,null,null,null,null,null,null,null,null,null,null,""]
["S404",null,null,null,null,null,null,0,null,null,null,null,null,0,null,null,null,null,null,null,null,null,null,null,null,""]
["S405",null,null,null,null,null,null,0,null,null,null,null,null,0,null,null,null,null,null,null,null,null,null,null,null,""]
["S406",null,null,null,null,null,null,0,null,null,null,null,null,0,null,null,null,null,null,null,null,null,null,null,null,{"$f":"SUBSTITUTE(B1417,\" \",\"_\")","v":""}]
["S407",null,null,null,null,null,null,0,null,null,null,null,null,0,null,null,null,null,null,null,null,null,null,null,null,""]
["S408",null,null,null,null,null,null,{"$f":"(E1418+F1418+G1418)/3","v":0},null,null,null,null,null,0,null,null,null,null,null,null,null,null,null,null,null,""]
["S409",null,null,null,null,null,null,0,null,null,null,null,null,0,null,null,null,null,null,null,null,null,null,null,null,""]
["S410",null,null,null,null,null,null,0,null,null,null,null,null,0,null,null,null,null,null,null,null,null,null,null,null,""]
["S411",null,null,null,null,null,null,0,null,null,null,null,null,0,null,null,null,null,null,null,null,null,null,null,null,""]
["S412",null,null,null,null,null,null,0,null,null,null,null,null,0,null,null,null,null,null,null,null,null,null,null,null,""]
["S413",null,null,null,null,null,null,0,null,null,null,null,null,0,null,null,null,null,null,null,null,null,null,null,null,""]
["S414",null,null,null,null,null,null,0,null,null,null,null,null,0,null,null,null,null,null,null,null,null,null,null,null,""]
["S415",null,null,null,null,null,null,0,null,null,null,null,null,0,null,null,null,null,null,null,null,null,null,null,null,""]
["S416",null,null,null,null,null,null,0,null,null,null,null,null,0,null,null,null,null,null,null,null,null,null,null,null,""]
["S417",null,null,null,null,null,null,0,null,null,null,null,null,0,null,null,null,null,null,null,null,null,null,null,null,""]
["S418",null,null,null,null,null,null,0,null,null,null,null,null,0,null,null,null,null,null,null,null,null,null,null,null,""]
["S419",null,null,null,null,null,null,0,null,null,null,null,null,0,null,null,null,null,null,null,null,null,null,null,null,""]
["S420",null,null,null,null,null,null,0,null,null,null,null,null,0,null,null,null,null,null,null,null,null,null,null,null,""]
["S421",null,null,null,null,null,null,0,null,null,null,null,null,0,null,null,null,null,null,null,null,null,null,null,null,""]
["S422",null,null,null,null,null,null,0,null,null,null,null,null,0,null,null,null,null,null,null,null,null,null,null,null,""]
["S423",null,null,null,null,null,null,0,null,null,null,null,null,0,null,null,null,null,null,null,null,null,null,null,null,""]
["S424",null,null,null,null,null,null,0,null,null,null,null,null,0,null,null,null,null,null,null,null,null,null,null,null,""]
["S425",null,null,null,null,null,null,0,null,null,null,null,null,0,null,null,null,null,null,null,null,null,null,null,null,""]
["S426",null,null,null,null,null,null,0,null,null,null,null,null,0,null,null,null,null,null,null,null,null,null,null,null,""]
["S427",null,null,null,null,null,null,0,null,null,null,null,null,0,null,null,null,null,null,null,null,null,null,null,null,""]
["S428",null,null,null,null,null,null,0,null,null,null,null,null,0,null,null,null,null,null,null,null,null,null,null,null,""]
["S429",null,null,null,null,null,null,0,null,null,null,null,null,0,null,null,null,null,null,null,null,null,null,null,null,""]
["S430",null,null,null,null,null,null,0,null,null,null,null,null,0,null,null,null,null,null,null,null,null,null,null,null,""]
["S431",null,null,null,null,null,null,0,null,null,null,null,null,0,null,null,null,null,null,null,null,null,null,null,null,""]
["S432",null,null,null,null,null,null,0,null,null,null,null,null,0,null,null,null,null,null,null,null,null,null,null,null,""]
["S433",null,null,null,null,null,null,0,null,null,null,null,null,0,null,null,null,null,null,null,null,null,null,null,null,""]
["S434",null,null,null,null,null,null,0,null,null,null,null,null,0,null,null,null,null,null,null,null,null,null,null,null,""]
["S435",null,null,null,null,null,null,0,null,null,null,null,null,0,null,null,null,null,null,null,null,null,null,null,null,""]
["S436",null,null,null,null,null,null,0,null,null,null,null,null,0,null,null,null,null,null,null,null,null,null,null,null,""]
["S437",null,null,null,null,null,null,0,null,null,null,null,null,0,null,null,null,null,null,null,null,null,null,null,null,""]
["S438",null,null,null,null,null,null,0,null,null,null,null,null,0,null,null,null,null,null,null,null,null,null,null,null,""]
["S439",null,null,null,null,null,null,0,null,null,null,null,null,0,null,null,null,null,null,null,null,null,null,null,null,""]
["S440",null,null,null,null,null,null,0,null,null,null,null,null,0,null,null,null,null,null,null,null,null,null,null,null,""]
["S441",null,null,null,null,null,null,0,null,null,null,null,null,0,null,null,null,null,null,null,null,null,null,null,null,""]
["S442",null,null,null,null,null,null,0,null,null,null,null,null,0,null,null,null,null,null,null,null,null,null,null,null,""]
["S443",null,null,null,null,null,null,0,null,null,null,null,null,0,null,null,null,null,null,null,null,null,null,null,null,""]
["S444",null,null,null,null,null,null,0,null,null,null,null,null,0,null,null,null,null,null,null,null,null,null,null,null,""]
["S445",null,null,null,null,null,null,0,null,null,null,null,null,0,null,null,null,null,null,null,null,null,null,null,null,""]
["S446",null,null,null,null,null,null,0,null,null,null,null,null,0,null,null,null,null,null,null,null,null,null,null,null,""]
["S447",null,null,null,null,null,null,0,null,null,null,null,null,0,null,null,null,null,null,null,null,null,null,null,null,""]
["S448",null,null,null,null,null,null,0,null,null,null,null,null,0,null,null,null,null,null,null,null,null,null,null,null,""]
["S449",null,null,null,null,null,null,0,null,null,null,null,null,{"$f":"IF(I1459=\"Sim\",L1459*M1459,K1459*J1459)","v":0},null,null,null,null,null,null,null,null,null,null,null,""]
["S450",null,null,null,null,null,null,0,null,null,null,null,null,0,null,null,null,null,null,null,null,null,null,null,null,""]
["S451",null,null,null,null,null,null,0,null,null,null,null,null,0,null,null,null,null,null,null,null,null,null,null,null,""]
["S452",null,null,null,null,null,null,0,null,null,null,null,null,0,null,null,null,null,null,null,null,null,null,null,null,""]
["S453",null,null,null,null,null,null,0,null,null,null,null,null,0,null,null,null,null,null,null,null,null,null,null,null,""]
["S454",null,null,null,null,null,null,0,null,null,null,null,null,0,null,null,null,null,null,null,null,null,null,null,null,""]
["S455",null,null,null,null,null,null,0,null,null,null,null,null,0,null,null,null,null,null,null,null,null,null,null,null,""]
["S456",null,null,null,null,null,null,0,null,null,null,null,null,0,null,null,null,null,null,null,null,null,null,null,null,""]
["S457",null,null,null,null,null,null,0,null,null,null,null,null,0,null,null,null,null,null,null,null,null,null,null,null,""]
["S458",null,null,null,null,null,null,0,null,null,null,null,null,0,null,null,null,null,null,null,null,null,null,null,null,""]
["S459",null,null,null,null,null,null,0,null,null,null,null,null,0,null,null,null,null,null,null,null,null,null,null,null,""]
["S460",null,null,null,null,null,null,0,null,null,null,null,null,0,null,null,null,null,null,null,null,null,null,null,null,""]
["S461",null,null,null,null,null,null,0,null,null,null,null,null,0,null,null,null,null,null,null,null,null,null,null,null,""]
["S462",null,null,null,null,null,null,0,null,null,null,null,null,0,null,null,null,null,null,null,null,null,null,null,null,""]
["S463",null,null,null,null,null,null,0,null,null,null,null,null,0,null,null,null,null,null,null,null,null,null,null,null,""]
["S464",null,null,null,null,null,null,0,null,null,null,null,null,0,null,null,null,null,null,null,null,null,null,null,null,""]
["S465",null,null,null,null,null,null,0,null,null,null,null,null,0,null,null,null,null,null,null,null,null,null,null,null,""]
["S466",null,null,null,null,null,null,0,null,null,null,null,null,0,null,null,null,null,null,null,null,null,null,null,null,""]
["S467",null,null,null,null,null,null,0,null,null,null,null,null,0,null,null,null,null,null,null,null,null,null,null,null,""]
["S468",null,null,null,null,null,null,0,null,null,null,null,null,0,null,null,null,null,null,null,null,null,null,null,null,""]
["S469",null,null,null,null,null,null,0,null,null,null,null,null,0,null,null,null,null,null,null,null,null,null,null,null,""]
["S470",null,null,null,null,null,null,0,null,null,null,null,null,0,null,null,null,null,null,null,null,null,null,null,null,{"$f":"SUBSTITUTE(B1481,\" \",\"_\")","v":""}]
["S471",null,null,null,null,null,null,0,null,null,null,null,null,0,null,null,null,null,null,null,null,null,null,null,null,""]
["S472",null,null,null,null,null,null,{"$f":"(E1482+F1482+G1482)/3","v":0},null,null,null,null,null,0,null,null,null,null,null,null,null,null,null,null,null,""]
["S473",null,null,null,null,null,null,0,null,null,null,null,null,0,null,null,null,null,null,null,null,null,null,null,null,""]
["S474",null,null,null,null,null,null,0,null,null,null,null,null,0,null,null,null,null,null,null,null,null,null,null,null,""]
["S475",null,null,null,null,null,null,0,null,null,null,null,null,0,null,null,null,null,null,null,null,null,null,null,null,""]
["S476",null,null,null,null,null,null,0,null,null,null,null,null,0,null,null,null,null,null,null,null,null,null,null,null,""]
["S477",null,null,null,null,null,null,0,null,null,null,null,null,0,null,null,null,null,null,null,null,null,null,null,null,""]
["S478",null,null,null,null,null,null,0,null,null,null,null,null,0,null,null,null,null,null,null,null,null,null,null,null,""]
["S479",null,null,null,null,null,null,0,null,null,null,null,null,0,null,null,null,null,null,null,null,null,null,null,null,""]
["S480",null,null,null,null,null,null,0,null,null,null,null,null,0,null,null,null,null,null,null,null,null,null,null,null,""]
["S481",null,null,null,null,null,null,0,null,null,null,null,null,0,null,null,null,null,null,null,null,null,null,null,null,""]
["S482",null,null,null,null,null,null,0,null,null,null,null,null,0,null,null,null,null,null,null,null,null,null,null,null,""]
["S483",null,null,null,null,null,null,0,null,null,null,null,null,0,null,null,null,null,null,null,null,null,null,null,null,""]
["S484",null,null,null,null,null,null,0,null,null,null,null,null,0,null,null,null,null,null,null,null,null,null,null,null,""]
["S485",null,null,null,null,null,null,0,null,null,null,null,null,0,null,null,null,null,null,null,null,null,null,null,null,""]
["S486",null,null,null,null,null,null,0,null,null,null,null,null,0,null,null,null,null,null,null,null,null,null,null,null,""]
["S487",null,null,null,null,null,null,0,null,null,null,null,null,0,null,null,null,null,null,null,null,null,null,null,null,""]
["S488",null,null,null,null,null,null,0,null,null,null,null,null,0,null,null,null,null,null,null,null,null,null,null,null,""]
["S489",null,null,null,null,null,null,0,null,null,null,null,null,0,null,null,null,null,null,null,null,null,null,null,null,""]
["S490",null,null,null,null,null,null,0,null,null,null,null,null,0,null,null,null,null,null,null,null,null,null,null,null,""]
["S491",null,null,null,null,null,null,0,null,null,null,null,null,0,null,null,null,null,null,null,null,null,null,null,null,""]
["S492",null,null,null,null,null,null,0,null,null,null,null,null,0,null,null,null,null,null,null,null,null,null,null,null,""]
["S493",null,null,null,null,null,null,0,null,null,null,null,null,0,null,null,null,null,null,null,null,null,null,null,null,""]
["S494",null,null,null,null,null,null,0,null,null,null,null,null,0,null,null,null,null,null,null,null,null,null,null,null,""]
["S495",null,null,null,null,null,null,0,null,null,null,null,null,0,null,null,null,null,null,null,null,null,null,null,null,""]
["S496",null,null,null,null,null,null,0,null,null,null,null,null,0,null,null,null,null,null,null,null,null,null,null,null,""]
["S497",null,null,null,null,null,null,0,null,null,null,null,null,0,null,null,null,null,null,null,null,null,null,null,null,""]
["S498",null,null,null,null,null,null,0,null,null,null,null,null,0,null,null,null,null,null,null,null,null,null,null,null,""]
["S499",null,null,null,null,null,null,0,null,null,null,null,null,0,null,null,null,null,null,null,null,null,null,null,null,""]
["S500",null,null,null,null,null,null,0,null,null,null,null,null,0,null,null,null,null,null,null,null,null,null,null,null,""]
["S501",null,null,null,null,null,null,0,null,null,null,null,null,0,null,null,null,null,null,null,null,null,null,null,null,""]
["S502",null,null,null,null,null,null,0,null,null,null,null,null,0,null,null,null,null,null,null,null,null,null,null,null,""]
["S503",null,null,null,null,null,null,0,null,null,null,null,null,0,null,null,null,null,null,null,null,null,null,null,null,""]
["S504",null,null,null,null,null,null,0,null,null,null,null,null,0,null,null,null,null,null,null,null,null,null,null,null,""]
["S505",null,null,null,null,null,null,0,null,null,null,null,null,0,null,null,null,null,null,null,null,null,null,null,null,""]
["S506",null,null,null,null,null,null,0,null,null,null,null,null,0,null,null,null,null,null,null,null,null,null,null,null,""]
["S507",null,null,null,null,null,null,0,null,null,null,null,null,0,null,null,null,null,null,null,null,null,null,null,null,""]
["S508",null,null,null,null,null,null,0,null,null,null,null,null,0,null,null,null,null,null,null,null,null,null,null,null,""]
["S509",null,null,null,null,null,null,0,null,null,null,null,null,0,null,null,null,null,null,null,null,null,null,null,null,""]
["S510",null,null,null,null,null,null,0,null,null,null,null,null,0,null,null,null,null,null,null,null,null,null,null,null,""]
["S511",null,null,null,null,null,null,0,null,null,null,null,null,0,null,null,null,null,null,null,null,null,null,null,null,""]
["S512",null,null,null,null,null,null,0,null,null,null,null,null,0,null,null,null,null,null,null,null,null,null,null,null,""]
["S513",null,null,null,null,null,null,0,null,null,null,null,null,{"$f":"IF(I1523=\"Sim\",L1523*M1523,K1523*J1523)","v":0},null,null,null,null,null,null,null,null,null,null,null,""]
["S514",null,null,null,null,null,null,0,null,null,null,null,null,0,null,null,null,null,null,null,null,null,null,null,null,""]
["S515",null,null,null,null,null,null,0,null,null,null,null,null,0,null,null,null,null,null,null,null,null,null,null,null,""]
["S516",null,null,null,null,null,null,0,null,null,null,null,null,0,null,null,null,null,null,null,null,null,null,null,null,""]
["S517",null,null,null,null,null,null,0,null,null,null,null,null,0,null,null,null,null,null,null,null,null,null,null,null,""]
["S518",null,null,null,null,null,null,0,null,null,null,null,null,0,null,null,null,null,null,null,null,null,null,null,null,""]
["S519",null,null,null,null,null,null,0,null,null,null,null,null,0,null,null,null,null,null,null,null,null,null,null,null,""]
["S520",null,null,null,null,null,null,0,null,null,null,null,null,0,null,null,null,null,null,null,null,null,null,null,null,""]
["S521",null,null,null,null,null,null,0,null,null,null,null,null,0,null,null,null,null,null,null,null,null,null,null,null,""]
["S522",null,null,null,null,null,null,0,null,null,null,null,null,0,null,null,null,null,null,null,null,null,null,null,null,""]
["S523",null,null,null,null,null,null,0,null,null,null,null,null,0,null,null,null,null,null,null,null,null,null,null,null,""]
["S524",null,null,null,null,null,null,0,null,null,null,null,null,0,null,null,null,null,null,null,null,null,null,null,null,""]
["S525",null,null,null,null,null,null,0,null,null,null,null,null,0,null,null,null,null,null,null,null,null,null,null,null,""]
["S526",null,null,null,null,null,null,0,null,null,null,null,null,0,null,null,null,null,null,null,null,null,null,null,null,""]
["S527",null,null,null,null,null,null,0,null,null,null,null,null,0,null,null,null,null,null,null,null,null,null,null,null,""]
["S528",null,null,null,null,null,null,0,null,null,null,null,null,0,null,null,null,null,null,null,null,null,null,null,null,""]
["S529",null,null,null,null,null,null,0,null,null,null,null,null,0,null,null,null,null,null,null,null,null,null,null,null,""]
["S530",null,null,null,null,null,null,0,null,null,null,null,null,0,null,null,null,null,null,null,null,null,null,null,null,""]
["S531",null,null,null,null,null,null,0,null,null,null,null,null,0,null,null,null,null,null,null,null,null,null,null,null,""]
["S532",null,null,null,null,null,null,0,null,null,null,null,null,0,null,null,null,null,null,null,null,null,null,null,null,""]
["S533",null,null,null,null,null,null,0,null,null,null,null,null,0,null,null,null,null,null,null,null,null,null,null,null,""]
["S534",null,null,null,null,null,null,0,null,null,null,null,null,0,null,null,null,null,null,null,null,null,null,null,null,{"$f":"SUBSTITUTE(B1545,\" \",\"_\")","v":""}]
["S535",null,null,null,null,null,null,0,null,null,null,null,null,0,null,null,null,null,null,null,null,null,null,null,null,""]
["S536",null,null,null,null,null,null,{"$f":"(E1546+F1546+G1546)/3","v":0},null,null,null,null,null,0,null,null,null,null,null,null,null,null,null,null,null,""]
["S537",null,null,null,null,null,null,0,null,null,null,null,null,0,null,null,null,null,null,null,null,null,null,null,null,""]
["S538",null,null,null,null,null,null,0,null,null,null,null,null,0,null,null,null,null,null,null,null,null,null,null,null,""]
["S539",null,null,null,null,null,null,0,null,null,null,null,null,0,null,null,null,null,null,null,null,null,null,null,null,""]
["S540",null,null,null,null,null,null,0,null,null,null,null,null,0,null,null,null,null,null,null,null,null,null,null,null,""]
["S541",null,null,null,null,null,null,0,null,null,null,null,null,0,null,null,null,null,null,null,null,null,null,null,null,""]
["S542",null,null,null,null,null,null,0,null,null,null,null,null,0,null,null,null,null,null,null,null,null,null,null,null,""]
["S543",null,null,null,null,null,null,0,null,null,null,null,null,0,null,null,null,null,null,null,null,null,null,null,null,""]
["S544",null,null,null,null,null,null,0,null,null,null,null,null,0,null,null,null,null,null,null,null,null,null,null,null,""]
["S545",null,null,null,null,null,null,0,null,null,null,null,null,0,null,null,null,null,null,null,null,null,null,null,null,""]
["S546",null,null,null,null,null,null,0,null,null,null,null,null,0,null,null,null,null,null,null,null,null,null,null,null,""]
["S547",null,null,null,null,null,null,0,null,null,null,null,null,0,null,null,null,null,null,null,null,null,null,null,null,""]
["S548",null,null,null,null,null,null,0,null,null,null,null,null,0,null,null,null,null,null,null,null,null,null,null,null,""]
["S549",null,null,null,null,null,null,0,null,null,null,null,null,0,null,null,null,null,null,null,null,null,null,null,null,""]
["S550",null,null,null,null,null,null,0,null,null,null,null,null,0,null,null,null,null,null,null,null,null,null,null,null,""]
["S551",null,null,null,null,null,null,0,null,null,null,null,null,0,null,null,null,null,null,null,null,null,null,null,null,""]
["S552",null,null,null,null,null,null,0,null,null,null,null,null,0,null,null,null,null,null,null,null,null,null,null,null,""]
["S553",null,null,null,null,null,null,0,null,null,null,null,null,0,null,null,null,null,null,null,null,null,null,null,null,""]
["S554",null,null,null,null,null,null,0,null,null,null,null,null,0,null,null,null,null,null,null,null,null,null,null,null,""]
["S555",null,null,null,null,null,null,0,null,null,null,null,null,0,null,null,null,null,null,null,null,null,null,null,null,""]
["S556",null,null,null,null,null,null,0,null,null,null,null,null,0,null,null,null,null,null,null,null,null,null,null,null,""]
["S557",null,null,null,null,null,null,0,null,null,null,null,null,0,null,null,null,null,null,null,null,null,null,null,null,""]
["S558",null,null,null,null,null,null,0,null,null,null,null,null,0,null,null,null,null,null,null,null,null,null,null,null,""]
["S559",null,null,null,null,null,null,0,null,null,null,null,null,0,null,null,null,null,null,null,null,null,null,null,null,""]
["S560",null,null,null,null,null,null,0,null,null,null,null,null,0,null,null,null,null,null,null,null,null,null,null,null,""]
["S561",null,null,null,null,null,null,0,null,null,null,null,null,0,null,null,null,null,null,null,null,null,null,null,null,""]
["S562",null,null,null,null,null,null,0,null,null,null,null,null,0,null,null,null,null,null,null,null,null,null,null,null,""]
["S563",null,null,null,null,null,null,0,null,null,null,null,null,0,null,null,null,null,null,null,null,null,null,null,null,""]
["S564",null,null,null,null,null,null,0,null,null,null,null,null,0,null,null,null,null,null,null,null,null,null,null,null,""]
["S565",null,null,null,null,null,null,0,null,null,null,null,null,0,null,null,null,null,null,null,null,null,null,null,null,""]
["S566",null,null,null,null,null,null,0,null,null,null,null,null,0,null,null,null,null,null,null,null,null,null,null,null,""]
["S567",null,null,null,null,null,null,0,null,null,null,null,null,0,null,null,null,null,null,null,null,null,null,null,null,""]
["S568",null,null,null,null,null,null,0,null,null,null,null,null,0,null,null,null,null,null,null,null,null,null,null,null,""]
["S569",null,null,null,null,null,null,0,null,null,null,null,null,0,null,null,null,null,null,null,null,null,null,null,null,""]
["S570",null,null,null,null,null,null,0,null,null,null,null,null,0,null,null,null,null,null,null,null,null,null,null,null,""]
["S571",null,null,null,null,null,null,0,null,null,null,null,null,0,null,null,null,null,null,null,null,null,null,null,null,""]
["S572",null,null,null,null,null,null,0,null,null,null,null,null,0,null,null,null,null,null,null,null,null,null,null,null,""]
["S573",null,null,null,null,null,null,0,null,null,null,null,null,0,null,null,null,null,null,null,null,null,null,null,null,""]
["S574",null,null,null,null,null,null,0,null,null,null,null,null,0,null,null,null,null,null,null,null,null,null,null,null,""]
["S575",null,null,null,null,null,null,0,null,null,null,null,null,0,null,null,null,null,null,null,null,null,null,null,null,""]
["S576",null,null,null,null,null,null,0,null,null,null,null,null,0,null,null,null,null,null,null,null,null,null,null,null,""]
["S577",null,null,null,null,null,null,0,null,null,null,null,null,{"$f":"IF(I1587=\"Sim\",L1587*M1587,K1587*J1587)","v":0},null,null,null,null,null,null,null,null,null,null,null,""]
["S578",null,null,null,null,null,null,0,null,null,null,null,null,0,null,null,null,null,null,null,null,null,null,null,null,""]
["S579",null,null,null,null,null,null,0,null,null,null,null,null,0,null,null,null,null,null,null,null,null,null,null,null,""]
["S580",null,null,null,null,null,null,0,null,null,null,null,null,0,null,null,null,null,null,null,null,null,null,null,null,""]
["S581",null,null,null,null,null,null,0,null,null,null,null,null,0,null,null,null,null,null,null,null,null,null,null,null,""]
["S582",null,null,null,null,null,null,0,null,null,null,null,null,0,null,null,null,null,null,null,null,null,null,null,null,""]
["S583",null,null,null,null,null,null,0,null,null,null,null,null,0,null,null,null,null,null,null,null,null,null,null,null,""]
["S584",null,null,null,null,null,null,0,null,null,null,null,null,0,null,null,null,null,null,null,null,null,null,null,null,""]
["S585",null,null,null,null,null,null,0,null,null,null,null,null,0,null,null,null,null,null,null,null,null,null,null,null,""]
["S586",null,null,null,null,null,null,0,null,null,null,null,null,0,null,null,null,null,null,null,null,null,null,null,null,""]
["S587",null,null,null,null,null,null,0,null,null,null,null,null,0,null,null,null,null,null,null,null,null,null,null,null,""]
["S588",null,null,null,null,null,null,0,null,null,null,null,null,0,null,null,null,null,null,null,null,null,null,null,null,""]
["S589",null,null,null,null,null,null,0,null,null,null,null,null,0,null,null,null,null,null,null,null,null,null,null,null,""]
["S590",null,null,null,null,null,null,0,null,null,null,null,null,0,null,null,null,null,null,null,null,null,null,null,null,""]
["S591",null,null,null,null,null,null,0,null,null,null,null,null,0,null,null,null,null,null,null,null,null,null,null,null,""]
["S592",null,null,null,null,null,null,0,null,null,null,null,null,0,null,null,null,null,null,null,null,null,null,null,null,""]
["S593",null,null,null,null,null,null,0,null,null,null,null,null,0,null,null,null,null,null,null,null,null,null,null,null,""]
["S594",null,null,null,null,null,null,0,null,null,null,null,null,0,null,null,null,null,null,null,null,null,null,null,null,""]
["S595",null,null,null,null,null,null,0,null,null,null,null,null,0,null,null,null,null,null,null,null,null,null,null,null,""]
["S596",null,null,null,null,null,null,0,null,null,null,null,null,0,null,null,null,null,null,null,null,null,null,null,null,""]
["S597",null,null,null,null,null,null,0,null,null,null,null,null,0,null,null,null,null,null,null,null,null,null,null,null,""]
["S598",null,null,null,null,null,null,0,null,null,null,null,null,0,null,null,null,null,null,null,null,null,null,null,null,{"$f":"SUBSTITUTE(B1609,\" \",\"_\")","v":""}]
["S599",null,null,null,null,null,null,0,null,null,null,null,null,0,null,null,null,null,null,null,null,null,null,null,null,""]
["S600",null,null,null,null,null,null,{"$f":"(E1610+F1610+G1610)/3","v":0},null,null,null,null,null,0,null,null,null,null,null,null,null,null,null,null,null,""]
["S601",null,null,null,null,null,null,0,null,null,null,null,null,0,null,null,null,null,null,null,null,null,null,null,null,""]
["S602",null,null,null,null,null,null,0,null,null,null,null,null,0,null,null,null,null,null,null,null,null,null,null,null,""]
["S603",null,null,null,null,null,null,0,null,null,null,null,null,0,null,null,null,null,null,null,null,null,null,null,null,""]
["S604",null,null,null,null,null,null,0,null,null,null,null,null,0,null,null,null,null,null,null,null,null,null,null,null,""]
["S605",null,null,null,null,null,null,0,null,null,null,null,null,0,null,null,null,null,null,null,null,null,null,null,null,""]
["S606",null,null,null,null,null,null,0,null,null,null,null,null,0,null,null,null,null,null,null,null,null,null,null,null,""]
["S607",null,null,null,null,null,null,0,null,null,null,null,null,0,null,null,null,null,null,null,null,null,null,null,null,""]
["S608",null,null,null,null,null,null,0,null,null,null,null,null,0,null,null,null,null,null,null,null,null,null,null,null,""]
["S609",null,null,null,null,null,null,0,null,null,null,null,null,0,null,null,null,null,null,null,null,null,null,null,null,""]
["S610",null,null,null,null,null,null,0,null,null,null,null,null,0,null,null,null,null,null,null,null,null,null,null,null,""]
["S611",null,null,null,null,null,null,0,null,null,null,null,null,0,null,null,null,null,null,null,null,null,null,null,null,""]
["S612",null,null,null,null,null,null,0,null,null,null,null,null,0,null,null,null,null,null,null,null,null,null,null,null,""]
["S613",null,null,null,null,null,null,0,null,null,null,null,null,0,null,null,null,null,null,null,null,null,null,null,null,""]
["S614",null,null,null,null,null,null,0,null,null,null,null,null,0,null,null,null,null,null,null,null,null,null,null,null,""]
["S615",null,null,null,null,null,null,0,null,null,null,null,null,0,null,null,null,null,null,null,null,null,null,null,null,""]
["S616",null,null,null,null,null,null,0,null,null,null,null,null,0,null,null,null,null,null,null,null,null,null,null,null,""]
["S617",null,null,null,null,null,null,0,null,null,null,null,null,0,null,null,null,null,null,null,null,null,null,null,null,""]
["S618",null,null,null,null,null,null,0,null,null,null,null,null,0,null,null,null,null,null,null,null,null,null,null,null,""]
["S619",null,null,null,null,null,null,0,null,null,null,null,null,0,null,null,null,null,null,null,null,null,null,null,null,""]
["S620",null,null,null,null,null,null,0,null,null,null,null,null,0,null,null,null,null,null,null,null,null,null,null,null,""]
["S621",null,null,null,null,null,null,0,null,null,null,null,null,0,null,null,null,null,null,null,null,null,null,null,null,""]
["S622",null,null,null,null,null,null,0,null,null,null,null,null,0,null,null,null,null,null,null,null,null,null,null,null,""]
["S623",null,null,null,null,null,null,0,null,null,null,null,null,0,null,null,null,null,null,null,null,null,null,null,null,""]
["S624",null,null,null,null,null,null,0,null,null,null,null,null,0,null,null,null,null,null,null,null,null,null,null,null,""]
["S625",null,null,null,null,null,null,0,null,null,null,null,null,0,null,null,null,null,null,null,null,null,null,null,null,""]
["S626",null,null,null,null,null,null,0,null,null,null,null,null,0,null,null,null,null,null,null,null,null,null,null,null,""]
["S627",null,null,null,null,null,null,0,null,null,null,null,null,0,null,null,null,null,null,null,null,null,null,null,null,""]
["S628",null,null,null,null,null,null,0,null,null,null,null,null,0,null,null,null,null,null,null,null,null,null,null,null,""]
["S629",null,null,null,null,null,null,0,null,null,null,null,null,0,null,null,null,null,null,null,null,null,null,null,null,""]
["S630",null,null,null,null,null,null,0,null,null,null,null,null,0,null,null,null,null,null,null,null,null,null,null,null,""]
["S631",null,null,null,null,null,null,0,null,null,null,null,null,0,null,null,null,null,null,null,null,null,null,null,null,""]
["S632",null,null,null,null,null,null,0,null,null,null,null,null,0,null,null,null,null,null,null,null,null,null,null,null,""]
["S633",null,null,null,null,null,null,0,null,null,null,null,null,0,null,null,null,null,null,null,null,null,null,null,null,""]
["S634",null,null,null,null,null,null,0,null,null,null,null,null,0,null,null,null,null,null,null,null,null,null,null,null,""]
["S635",null,null,null,null,null,null,0,null,null,null,null,null,0,null,null,null,null,null,null,null,null,null,null,null,""]
["S636",null,null,null,null,null,null,0,null,null,null,null,null,0,null,null,null,null,null,null,null,null,null,null,null,""]
["S637",null,null,null,null,null,null,0,null,null,null,null,null,0,null,null,null,null,null,null,null,null,null,null,null,""]
["S638",null,null,null,null,null,null,0,null,null,null,null,null,0,null,null,null,null,null,null,null,null,null,null,null,""]
["S639",null,null,null,null,null,null,0,null,null,null,null,null,0,null,null,null,null,null,null,null,null,null,null,null,""]
["S640",null,null,null,null,null,null,0,null,null,null,null,null,0,null,null,null,null,null,null,null,null,null,null,null,""]
["S641",null,null,null,null,null,null,0,null,null,null,null,null,{"$f":"IF(I1651=\"Sim\",L1651*M1651,K1651*J1651)","v":0},null,null,null,null,null,null,null,null,null,null,null,""]
["S642",null,null,null,null,null,null,0,null,null,null,null,null,0,null,null,null,null,null,null,null,null,null,null,null,""]
["S643",null,null,null,null,null,null,0,null,null,null,null,null,0,null,null,null,null,null,null,null,null,null,null,null,""]
["S644",null,null,null,null,null,null,0,null,null,null,null,null,0,null,null,null,null,null,null,null,null,null,null,null,""]
["S645",null,null,null,null,null,null,0,null,null,null,null,null,0,null,null,null,null,null,null,null,null,null,null,null,""]
["S646",null,null,null,null,null,null,0,null,null,null,null,null,0,null,null,null,null,null,null,null,null,null,null,null,""]
["S647",null,null,null,null,null,null,0,null,null,null,null,null,0,null,null,null,null,null,null,null,null,null,null,null,""]
["S648",null,null,null,null,null,null,0,null,null,null,null,null,0,null,null,null,null,null,null,null,null,null,null,null,""]
["S649",null,null,null,null,null,null,0,null,null,null,null,null,0,null,null,null,null,null,null,null,null,null,null,null,""]
["S650",null,null,null,null,null,null,0,null,null,null,null,null,0,null,null,null,null,null,null,null,null,null,null,null,""]
["S651",null,null,null,null,null,null,0,null,null,null,null,null,0,null,null,null,null,null,null,null,null,null,null,null,""]
["S652",null,null,null,null,null,null,0,null,null,null,null,null,0,null,null,null,null,null,null,null,null,null,null,null,""]
["S653",null,null,null,null,null,null,0,null,null,null,null,null,0,null,null,null,null,null,null,null,null,null,null,null,""]
["S654",null,null,null,null,null,null,0,null,null,null,null,null,0,null,null,null,null,null,null,null,null,null,null,null,""]
["S655",null,null,null,null,null,null,0,null,null,null,null,null,0,null,null,null,null,null,null,null,null,null,null,null,""]
["S656",null,null,null,null,null,null,0,null,null,null,null,null,0,null,null,null,null,null,null,null,null,null,null,null,""]
["S657",null,null,null,null,null,null,0,null,null,null,null,null,0,null,null,null,null,null,null,null,null,null,null,null,""]
["S658",null,null,null,null,null,null,0,null,null,null,null,null,0,null,null,null,null,null,null,null,null,null,null,null,""]
["S659",null,null,null,null,null,null,0,null,null,null,null,null,0,null,null,null,null,null,null,null,null,null,null,null,""]
["S660",null,null,null,null,null,null,0,null,null,null,null,null,0,null,null,null,null,null,null,null,null,null,null,null,""]
["S661",null,null,null,null,null,null,0,null,null,null,null,null,0,null,null,null,null,null,null,null,null,null,null,null,""]
["S662",null,null,null,null,null,null,0,null,null,null,null,null,0,null,null,null,null,null,null,null,null,null,null,null,{"$f":"SUBSTITUTE(B1673,\" \",\"_\")","v":""}]
["S663",null,null,null,null,null,null,0,null,null,null,null,null,0,null,null,null,null,null,null,null,null,null,null,null,""]
["S664",null,null,null,null,null,null,{"$f":"(E1674+F1674+G1674)/3","v":0},null,null,null,null,null,0,null,null,null,null,null,null,null,null,null,null,null,""]
["S665",null,null,null,null,null,null,0,null,null,null,null,null,0,null,null,null,null,null,null,null,null,null,null,null,""]
["S666",null,null,null,null,null,null,0,null,null,null,null,null,0,null,null,null,null,null,null,null,null,null,null,null,""]
["S667",null,null,null,null,null,null,0,null,null,null,null,null,0,null,null,null,null,null,null,null,null,null,null,null,""]
["S668",null,null,null,null,null,null,0,null,null,null,null,null,0,null,null,null,null,null,null,null,null,null,null,null,""]
["S669",null,null,null,null,null,null,0,null,null,null,null,null,0,null,null,null,null,null,null,null,null,null,null,null,""]
["S670",null,null,null,null,null,null,0,null,null,null,null,null,0,null,null,null,null,null,null,null,null,null,null,null,""]
["S671",null,null,null,null,null,null,0,null,null,null,null,null,0,null,null,null,null,null,null,null,null,null,null,null,""]
["S672",null,null,null,null,null,null,0,null,null,null,null,null,0,null,null,null,null,null,null,null,null,null,null,null,""]
["S673",null,null,null,null,null,null,0,null,null,null,null,null,0,null,null,null,null,null,null,null,null,null,null,null,""]
["S674",null,null,null,null,null,null,0,null,null,null,null,null,0,null,null,null,null,null,null,null,null,null,null,null,""]
["S675",null,null,null,null,null,null,0,null,null,null,null,null,0,null,null,null,null,null,null,null,null,null,null,null,""]
["S676",null,null,null,null,null,null,0,null,null,null,null,null,0,null,null,null,null,null,null,null,null,null,null,null,""]
["S677",null,null,null,null,null,null,0,null,null,null,null,null,0,null,null,null,null,null,null,null,null,null,null,null,""]
["S678",null,null,null,null,null,null,0,null,null,null,null,null,0,null,null,null,null,null,null,null,null,null,null,null,""]
["S679",null,null,null,null,null,null,0,null,null,null,null,null,0,null,null,null,null,null,null,null,null,null,null,null,""]
["S680",null,null,null,null,null,null,0,null,null,null,null,null,0,null,null,null,null,null,null,null,null,null,null,null,""]
["S681",null,null,null,null,null,null,0,null,null,null,null,null,0,null,null,null,null,null,null,null,null,null,null,null,""]
["S682",null,null,null,null,null,null,0,null,null,null,null,null,0,null,null,null,null,null,null,null,null,null,null,null,""]
["S683",null,null,null,null,null,null,0,null,null,null,null,null,0,null,null,null,null,null,null,null,null,null,null,null,""]
["S684",null,null,null,null,null,null,0,null,null,null,null,null,0,null,null,null,null,null,null,null,null,null,null,null,""]
["S685",null,null,null,null,null,null,0,null,null,null,null,null,0,null,null,null,null,null,null,null,null,null,null,null,""]
["S686",null,null,null,null,null,null,0,null,null,null,null,null,0,null,null,null,null,null,null,null,null,null,null,null,""]
["S687",null,null,null,null,null,null,0,null,null,null,null,null,0,null,null,null,null,null,null,null,null,null,null,null,""]
["S688",null,null,null,null,null,null,0,null,null,null,null,null,0,null,null,null,null,null,null,null,null,null,null,null,""]
["S689",null,null,null,null,null,null,0,null,null,null,null,null,0,null,null,null,null,null,null,null,null,null,null,null,""]
["S690",null,null,null,null,null,null,0,null,null,null,null,null,0,null,null,null,null,null,null,null,null,null,null,null,""]
["S691",null,null,null,null,null,null,0,null,null,null,null,null,0,null,null,null,null,null,null,null,null,null,null,null,""]
["S692",null,null,null,null,null,null,0,null,null,null,null,null,0,null,null,null,null,null,null,null,null,null,null,null,""]
["S693",null,null,null,null,null,null,0,null,null,null,null,null,0,null,null,null,null,null,null,null,null,null,null,null,""]
["S694",null,null,null,null,null,null,0,null,null,null,null,null,0,null,null,null,null,null,null,null,null,null,null,null,""]
["S695",null,null,null,null,null,null,0,null,null,null,null,null,0,null,null,null,null,null,null,null,null,null,null,null,""]
["S696",null,null,null,null,null,null,0,null,null,null,null,null,0,null,null,null,null,null,null,null,null,null,null,null,""]
["S697",null,null,null,null,null,null,0,null,null,null,null,null,0,null,null,null,null,null,null,null,null,null,null,null,""]
["S698",null,null,null,null,null,null,0,null,null,null,null,null,0,null,null,null,null,null,null,null,null,null,null,null,""]
["S699",null,null,null,null,null,null,0,null,null,null,null,null,0,null,null,null,null,null,null,null,null,null,null,null,""]
["S700",null,null,null,null,null,null,0,null,null,null,null,null,0,null,null,null,null,null,null,null,null,null,null,null,""]
["S701",null,null,null,null,null,null,0,null,null,null,null,null,0,null,null,null,null,null,null,null,null,null,null,null,""]
["S702",null,null,null,null,null,null,0,null,null,null,null,null,0,null,null,null,null,null,null,null,null,null,null,null,""]
["S703",null,null,null,null,null,null,0,null,null,null,null,null,0,null,null,null,null,null,null,null,null,null,null,null,""]
["S704",null,null,null,null,null,null,0,null,null,null,null,null,0,null,null,null,null,null,null,null,null,null,null,null,""]
["S705",null,null,null,null,null,null,0,null,null,null,null,null,{"$f":"IF(I1715=\"Sim\",L1715*M1715,K1715*J1715)","v":0},null,null,null,null,null,null,null,null,null,null,null,""]
["S706",null,null,null,null,null,null,0,null,null,null,null,null,0,null,null,null,null,null,null,null,null,null,null,null,""]
["S707",null,null,null,null,null,null,0,null,null,null,null,null,0,null,null,null,null,null,null,null,null,null,null,null,""]
["S708",null,null,null,null,null,null,0,null,null,null,null,null,0,null,null,null,null,null,null,null,null,null,null,null,""]
["S709",null,null,null,null,null,null,0,null,null,null,null,null,0,null,null,null,null,null,null,null,null,null,null,null,""]
["S710",null,null,null,null,null,null,0,null,null,null,null,null,0,null,null,null,null,null,null,null,null,null,null,null,""]
["S711",null,null,null,null,null,null,0,null,null,null,null,null,0,null,null,null,null,null,null,null,null,null,null,null,""]
["S712",null,null,null,null,null,null,0,null,null,null,null,null,0,null,null,null,null,null,null,null,null,null,null,null,""]
["S713",null,null,null,null,null,null,0,null,null,null,null,null,0,null,null,null,null,null,null,null,null,null,null,null,""]
["S714",null,null,null,null,null,null,0,null,null,null,null,null,0,null,null,null,null,null,null,null,null,null,null,null,""]
["S715",null,null,null,null,null,null,0,null,null,null,null,null,0,null,null,null,null,null,null,null,null,null,null,null,""]
["S716",null,null,null,null,null,null,0,null,null,null,null,null,0,null,null,null,null,null,null,null,null,null,null,null,""]
["S717",null,null,null,null,null,null,0,null,null,null,null,null,0,null,null,null,null,null,null,null,null,null,null,null,""]
["S718",null,null,null,null,null,null,0,null,null,null,null,null,0,null,null,null,null,null,null,null,null,null,null,null,""]
["S719",null,null,null,null,null,null,0,null,null,null,null,null,0,null,null,null,null,null,null,null,null,null,null,null,""]
["S720",null,null,null,null,null,null,0,null,null,null,null,null,0,null,null,null,null,null,null,null,null,null,null,null,""]
["S721",null,null,null,null,null,null,0,null,null,null,null,null,0,null,null,null,null,null,null,null,null,null,null,null,""]
["S722",null,null,null,null,null,null,0,null,null,null,null,null,0,null,null,null,null,null,null,null,null,null,null,null,""]
["S723",null,null,null,null,null,null,0,null,null,null,null,null,0,null,null,null,null,null,null,null,null,null,null,null,""]
["S724",null,null,null,null,null,null,0,null,null,null,null,null,0,null,null,null,null,null,null,null,null,null,null,null,""]
["S725",null,null,null,null,null,null,0,null,null,null,null,null,0,null,null,null,null,null,null,null,null,null,null,null,""]
["S726",null,null,null,null,null,null,0,null,null,null,null,null,0,null,null,null,null,null,null,null,null,null,null,null,{"$f":"SUBSTITUTE(B1737,\" \",\"_\")","v":""}]
["S727",null,null,null,null,null,null,0,null,null,null,null,null,0,null,null,null,null,null,null,null,null,null,null,null,""]
["S728",null,null,null,null,null,null,{"$f":"(E1738+F1738+G1738)/3","v":0},null,null,null,null,null,0,null,null,null,null,null,null,null,null,null,null,null,""]
["S729",null,null,null,null,null,null,0,null,null,null,null,null,0,null,null,null,null,null,null,null,null,null,null,null,""]
["S730",null,null,null,null,null,null,0,null,null,null,null,null,0,null,null,null,null,null,null,null,null,null,null,null,""]
["S731",null,null,null,null,null,null,0,null,null,null,null,null,0,null,null,null,null,null,null,null,null,null,null,null,""]
["S732",null,null,null,null,null,null,0,null,null,null,null,null,0,null,null,null,null,null,null,null,null,null,null,null,""]
["S733",null,null,null,null,null,null,0,null,null,null,null,null,0,null,null,null,null,null,null,null,null,null,null,null,""]
["S734",null,null,null,null,null,null,0,null,null,null,null,null,0,null,null,null,null,null,null,null,null,null,null,null,""]
["S735",null,null,null,null,null,null,0,null,null,null,null,null,0,null,null,null,null,null,null,null,null,null,null,null,""]
["S736",null,null,null,null,null,null,0,null,null,null,null,null,0,null,null,null,null,null,null,null,null,null,null,null,""]
["S737",null,null,null,null,null,null,0,null,null,null,null,null,0,null,null,null,null,null,null,null,null,null,null,null,""]
["S738",null,null,null,null,null,null,0,null,null,null,null,null,0,null,null,null,null,null,null,null,null,null,null,null,""]
["S739",null,null,null,null,null,null,0,null,null,null,null,null,0,null,null,null,null,null,null,null,null,null,null,null,""]
["S740",null,null,null,null,null,null,0,null,null,null,null,null,0,null,null,null,null,null,null,null,null,null,null,null,""]
["S741",null,null,null,null,null,null,0,null,null,null,null,null,0,null,null,null,null,null,null,null,null,null,null,null,""]
["S742",null,null,null,null,null,null,0,null,null,null,null,null,0,null,null,null,null,null,null,null,null,null,null,null,""]
["S743",null,null,null,null,null,null,0,null,null,null,null,null,0,null,null,null,null,null,null,null,null,null,null,null,""]
["S744",null,null,null,null,null,null,0,null,null,null,null,null,0,null,null,null,null,null,null,null,null,null,null,null,""]
["S745",null,null,null,null,null,null,0,null,null,null,null,null,0,null,null,null,null,null,null,null,null,null,null,null,""]
["S746",null,null,null,null,null,null,0,null,null,null,null,null,0,null,null,null,null,null,null,null,null,null,null,null,""]
["S747",null,null,null,null,null,null,0,null,null,null,null,null,0,null,null,null,null,null,null,null,null,null,null,null,""]
["S748",null,null,null,null,null,null,0,null,null,null,null,null,0,null,null,null,null,null,null,null,null,null,null,null,""]
["S749",null,null,null,null,null,null,0,null,null,null,null,null,0,null,null,null,null,null,null,null,null,null,null,null,""]
["S750",null,null,null,null,null,null,0,null,null,null,null,null,0,null,null,null,null,null,null,null,null,null,null,null,""]
["S751",null,null,null,null,null,null,0,null,null,null,null,null,0,null,null,null,null,null,null,null,null,null,null,null,""]
["S752",null,null,null,null,null,null,0,null,null,null,null,null,0,null,null,null,null,null,null,null,null,null,null,null,""]
["S753",null,null,null,null,null,null,0,null,null,null,null,null,0,null,null,null,null,null,null,null,null,null,null,null,""]
["S754",null,null,null,null,null,null,0,null,null,null,null,null,0,null,null,null,null,null,null,null,null,null,null,null,""]
["S755",null,null,null,null,null,null,0,null,null,null,null,null,0,null,null,null,null,null,null,null,null,null,null,null,""]
["S756",null,null,null,null,null,null,0,null,null,null,null,null,0,null,null,null,null,null,null,null,null,null,null,null,""]
["S757",null,null,null,null,null,null,0,null,null,null,null,null,0,null,null,null,null,null,null,null,null,null,null,null,""]
["S758",null,null,null,null,null,null,0,null,null,null,null,null,0,null,null,null,null,null,null,null,null,null,null,null,""]
["S759",null,null,null,null,null,null,0,null,null,null,null,null,0,null,null,null,null,null,null,null,null,null,null,null,""]
["S760",null,null,null,null,null,null,0,null,null,null,null,null,0,null,null,null,null,null,null,null,null,null,null,null,""]
["S761",null,null,null,null,null,null,0,null,null,null,null,null,0,null,null,null,null,null,null,null,null,null,null,null,""]
["S762",null,null,null,null,null,null,0,null,null,null,null,null,0,null,null,null,null,null,null,null,null,null,null,null,""]
["S763",null,null,null,null,null,null,0,null,null,null,null,null,0,null,null,null,null,null,null,null,null,null,null,null,""]
["S764",null,null,null,null,null,null,0,null,null,null,null,null,0,null,null,null,null,null,null,null,null,null,null,null,""]
["S765",null,null,null,null,null,null,0,null,null,null,null,null,0,null,null,null,null,null,null,null,null,null,null,null,""]
["S766",null,null,null,null,null,null,0,null,null,null,null,null,0,null,null,null,null,null,null,null,null,null,null,null,""]
["S767",null,null,null,null,null,null,0,null,null,null,null,null,0,null,null,null,null,null,null,null,null,null,null,null,""]
["S768",null,null,null,null,null,null,0,null,null,null,null,null,0,null,null,null,null,null,null,null,null,null,null,null,""]
["S769",null,null,null,null,null,null,0,null,null,null,null,null,{"$f":"IF(I1779=\"Sim\",L1779*M1779,K1779*J1779)","v":0},null,null,null,null,null,null,null,null,null,null,null,""]
["S770",null,null,null,null,null,null,0,null,null,null,null,null,0,null,null,null,null,null,null,null,null,null,null,null,""]
["S771",null,null,null,null,null,null,0,null,null,null,null,null,0,null,null,null,null,null,null,null,null,null,null,null,""]
["S772",null,null,null,null,null,null,0,null,null,null,null,null,0,null,null,null,null,null,null,null,null,null,null,null,""]
["S773",null,null,null,null,null,null,0,null,null,null,null,null,0,null,null,null,null,null,null,null,null,null,null,null,""]
["S774",null,null,null,null,null,null,0,null,null,null,null,null,0,null,null,null,null,null,null,null,null,null,null,null,""]
["S775",null,null,null,null,null,null,0,null,null,null,null,null,0,null,null,null,null,null,null,null,null,null,null,null,""]
["S776",null,null,null,null,null,null,0,null,null,null,null,null,0,null,null,null,null,null,null,null,null,null,null,null,""]
["S777",null,null,null,null,null,null,0,null,null,null,null,null,0,null,null,null,null,null,null,null,null,null,null,null,""]
["S778",null,null,null,null,null,null,0,null,null,null,null,null,0,null,null,null,null,null,null,null,null,null,null,null,""]
["S779",null,null,null,null,null,null,0,null,null,null,null,null,0,null,null,null,null,null,null,null,null,null,null,null,""]
["S780",null,null,null,null,null,null,0,null,null,null,null,null,0,null,null,null,null,null,null,null,null,null,null,null,""]
["S781",null,null,null,null,null,null,0,null,null,null,null,null,0,null,null,null,null,null,null,null,null,null,null,null,""]
["S782",null,null,null,null,null,null,0,null,null,null,null,null,0,null,null,null,null,null,null,null,null,null,null,null,""]
["S783",null,null,null,null,null,null,0,null,null,null,null,null,0,null,null,null,null,null,null,null,null,null,null,null,""]
["S784",null,null,null,null,null,null,0,null,null,null,null,null,0,null,null,null,null,null,null,null,null,null,null,null,""]
["S785",null,null,null,null,null,null,0,null,null,null,null,null,0,null,null,null,null,null,null,null,null,null,null,null,""]
["S786",null,null,null,null,null,null,0,null,null,null,null,null,0,null,null,null,null,null,null,null,null,null,null,null,""]
["S787",null,null,null,null,null,null,0,null,null,null,null,null,0,null,null,null,null,null,null,null,null,null,null,null,""]
["S788",null,null,null,null,null,null,0,null,null,null,null,null,0,null,null,null,null,null,null,null,null,null,null,null,""]
["S789",null,null,null,null,null,null,0,null,null,null,null,null,0,null,null,null,null,null,null,null,null,null,null,null,""]
["S790",null,null,null,null,null,null,0,null,null,null,null,null,0,null,null,null,null,null,null,null,null,null,null,null,{"$f":"SUBSTITUTE(B1801,\" \",\"_\")","v":""}]
["S791",null,null,null,null,null,null,0,null,null,null,null,null,0,null,null,null,null,null,null,null,null,null,null,null,""]
["S792",null,null,null,null,null,null,{"$f":"(E1802+F1802+G1802)/3","v":0},null,null,null,null,null,0,null,null,null,null,null,null,null,null,null,null,null,""]
["S793",null,null,null,null,null,null,0,null,null,null,null,null,0,null,null,null,null,null,null,null,null,null,null,null,""]
["S794",null,null,null,null,null,null,0,null,null,null,null,null,0,null,null,null,null,null,null,null,null,null,null,null,""]
["S795",null,null,null,null,null,null,0,null,null,null,null,null,0,null,null,null,null,null,null,null,null,null,null,null,""]
["S796",null,null,null,null,null,null,0,null,null,null,null,null,0,null,null,null,null,null,null,null,null,null,null,null,""]
["S797",null,null,null,null,null,null,0,null,null,null,null,null,0,null,null,null,null,null,null,null,null,null,null,null,""]
["S798",null,null,null,null,null,null,0,null,null,null,null,null,0,null,null,null,null,null,null,null,null,null,null,null,""]
["S799",null,null,null,null,null,null,0,null,null,null,null,null,0,null,null,null,null,null,null,null,null,null,null,null,""]
["S800",null,null,null,null,null,null,0,null,null,null,null,null,0,null,null,null,null,null,null,null,null,null,null,null,""]
["S801",null,null,null,null,null,null,0,null,null,null,null,null,0,null,null,null,null,null,null,null,null,null,null,null,""]
["S802",null,null,null,null,null,null,0,null,null,null,null,null,0,null,null,null,null,null,null,null,null,null,null,null,""]
["S803",null,null,null,null,null,null,0,null,null,null,null,null,0,null,null,null,null,null,null,null,null,null,null,null,""]
["S804",null,null,null,null,null,null,0,null,null,null,null,null,0,null,null,null,null,null,null,null,null,null,null,null,""]
["S805",null,null,null,null,null,null,0,null,null,null,null,null,0,null,null,null,null,null,null,null,null,null,null,null,""]
["S806",null,null,null,null,null,null,0,null,null,null,null,null,0,null,null,null,null,null,null,null,null,null,null,null,""]
["S807",null,null,null,null,null,null,0,null,null,null,null,null,0,null,null,null,null,null,null,null,null,null,null,null,""]
["S808",null,null,null,null,null,null,0,null,null,null,null,null,0,null,null,null,null,null,null,null,null,null,null,null,""]
["S809",null,null,null,null,null,null,0,null,null,null,null,null,0,null,null,null,null,null,null,null,null,null,null,null,""]
["S810",null,null,null,null,null,null,0,null,null,null,null,null,0,null,null,null,null,null,null,null,null,null,null,null,""]
["S811",null,null,null,null,null,null,0,null,null,null,null,null,0,null,null,null,null,null,null,null,null,null,null,null,""]
["S812",null,null,null,null,null,null,0,null,null,null,null,null,0,null,null,null,null,null,null,null,null,null,null,null,""]
["S813",null,null,null,null,null,null,0,null,null,null,null,null,0,null,null,null,null,null,null,null,null,null,null,null,""]
["S814",null,null,null,null,null,null,0,null,null,null,null,null,0,null,null,null,null,null,null,null,null,null,null,null,""]
["S815",null,null,null,null,null,null,0,null,null,null,null,null,0,null,null,null,null,null,null,null,null,null,null,null,""]
["S816",null,null,null,null,null,null,0,null,null,null,null,null,0,null,null,null,null,null,null,null,null,null,null,null,""]
["S817",null,null,null,null,null,null,0,null,null,null,null,null,0,null,null,null,null,null,null,null,null,null,null,null,""]
["S818",null,null,null,null,null,null,0,null,null,null,null,null,0,null,null,null,null,null,null,null,null,null,null,null,""]
["S819",null,null,null,null,null,null,0,null,null,null,null,null,0,null,null,null,null,null,null,null,null,null,null,null,""]
["S820",null,null,null,null,null,null,0,null,null,null,null,null,0,null,null,null,null,null,null,null,null,null,null,null,""]
["S821",null,null,null,null,null,null,0,null,null,null,null,null,0,null,null,null,null,null,null,null,null,null,null,null,""]
["S822",null,null,null,null,null,null,0,null,null,null,null,null,0,null,null,null,null,null,null,null,null,null,null,null,""]
["S823",null,null,null,null,null,null,0,null,null,null,null,null,0,null,null,null,null,null,null,null,null,null,null,null,""]
["S824",null,null,null,null,null,null,0,null,null,null,null,null,0,null,null,null,null,null,null,null,null,null,null,null,""]
["S825",null,null,null,null,null,null,0,null,null,null,null,null,0,null,null,null,null,null,null,null,null,null,null,null,""]
["S826",null,null,null,null,null,null,0,null,null,null,null,null,0,null,null,null,null,null,null,null,null,null,null,null,""]
["S827",null,null,null,null,null,null,0,null,null,null,null,null,0,null,null,null,null,null,null,null,null,null,null,null,""]
["S828",null,null,null,null,null,null,0,null,null,null,null,null,0,null,null,null,null,null,null,null,null,null,null,null,""]
["S829",null,null,null,null,null,null,0,null,null,null,null,null,0,null,null,null,null,null,null,null,null,null,null,null,""]
["S830",null,null,null,null,null,null,0,null,null,null,null,null,0,null,null,null,null,null,null,null,null,null,null,null,""]
["S831",null,null,null,null,null,null,0,null,null,null,null,null,0,null,null,null,null,null,null,null,null,null,null,null,""]
["S832",null,null,null,null,null,null,0,null,null,null,null,null,0,null,null,null,null,null,null,null,null,null,null,null,""]
["S833",null,null,null,null,null,null,0,null,null,null,null,null,{"$f":"IF(I1843=\"Sim\",L1843*M1843,K1843*J1843)","v":0},null,null,null,null,null,null,null,null,null,null,null,""]
["S834",null,null,null,null,null,null,0,null,null,null,null,null,0,null,null,null,null,null,null,null,null,null,null,null,""]
["S835",null,null,null,null,null,null,0,null,null,null,null,null,0,null,null,null,null,null,null,null,null,null,null,null,""]
["S836",null,null,null,null,null,null,0,null,null,null,null,null,0,null,null,null,null,null,null,null,null,null,null,null,""]
["S837",null,null,null,null,null,null,0,null,null,null,null,null,0,null,null,null,null,null,null,null,null,null,null,null,""]
["S838",null,null,null,null,null,null,0,null,null,null,null,null,0,null,null,null,null,null,null,null,null,null,null,null,""]
["S839",null,null,null,null,null,null,0,null,null,null,null,null,0,null,null,null,null,null,null,null,null,null,null,null,""]
["S840",null,null,null,null,null,null,0,null,null,null,null,null,0,null,null,null,null,null,null,null,null,null,null,null,""]
["S841",null,null,null,null,null,null,0,null,null,null,null,null,0,null,null,null,null,null,null,null,null,null,null,null,""]
["S842",null,null,null,null,null,null,0,null,null,null,null,null,0,null,null,null,null,null,null,null,null,null,null,null,""]
["S843",null,null,null,null,null,null,0,null,null,null,null,null,0,null,null,null,null,null,null,null,null,null,null,null,""]
["S844",null,null,null,null,null,null,0,null,null,null,null,null,0,null,null,null,null,null,null,null,null,null,null,null,""]
["S845",null,null,null,null,null,null,0,null,null,null,null,null,0,null,null,null,null,null,null,null,null,null,null,null,""]
["S846",null,null,null,null,null,null,0,null,null,null,null,null,0,null,null,null,null,null,null,null,null,null,null,null,""]
["S847",null,null,null,null,null,null,0,null,null,null,null,null,0,null,null,null,null,null,null,null,null,null,null,null,""]
["S848",null,null,null,null,null,null,0,null,null,null,null,null,0,null,null,null,null,null,null,null,null,null,null,null,""]
["S849",null,null,null,null,null,null,0,null,null,null,null,null,0,null,null,null,null,null,null,null,null,null,null,null,""]
["S850",null,null,null,null,null,null,0,null,null,null,null,null,0,null,null,null,null,null,null,null,null,null,null,null,""]
["S851",null,null,null,null,null,null,0,null,null,null,null,null,0,null,null,null,null,null,null,null,null,null,null,null,""]
["S852",null,null,null,null,null,null,0,null,null,null,null,null,0,null,null,null,null,null,null,null,null,null,null,null,""]
["S853",null,null,null,null,null,null,0,null,null,null,null,null,0,null,null,null,null,null,null,null,null,null,null,null,""]
["S854",null,null,null,null,null,null,0,null,null,null,null,null,0,null,null,null,null,null,null,null,null,null,null,null,{"$f":"SUBSTITUTE(B1865,\" \",\"_\")","v":""}]
["S855",null,null,null,null,null,null,0,null,null,null,null,null,0,null,null,null,null,null,null,null,null,null,null,null,""]
["S856",null,null,null,null,null,null,{"$f":"(E1866+F1866+G1866)/3","v":0},null,null,null,null,null,0,null,null,null,null,null,null,null,null,null,null,null,""]
["S857",null,null,null,null,null,null,0,null,null,null,null,null,0,null,null,null,null,null,null,null,null,null,null,null,""]
["S858",null,null,null,null,null,null,0,null,null,null,null,null,0,null,null,null,null,null,null,null,null,null,null,null,""]
["S859",null,null,null,null,null,null,0,null,null,null,null,null,0,null,null,null,null,null,null,null,null,null,null,null,""]
["S860",null,null,null,null,null,null,0,null,null,null,null,null,0,null,null,null,null,null,null,null,null,null,null,null,""]
["S861",null,null,null,null,null,null,0,null,null,null,null,null,0,null,null,null,null,null,null,null,null,null,null,null,""]
["S862",null,null,null,null,null,null,0,null,null,null,null,null,0,null,null,null,null,null,null,null,null,null,null,null,""]
["S863",null,null,null,null,null,null,0,null,null,null,null,null,0,null,null,null,null,null,null,null,null,null,null,null,""]
["S864",null,null,null,null,null,null,0,null,null,null,null,null,0,null,null,null,null,null,null,null,null,null,null,null,""]
["S865",null,null,null,null,null,null,0,null,null,null,null,null,0,null,null,null,null,null,null,null,null,null,null,null,""]
["S866",null,null,null,null,null,null,0,null,null,null,null,null,0,null,null,null,null,null,null,null,null,null,null,null,""]
["S867",null,null,null,null,null,null,0,null,null,null,null,null,0,null,null,null,null,null,null,null,null,null,null,null,""]
["S868",null,null,null,null,null,null,0,null,null,null,null,null,0,null,null,null,null,null,null,null,null,null,null,null,""]
["S869",null,null,null,null,null,null,0,null,null,null,null,null,0,null,null,null,null,null,null,null,null,null,null,null,""]
["S870",null,null,null,null,null,null,0,null,null,null,null,null,0,null,null,null,null,null,null,null,null,null,null,null,""]
["S871",null,null,null,null,null,null,0,null,null,null,null,null,0,null,null,null,null,null,null,null,null,null,null,null,""]
["S872",null,null,null,null,null,null,0,null,null,null,null,null,0,null,null,null,null,null,null,null,null,null,null,null,""]
["S873",null,null,null,null,null,null,0,null,null,null,null,null,0,null,null,null,null,null,null,null,null,null,null,null,""]
["S874",null,null,null,null,null,null,0,null,null,null,null,null,0,null,null,null,null,null,null,null,null,null,null,null,""]
["S875",null,null,null,null,null,null,0,null,null,null,null,null,0,null,null,null,null,null,null,null,null,null,null,null,""]
["S876",null,null,null,null,null,null,0,null,null,null,null,null,0,null,null,null,null,null,null,null,null,null,null,null,""]
["S877",null,null,null,null,null,null,0,null,null,null,null,null,0,null,null,null,null,null,null,null,null,null,null,null,""]
["S878",null,null,null,null,null,null,0,null,null,null,null,null,0,null,null,null,null,null,null,null,null,null,null,null,""]
["S879",null,null,null,null,null,null,0,null,null,null,null,null,0,null,null,null,null,null,null,null,null,null,null,null,""]
["S880",null,null,null,null,null,null,0,null,null,null,null,null,0,null,null,null,null,null,null,null,null,null,null,null,""]
["S881",null,null,null,null,null,null,0,null,null,null,null,null,0,null,null,null,null,null,null,null,null,null,null,null,""]
["S882",null,null,null,null,null,null,0,null,null,null,null,null,0,null,null,null,null,null,null,null,null,null,null,null,""]
["S883",null,null,null,null,null,null,0,null,null,null,null,null,0,null,null,null,null,null,null,null,null,null,null,null,""]
["S884",null,null,null,null,null,null,0,null,null,null,null,null,0,null,null,null,null,null,null,null,null,null,null,null,""]
["S885",null,null,null,null,null,null,0,null,null,null,null,null,0,null,null,null,null,null,null,null,null,null,null,null,""]
["S886",null,null,null,null,null,null,0,null,null,null,null,null,0,null,null,null,null,null,null,null,null,null,null,null,""]
["S887",null,null,null,null,null,null,0,null,null,null,null,null,0,null,null,null,null,null,null,null,null,null,null,null,""]
["S888",null,null,null,null,null,null,0,null,null,null,null,null,0,null,null,null,null,null,null,null,null,null,null,null,""]
["S889",null,null,null,null,null,null,0,null,null,null,null,null,0,null,null,null,null,null,null,null,null,null,null,null,""]
["S890",null,null,null,null,null,null,0,null,null,null,null,null,0,null,null,null,null,null,null,null,null,null,null,null,""]
["S891",null,null,null,null,null,null,0,null,null,null,null,null,0,null,null,null,null,null,null,null,null,null,null,null,""]
["S892",null,null,null,null,null,null,0,null,null,null,null,null,0,null,null,null,null,null,null,null,null,null,null,null,""]
["S893",null,null,null,null,null,null,0,null,null,null,null,null,0,null,null,null,null,null,null,null,null,null,null,null,""]
["S894",null,null,null,null,null,null,0,null,null,null,null,null,0,null,null,null,null,null,null,null,null,null,null,null,""]
["S895",null,null,null,null,null,null,0,null,null,null,null,null,0,null,null,null,null,null,null,null,null,null,null,null,""]
["S896",null,null,null,null,null,null,0,null,null,null,null,null,0,null,null,null,null,null,null,null,null,null,null,null,""]
["S897",null,null,null,null,null,null,0,null,null,null,null,null,{"$f":"IF(I1907=\"Sim\",L1907*M1907,K1907*J1907)","v":0},null,null,null,null,null,null,null,null,null,null,null,""]
["S898",null,null,null,null,null,null,0,null,null,null,null,null,0,null,null,null,null,null,null,null,null,null,null,null,""]
["S899",null,null,null,null,null,null,0,null,null,null,null,null,0,null,null,null,null,null,null,null,null,null,null,null,""]
["S900",null,null,null,null,null,null,0,null,null,null,null,null,0,null,null,null,null,null,null,null,null,null,null,null,""]
["S901",null,null,null,null,null,null,0,null,null,null,null,null,0,null,null,null,null,null,null,null,null,null,null,null,""]
["S902",null,null,null,null,null,null,0,null,null,null,null,null,0,null,null,null,null,null,null,null,null,null,null,null,""]
["S903",null,null,null,null,null,null,0,null,null,null,null,null,0,null,null,null,null,null,null,null,null,null,null,null,""]
["S904",null,null,null,null,null,null,0,null,null,null,null,null,0,null,null,null,null,null,null,null,null,null,null,null,""]
["S905",null,null,null,null,null,null,0,null,null,null,null,null,0,null,null,null,null,null,null,null,null,null,null,null,""]
["S906",null,null,null,null,null,null,0,null,null,null,null,null,0,null,null,null,null,null,null,null,null,null,null,null,""]
["S907",null,null,null,null,null,null,0,null,null,null,null,null,0,null,null,null,null,null,null,null,null,null,null,null,""]
["S908",null,null,null,null,null,null,0,null,null,null,null,null,0,null,null,null,null,null,null,null,null,null,null,null,""]
["S909",null,null,null,null,null,null,0,null,null,null,null,null,0,null,null,null,null,null,null,null,null,null,null,null,""]
["S910",null,null,null,null,null,null,0,null,null,null,null,null,0,null,null,null,null,null,null,null,null,null,null,null,""]
["S911",null,null,null,null,null,null,0,null,null,null,null,null,0,null,null,null,null,null,null,null,null,null,null,null,""]
["S912",null,null,null,null,null,null,0,null,null,null,null,null,0,null,null,null,null,null,null,null,null,null,null,null,""]
["S913",null,null,null,null,null,null,0,null,null,null,null,null,0,null,null,null,null,null,null,null,null,null,null,null,""]
["S914",null,null,null,null,null,null,0,null,null,null,null,null,0,null,null,null,null,null,null,null,null,null,null,null,""]
["S915",null,null,null,null,null,null,0,null,null,null,null,null,0,null,null,null,null,null,null,null,null,null,null,null,""]
["S916",null,null,null,null,null,null,0,null,null,null,null,null,0,null,null,null,null,null,null,null,null,null,null,null,""]
["S917",null,null,null,null,null,null,0,null,null,null,null,null,0,null,null,null,null,null,null,null,null,null,null,null,""]
["S918",null,null,null,null,null,null,0,null,null,null,null,null,0,null,null,null,null,null,null,null,null,null,null,null,{"$f":"SUBSTITUTE(B1929,\" \",\"_\")","v":""}]
["S919",null,null,null,null,null,null,0,null,null,null,null,null,0,null,null,null,null,null,null,null,null,null,null,null,""]
["S920",null,null,null,null,null,null,{"$f":"(E1930+F1930+G1930)/3","v":0},null,null,null,null,null,0,null,null,null,null,null,null,null,null,null,null,null,""]
["S921",null,null,null,null,null,null,0,null,null,null,null,null,0,null,null,null,null,null,null,null,null,null,null,null,""]
["S922",null,null,null,null,null,null,0,null,null,null,null,null,0,null,null,null,null,null,null,null,null,null,null,null,""]
["S923",null,null,null,null,null,null,0,null,null,null,null,null,0,null,null,null,null,null,null,null,null,null,null,null,""]
["S924",null,null,null,null,null,null,0,null,null,null,null,null,0,null,null,null,null,null,null,null,null,null,null,null,""]
["S925",null,null,null,null,null,null,0,null,null,null,null,null,0,null,null,null,null,null,null,null,null,null,null,null,""]
["S926",null,null,null,null,null,null,0,null,null,null,null,null,0,null,null,null,null,null,null,null,null,null,null,null,""]
["S927",null,null,null,null,null,null,0,null,null,null,null,null,0,null,null,null,null,null,null,null,null,null,null,null,""]
["S928",null,null,null,null,null,null,0,null,null,null,null,null,0,null,null,null,null,null,null,null,null,null,null,null,""]
["S929",null,null,null,null,null,null,0,null,null,null,null,null,0,null,null,null,null,null,null,null,null,null,null,null,""]
["S930",null,null,null,null,null,null,0,null,null,null,null,null,0,null,null,null,null,null,null,null,null,null,null,null,""]
["S931",null,null,null,null,null,null,0,null,null,null,null,null,0,null,null,null,null,null,null,null,null,null,null,null,""]
["S932",null,null,null,null,null,null,0,null,null,null,null,null,0,null,null,null,null,null,null,null,null,null,null,null,""]
["S933",null,null,null,null,null,null,0,null,null,null,null,null,0,null,null,null,null,null,null,null,null,null,null,null,""]
["S934",null,null,null,null,null,null,0,null,null,null,null,null,0,null,null,null,null,null,null,null,null,null,null,null,""]
["S935",null,null,null,null,null,null,0,null,null,null,null,null,0,null,null,null,null,null,null,null,null,null,null,null,""]
["S936",null,null,null,null,null,null,0,null,null,null,null,null,0,null,null,null,null,null,null,null,null,null,null,null,""]
["S937",null,null,null,null,null,null,0,null,null,null,null,null,0,null,null,null,null,null,null,null,null,null,null,null,""]
["S938",null,null,null,null,null,null,0,null,null,null,null,null,0,null,null,null,null,null,null,null,null,null,null,null,""]
["S939",null,null,null,null,null,null,0,null,null,null,null,null,0,null,null,null,null,null,null,null,null,null,null,null,""]
["S940",null,null,null,null,null,null,0,null,null,null,null,null,0,null,null,null,null,null,null,null,null,null,null,null,""]
["S941",null,null,null,null,null,null,0,null,null,null,null,null,0,null,null,null,null,null,null,null,null,null,null,null,""]
["S942",null,null,null,null,null,null,0,null,null,null,null,null,0,null,null,null,null,null,null,null,null,null,null,null,""]
["S943",null,null,null,null,null,null,0,null,null,null,null,null,0,null,null,null,null,null,null,null,null,null,null,null,""]
["S944",null,null,null,null,null,null,0,null,null,null,null,null,0,null,null,null,null,null,null,null,null,null,null,null,""]
["S945",null,null,null,null,null,null,0,null,null,null,null,null,0,null,null,null,null,null,null,null,null,null,null,null,""]
["S946",null,null,null,null,null,null,0,null,null,null,null,null,0,null,null,null,null,null,null,null,null,null,null,null,""]
["S947",null,null,null,null,null,null,0,null,null,null,null,null,0,null,null,null,null,null,null,null,null,null,null,null,""]
["S948",null,null,null,null,null,null,0,null,null,null,null,null,0,null,null,null,null,null,null,null,null,null,null,null,""]
["S949",null,null,null,null,null,null,0,null,null,null,null,null,0,null,null,null,null,null,null,null,null,null,null,null,""]
["S950",null,null,null,null,null,null,0,null,null,null,null,null,0,null,null,null,null,null,null,null,null,null,null,null,""]
["S951",null,null,null,null,null,null,0,null,null,null,null,null,0,null,null,null,null,null,null,null,null,null,null,null,""]
["S952",null,null,null,null,null,null,0,null,null,null,null,null,0,null,null,null,null,null,null,null,null,null,null,null,""]
["S953",null,null,null,null,null,null,0,null,null,null,null,null,0,null,null,null,null,null,null,null,null,null,null,null,""]
["S954",null,null,null,null,null,null,0,null,null,null,null,null,0,null,null,null,null,null,null,null,null,null,null,null,""]
["S955",null,null,null,null,null,null,0,null,null,null,null,null,0,null,null,null,null,null,null,null,null,null,null,null,""]
["S956",null,null,null,null,null,null,0,null,null,null,null,null,0,null,null,null,null,null,null,null,null,null,null,null,""]
["S957",null,null,null,null,null,null,0,null,null,null,null,null,0,null,null,null,null,null,null,null,null,null,null,null,""]
["S958",null,null,null,null,null,null,0,null,null,null,null,null,0,null,null,null,null,null,null,null,null,null,null,null,""]
["S959",null,null,null,null,null,null,0,null,null,null,null,null,0,null,null,null,null,null,null,null,null,null,null,null,""]
["S960",null,null,null,null,null,null,0,null,null,null,null,null,0,null,null,null,null,null,null,null,null,null,null,null,""]
["S961",null,null,null,null,null,null,0,null,null,null,null,null,{"$f":"IF(I1971=\"Sim\",L1971*M1971,K1971*J1971)","v":0},null,null,null,null,null,null,null,null,null,null,null,""]
["S962",null,null,null,null,null,null,0,null,null,null,null,null,0,null,null,null,null,null,null,null,null,null,null,null,""]
["S963",null,null,null,null,null,null,0,null,null,null,null,null,0,null,null,null,null,null,null,null,null,null,null,null,""]
["S964",null,null,null,null,null,null,0,null,null,null,null,null,0,null,null,null,null,null,null,null,null,null,null,null,""]
["S965",null,null,null,null,null,null,0,null,null,null,null,null,0,null,null,null,null,null,null,null,null,null,null,null,""]
["S966",null,null,null,null,null,null,0,null,null,null,null,null,0,null,null,null,null,null,null,null,null,null,null,null,""]
["S967",null,null,null,null,null,null,0,null,null,null,null,null,0,null,null,null,null,null,null,null,null,null,null,null,""]
["S968",null,null,null,null,null,null,0,null,null,null,null,null,0,null,null,null,null,null,null,null,null,null,null,null,""]
["S969",null,null,null,null,null,null,0,null,null,null,null,null,0,null,null,null,null,null,null,null,null,null,null,null,""]
["S970",null,null,null,null,null,null,0,null,null,null,null,null,0,null,null,null,null,null,null,null,null,null,null,null,""]
["S971",null,null,null,null,null,null,0,null,null,null,null,null,0,null,null,null,null,null,null,null,null,null,null,null,""]
["S972",null,null,null,null,null,null,0,null,null,null,null,null,0,null,null,null,null,null,null,null,null,null,null,null,""]
["S973",null,null,null,null,null,null,0,null,null,null,null,null,0,null,null,null,null,null,null,null,null,null,null,null,""]
["S974",null,null,null,null,null,null,0,null,null,null,null,null,0,null,null,null,null,null,null,null,null,null,null,null,""]
["S975",null,null,null,null,null,null,0,null,null,null,null,null,0,null,null,null,null,null,null,null,null,null,null,null,""]
["S976",null,null,null,null,null,null,0,null,null,null,null,null,0,null,null,null,null,null,null,null,null,null,null,null,""]
["S977",null,null,null,null,null,null,0,null,null,null,null,null,0,null,null,null,null,null,null,null,null,null,null,null,""]
["S978",null,null,null,null,null,null,0,null,null,null,null,null,0,null,null,null,null,null,null,null,null,null,null,null,""]
["S979",null,null,null,null,null,null,0,null,null,null,null,null,0,null,null,null,null,null,null,null,null,null,null,null,""]
["S980",null,null,null,null,null,null,0,null,null,null,null,null,0,null,null,null,null,null,null,null,null,null,null,null,""]
["S981",null,null,null,null,null,null,0,null,null,null,null,null,0,null,null,null,null,null,null,null,null,null,null,null,""]
["S982",null,null,null,null,null,null,0,null,null,null,null,null,0,null,null,null,null,null,null,null,null,null,null,null,{"$f":"SUBSTITUTE(B1993,\" \",\"_\")","v":""}]
["S983",null,null,null,null,null,null,0,null,null,null,null,null,0,null,null,null,null,null,null,null,null,null,null,null,""]
["S984",null,null,null,null,null,null,{"$f":"(E1994+F1994+G1994)/3","v":0},null,null,null,null,null,0,null,null,null,null,null,null,null,null,null,null,null,""]
["S985",null,null,null,null,null,null,0,null,null,null,null,null,0,null,null,null,null,null,null,null,null,null,null,null,""]
["S986",null,null,null,null,null,null,0,null,null,null,null,null,0,null,null,null,null,null,null,null,null,null,null,null,""]
["S987",null,null,null,null,null,null,0,null,null,null,null,null,0,null,null,null,null,null,null,null,null,null,null,null,""]
["S988",null,null,null,null,null,null,0,null,null,null,null,null,0,null,null,null,null,null,null,null,null,null,null,null,""]
["S989",null,null,null,null,null,null,0,null,null,null,null,null,0,null,null,null,null,null,null,null,null,null,null,null,""]
["S990",null,null,null,null,null,null,0,null,null,null,null,null,0,null,null,null,null,null,null,null,null,null,null,null,""]
["S991",null,null,null,null,null,null,0,null,null,null,null,null,0,null,null,null,null,null,null,null,null,null,null,null,""]
["S992",null,null,null,null,null,null,0,null,null,null,null,null,0,null,null,null,null,null,null,null,null,null,null,null,""]
["S993",null,null,null,null,null,null,0,null,null,null,null,null,0,null,null,null,null,null,null,null,null,null,null,null,""]
["S994",null,null,null,null,null,null,0,null,null,null,null,null,0,null,null,null,null,null,null,null,null,null,null,null,""]
["S995",null,null,null,null,null,null,0,null,null,null,null,null,0,null,null,null,null,null,null,null,null,null,null,null,""]
["S996",null,null,null,null,null,null,0,null,null,null,null,null,0,null,null,null,null,null,null,null,null,null,null,null,""]
["S997",null,null,null,null,null,null,0,null,null,null,null,null,0,null,null,null,null,null,null,null,null,null,null,null,""]
["S998",null,null,null,null,null,null,0,null,null,null,null,null,0,null,null,null,null,null,null,null,null,null,null,null,""]
["S999",null,null,null,null,null,null,0,null,null,null,null,null,0,null,null,null,null,null,null,null,null,null,null,null,""]
["S1000",null,null,null,null,null,null,0,null,null,null,null,null,0,null,null,null,null,null,null,null,null,null,null,null,""]
["TOTAL SERVIÇOS",null,null,null,null,null,null,null,null,null,null,null,null,{"$f":"SUM(N1011:N2010)","v":0},null,null,null,null,null,null,null,null,null,null,null,""]
["TOTAL GLOBAL",null,null,null,null,null,null,null,null,null,null,null,null,{"$f":"N2011+N1009","v":0},null,null,null,null,null,null,null,null,null,null,null,""]
[null,null,null,null,null,null,null,null,null,null,null,null,null,null,null,null,null,null,null,null,null,null,null,null,null,{"$f":"SUBSTITUTE(B2017,\" \",\"_\")","v":""}]
["Declaro, em atendimento ao art.53, § 3°, do Decreto Estadual n°47.132/17, que os valores contidos nesta tabela correspondem ao rateio de despesas fixas (caso a OSC possua mais de uma parceria ou desenvolva outros projetos ou atividades com a mesma estrutura), utilizando como parâmetro a proporcionalidade do uso efetivo nesta parceria.",null,null,null,null,null,null,null,null,null,null,null,null,null,null,null,null,null,null,null,null,null,null,null,null,{"$f":"SUBSTITUTE(B2018,\" \",\"_\")","v":""}]
[null,null,null,null,null,null,null,null,null,null,null,null,null,null,null,null,null,null,null,null,null,null,null,null,null,{"$f":"SUBSTITUTE(B2019,\" \",\"_\")","v":""}]
[null,null,null,null,null,null,null,null,null,null,null,null,null,null,null,null,null,null,null,null,null,null,null,null,null,{"$f":"SUBSTITUTE(#REF!,\" \",\"_\")","v":{"$error":"#REF!"}}]
[null,null,null,null,null,null,null,null,null,null,null,null,null,null,null,null,null,null,null,null,null,null,null,null,null,{"$f":"SUBSTITUTE(#REF!,\" \",\"_\")","v":{"$error":"#REF!"}}]
[null,null,null,null,null,null,null,null,null,null,null,null,null,null,null,null,null,null,null,null,null,null,null,null,null,{"$f":"SUBSTITUTE(B2020,\" \",\"_\")","v":""}]
["Assinatura do Representante Legal da OSC: __________________________________________________________ Local e Data: ____________________________________________",null,null,null,null,null,null,null,null,null,null,null,null,null,null,null,null,null,null,null,null,null,null,null,null,{"$f":"SUBSTITUTE(#REF!,\" \",\"_\")","v":{"$error":"#REF!"}}]
[null,null,null,null,null,null,null,null,null,null,null,null,null,null,null,null,null,null,null,null,null,null,null,null,null,{"$f":"SUBSTITUTE(B2021,\" \",\"_\")","v":""}]
[null,null,null,null,null,null,null,null,null,null,null,null,null,null,null,null,null,null,null,null,null,null,null,null,null,""]
[null,null,null,null,null,null,null,null,null,null,null,null,null,null,null,null,null,null,null,null,null,null,null,null,null,""]
[null,null,null,null,null,null,null,null,null,null,null,null,null,null,null,null,null,null,null,null,null,null,null,null,null,""]
[null,null,null,null,null,null,null,null,null,null,null,null,null,null,null,null,null,null,null,null,null,null,null,null,null,""]
[null,null,null,null,null,null,null,null,null,null,null,null,null,null,null,null,null,null,null,null,null,null,null,null,null,""]
[null,null,null,null,null,null,null,null,null,null,null,null,null,null,null,null,null,null,null,null,null,null,null,null,null,""]
[null,null,null,null,null,null,null,null,null,null,null,null,null,null,null,null,null,null,null,null,null,null,null,null,null,""]
[null,null,null,null,null,null,null,null,null,null,null,null,null,null,null,null,null,null,null,null,null,null,null,null,null,""]
[null,null,null,null,null,null,null,null,null,null,null,null,null,null,null,null,null,null,null,null,null,null,null,null,null,""]
[null,null,null,null,null,null,null,null,null,null,null,null,null,null,null,null,null,null,null,null,null,null,null,null,null,""]
[null,null,null,null,null,null,null,null,null,null,null,null,null,null,null,null,null,null,null,null,null,null,null,null,null,""]
[null,null,null,null,null,null,null,null,null,null,null,null,null,null,null,null,null,null,null,null,null,null,null,null,null,""]
[null,null,null,null,null,null,null,null,null,null,null,null,null,null,null,null,null,null,null,null,null,null,null,null,null,""]
[null,null,null,null,null,null,null,null,null,null,null,null,null,null,null,null,null,null,null,null,null,null,null,null,null,""]
[null,null,null,null,null,null,null,null,null,null,null,null,null,null,null,null,null,null,null,null,null,null,null,null,null,""]
[null,null,null,null,null,null,null,null,null,null,null,null,null,null,null,null,null,null,null,null,null,null,null,null,null,""]
[null,null,null,null,null,null,null,null,null,null,null,null,null,null,null,null,null,null,null,null,null,null,null,null,null,""]
[null,null,null,null,null,null,null,null,null,null,null,null,null,null,null,null,null,null,null,null,null,null,null,null,null,""]
[null,null,null,null,null,null,null,null,null,null,null,null,null,null,null,null,null,null,null,null,null,null,null,null,null,""]
[null,null,null,null,null,null,null,null,null,null,null,null,null,null,null,null,null,null,null,null,null,null,null,null,null,""]
[null,null,null,null,null,null,null,null,null,null,null,null,null,null,null,null,null,null,null,null,null,null,null,null,null,""]
[null,null,null,null,null,null,null,null,null,null,null,null,null,null,null,null,null,null,null,null,null,null,null,null,null,""]
[null,null,null,null,null,null,null,null,null,null,null,null,null,null,null,null,null,null,null,null,null,null,null,null,null,""]
[null,null,null,null,null,null,null,null,null,null,null,null,null,null,null,null,null,null,null,null,null,null,null,null,null,""]
[null,null,null,null,null,null,null,null,null,null,null,null,null,null,null,null,null,null,null,null,null,null,null,null,null,""]
[null,null,null,null,null,null,null,null,null,null,null,null,null,null,null,null,null,null,null,null,null,null,null,null,null,""]
[null,null,null,null,null,null,null,null,null,null,null,null,null,null,null,null,null,null,null,null,null,null,null,null,null,""]
[null,null,null,null,null,null,null,null,null,null,null,null,null,null,null,null,null,null,null,null,null,null,null,null,null,""]
[null,null,null,null,null,null,null,null,null,null,null,null,null,null,null,null,null,null,null,null,null,null,null,null,null,""]
[null,null,null,null,null,null,null,null,null,null,null,null,null,null,null,null,null,null,null,null,null,null,null,null,null,""]
[null,null,null,null,null,null,null,null,null,null,null,null,null,null,null,null,null,null,null,null,null,null,null,null,null,""]
[null,null,null,null,null,null,null,null,null,null,null,null,null,null,null,null,null,null,null,null,null,null,null,null,null,""]
[null,null,null,null,null,null,null,null,null,null,null,null,null,null,null,null,null,null,null,null,null,null,null,null,null,""]
[null,null,null,null,null,null,null,null,null,null,null,null,null,null,null,null,null,null,null,null,null,null,null,null,null,""]
[null,null,null,null,null,null,null,null,null,null,null,null,null,null,null,null,null,null,null,null,null,null,null,null,null,""]
[null,null,null,null,null,null,null,null,null,null,null,null,null,null,null,null,null,null,null,null,null,null,null,null,null,""]
[null,null,null,null,null,null,null,null,null,null,null,null,null,null,null,null,null,null,null,null,null,null,null,null,null,{"$f":"SUBSTITUTE(B2058,\" \",\"_\")","v":""}]
[null,null,null,null,null,null,null,null,null,null,null,null,null,null,null,null,null,null,null,null,null,null,null,null,null,""]
[null,null,null,null,null,null,null,null,null,null,null,null,null,null,null,null,null,null,null,null,null,null,null,null,null,""]
[null,null,null,null,null,null,null,null,null,null,null,null,null,null,null,null,null,null,null,null,null,null,null,null,null,""]
[null,null,null,null,null,null,null,null,null,null,null,null,null,null,null,null,null,null,null,null,null,null,null,null,null,""]
[null,null,null,null,null,null,null,null,null,null,null,null,null,null,null,null,null,null,null,null,null,null,null,null,null,""]
[null,null,null,null,null,null,null,null,null,null,null,null,null,null,null,null,null,null,null,null,null,null,null,null,null,""]
[null,null,null,null,null,null,null,null,null,null,null,null,null,null,null,null,null,null,null,null,null,null,null,null,null,""]
[null,null,null,null,null,null,null,null,null,null,null,null,null,null,null,null,null,null,null,null,null,null,null,null,null,""]
[null,null,null,null,null,null,null,null,null,null,null,null,null,null,null,null,null,null,null,null,null,null,null,null,null,""]
[null,null,null,null,null,null,null,null,null,null,null,null,null,null,null,null,null,null,null,null,null,null,null,null,null,""]
[null,null,null,null,null,null,null,null,null,null,null,null,null,null,null,null,null,null,null,null,null,null,null,null,null,""]
[null,null,null,null,null,null,null,null,null,null,null,null,null,null,null,null,null,null,null,null,null,null,null,null,null,""]
[null,null,null,null,null,null,null,null,null,null,null,null,null,null,null,null,null,null,null,null,null,null,null,null,null,""]
[null,null,null,null,null,null,null,null,null,null,null,null,null,null,null,null,null,null,null,null,null,null,null,null,null,""]
[null,null,null,null,null,null,null,null,null,null,null,null,null,null,null,null,null,null,null,null,null,null,null,null,null,""]
[null,null,null,null,null,null,null,null,null,null,null,null,null,null,null,null,null,null,null,null,null,null,null,null,null,""]
[null,null,null,null,null,null,null,null,null,null,null,null,null,null,null,null,null,null,null,null,null,null,null,null,null,""]
[null,null,null,null,null,null,null,null,null,null,null,null,null,null,null,null,null,null,null,null,null,null,null,null,null,""]
[null,null,null,null,null,null,null,null,null,null,null,null,null,null,null,null,null,null,null,null,null,null,null,null,null,""]
[null,null,null,null,null,null,null,null,null,null,null,null,null,null,null,null,null,null,null,null,null,null,null,null,null,""]
[null,null,null,null,null,null,null,null,null,null,null,null,null,null,null,null,null,null,null,null,null,null,null,null,null,""]
[null,null,null,null,null,null,null,null,null,null,null,null,null,null,null,null,null,null,null,null,null,null,null,null,null,""]
[null,null,null,null,null,null,null,null,null,null,null,null,null,null,null,null,null,null,null,null,null,null,null,null,null,""]
[null,null,null,null,null,null,null,null,null,null,null,null,null,null,null,null,null,null,null,null,null,null,null,null,null,""]
[null,null,null,null,null,null,null,null,null,null,null,null,null,null,null,null,null,null,null,null,null,null,null,null,null,""]
[null,null,null,null,null,null,null,null,null,null,null,null,null,null,null,null,null,null,null,null,null,null,null,null,null,""]
[null,null,null,null,null,null,null,null,null,null,null,null,null,null,null,null,null,null,null,null,null,null,null,null,null,""]
[null,null,null,null,null,null,null,null,null,null,null,null,null,null,null,null,null,null,null,null,null,null,null,null,null,""]
[null,null,null,null,null,null,null,null,null,null,null,null,null,null,null,null,null,null,null,null,null,null,null,null,null,""]
[null,null,null,null,null,null,null,null,null,null,null,null,null,null,null,null,null,null,null,null,null,null,null,null,null,""]
[null,null,null,null,null,null,null,null,null,null,null,null,null,null,null,null,null,null,null,null,null,null,null,null,null,""]
[null,null,null,null,null,null,null,null,null,null,null,null,null,null,null,null,null,null,null,null,null,null,null,null,null,""]
[null,null,null,null,null,null,null,null,null,null,null,null,null,null,null,null,null,null,null,null,null,null,null,null,null,""]
[null,null,null,null,null,null,null,null,null,null,null,null,null,null,null,null,null,null,null,null,null,null,null,null,null,""]
[null,null,null,null,null,null,null,null,null,null,null,null,null,null,null,null,null,null,null,null,null,null,null,null,null,""]
[null,null,null,null,null,null,null,null,null,null,null,null,null,null,null,null,null,null,null,null,null,null,null,null,null,""]
[null,null,null,null,null,null,null,null,null,null,null,null,null,null,null,null,null,null,null,null,null,null,null,null,null,""]
[null,null,null,null,null,null,null,null,null,null,null,null,null,null,null,null,null,null,null,null,null,null,null,null,null,""]
[null,null,null,null,null,null,null,null,null,null,null,null,null,null,null,null,null,null,null,null,null,null,null,null,null,""]
[null,null,null,null,null,null,null,null,null,null,null,null,null,null,null,null,null,null,null,null,null,null,null,null,null,""]
[null,null,null,null,null,null,null,null,null,null,null,null,null,null,null,null,null,null,null,null,null,null,null,null,null,""]
[null,null,null,null,null,null,null,null,null,null,null,null,null,null,null,null,null,null,null,null,null,null,null,null,null,""]
[null,null,null,null,null,null,null,null,null,null,null,null,null,null,null,null,null,null,null,null,null,null,null,null,null,""]
[null,null,null,null,null,null,null,null,null,null,null,null,null,null,null,null,null,null,null,null,null,null,null,null,null,""]
[null,null,null,null,null,null,null,null,null,null,null,null,null,null,null,null,null,null,null,null,null,null,null,null,null,""]
[null,null,null,null,null,null,null,null,null,null,null,null,null,null,null,null,null,null,null,null,null,null,null,null,null,""]
[null,null,null,null,null,null,null,null,null,null,null,null,null,null,null,null,null,null,null,null,null,null,null,null,null,""]
[null,null,null,null,null,null,null,null,null,null,null,null,null,null,null,null,null,null,null,null,null,null,null,null,null,""]
[null,null,null,null,null,null,null,null,null,null,null,null,null,null,null,null,null,null,null,null,null,null,null,null,null,""]
[null,null,null,null,null,null,null,null,null,null,null,null,null,null,null,null,null,null,null,null,null,null,null,null,null,""]
[null,null,null,null,null,null,null,null,null,null,null,null,null,null,null,null,null,null,null,null,null,null,null,null,null,""]
[null,null,null,null,null,null,null,null,null,null,null,null,null,null,null,null,null,null,null,null,null,null,null,null,null,""]
[null,null,null,null,null,null,null,null,null,null,null,null,null,null,null,null,null,null,null,null,null,null,null,null,null,""]
[null,null,null,null,null,null,null,null,null,null,null,null,null,null,null,null,null,null,null,null,null,null,null,null,null,""]
[null,null,null,null,null,null,null,null,null,null,null,null,null,null,null,null,null,null,null,null,null,null,null,null,null,""]
[null,null,null,null,null,null,null,null,null,null,null,null,null,null,null,null,null,null,null,null,null,null,null,null,null,""]
[null,null,null,null,null,null,null,null,null,null,null,null,null,null,null,null,null,null,null,null,null,null,null,null,null,""]
[null,null,null,null,null,null,null,null,null,null,null,null,null,null,null,null,null,null,null,null,null,null,null,null,null,""]
[null,null,null,null,null,null,null,null,null,null,null,null,null,null,null,null,null,null,null,null,null,null,null,null,null,""]
[null,null,null,null,null,null,null,null,null,null,null,null,null,null,null,null,null,null,null,null,null,null,null,null,null,""]
[null,null,null,null,null,null,null,null,null,null,null,null,null,null,null,null,null,null,null,null,null,null,null,null,null,""]
[null,null,null,null,null,null,null,null,null,null,null,null,null,null,null,null,null,null,null,null,null,null,null,null,null,""]
[null,null,null,null,null,null,null,null,null,null,null,null,null,null,null,null,null,null,null,null,null,null,null,null,null,""]
[null,null,null,null,null,null,null,null,null,null,null,null,null,null,null,null,null,null,null,null,null,null,null,null,null,{"$f":"SUBSTITUTE(B2122,\" \",\"_\")","v":""}]
[null,null,null,null,null,null,null,null,null,null,null,null,null,null,null,null,null,null,null,null,null,null,null,null,null,""]
[null,null,null,null,null,null,null,null,null,null,null,null,null,null,null,null,null,null,null,null,null,null,null,null,null,""]
[null,null,null,null,null,null,null,null,null,null,null,null,null,null,null,null,null,null,null,null,null,null,null,null,null,""]
[null,null,null,null,null,null,null,null,null,null,null,null,null,null,null,null,null,null,null,null,null,null,null,null,null,""]
[null,null,null,null,null,null,null,null,null,null,null,null,null,null,null,null,null,null,null,null,null,null,null,null,null,""]
[null,null,null,null,null,null,null,null,null,null,null,null,null,null,null,null,null,null,null,null,null,null,null,null,null,""]
[null,null,null,null,null,null,null,null,null,null,null,null,null,null,null,null,null,null,null,null,null,null,null,null,null,""]
[null,null,null,null,null,null,null,null,null,null,null,null,null,null,null,null,null,null,null,null,null,null,null,null,null,""]
[null,null,null,null,null,null,null,null,null,null,null,null,null,null,null,null,null,null,null,null,null,null,null,null,null,""]
[null,null,null,null,null,null,null,null,null,null,null,null,null,null,null,null,null,null,null,null,null,null,null,null,null,""]
[null,null,null,null,null,null,null,null,null,null,null,null,null,null,null,null,null,null,null,null,null,null,null,null,null,""]
[null,null,null,null,null,null,null,null,null,null,null,null,null,null,null,null,null,null,null,null,null,null,null,null,null,""]
[null,null,null,null,null,null,null,null,null,null,null,null,null,null,null,null,null,null,null,null,null,null,null,null,null,""]
[null,null,null,null,null,null,null,null,null,null,null,null,null,null,null,null,null,null,null,null,null,null,null,null,null,""]
[null,null,null,null,null,null,null,null,null,null,null,null,null,null,null,null,null,null,null,null,null,null,null,null,null,""]
[null,null,null,null,null,null,null,null,null,null,null,null,null,null,null,null,null,null,null,null,null,null,null,null,null,""]
[null,null,null,null,null,null,null,null,null,null,null,null,null,null,null,null,null,null,null,null,null,null,null,null,null,""]
[null,null,null,null,null,null,null,null,null,null,null,null,null,null,null,null,null,null,null,null,null,null,null,null,null,""]
[null,null,null,null,null,null,null,null,null,null,null,null,null,null,null,null,null,null,null,null,null,null,null,null,null,""]
[null,null,null,null,null,null,null,null,null,null,null,null,null,null,null,null,null,null,null,null,null,null,null,null,null,""]
[null,null,null,null,null,null,null,null,null,null,null,null,null,null,null,null,null,null,null,null,null,null,null,null,null,""]
[null,null,null,null,null,null,null,null,null,null,null,null,null,null,null,null,null,null,null,null,null,null,null,null,null,""]
[null,null,null,null,null,null,null,null,null,null,null,null,null,null,null,null,null,null,null,null,null,null,null,null,null,""]
[null,null,null,null,null,null,null,null,null,null,null,null,null,null,null,null,null,null,null,null,null,null,null,null,null,""]
[null,null,null,null,null,null,null,null,null,null,null,null,null,null,null,null,null,null,null,null,null,null,null,null,null,""]
[null,null,null,null,null,null,null,null,null,null,null,null,null,null,null,null,null,null,null,null,null,null,null,null,null,""]
[null,null,null,null,null,null,null,null,null,null,null,null,null,null,null,null,null,null,null,null,null,null,null,null,null,""]
[null,null,null,null,null,null,null,null,null,null,null,null,null,null,null,null,null,null,null,null,null,null,null,null,null,""]
[null,null,null,null,null,null,null,null,null,null,null,null,null,null,null,null,null,null,null,null,null,null,null,null,null,""]
[null,null,null,null,null,null,null,null,null,null,null,null,null,null,null,null,null,null,null,null,null,null,null,null,null,""]
[null,null,null,null,null,null,null,null,null,null,null,null,null,null,null,null,null,null,null,null,null,null,null,null,null,""]
[null,null,null,null,null,null,null,null,null,null,null,null,null,null,null,null,null,null,null,null,null,null,null,null,null,""]
[null,null,null,null,null,null,null,null,null,null,null,null,null,null,null,null,null,null,null,null,null,null,null,null,null,""]
[null,null,null,null,null,null,null,null,null,null,null,null,null,null,null,null,null,null,null,null,null,null,null,null,null,""]
[null,null,null,null,null,null,null,null,null,null,null,null,null,null,null,null,null,null,null,null,null,null,null,null,null,""]
[null,null,null,null,null,null,null,null,null,null,null,null,null,null,null,null,null,null,null,null,null,null,null,null,null,""]
[null,null,null,null,null,null,null,null,null,null,null,null,null,null,null,null,null,null,null,null,null,null,null,null,null,""]
[null,null,null,null,null,null,null,null,null,null,null,null,null,null,null,null,null,null,null,null,null,null,null,null,null,""]
[null,null,null,null,null,null,null,null,null,null,null,null,null,null,null,null,null,null,null,null,null,null,null,null,null,""]
[null,null,null,null,null,null,null,null,null,null,null,null,null,null,null,null,null,null,null,null,null,null,null,null,null,""]
[null,null,null,null,null,null,null,null,null,null,null,null,null,null,null,null,null,null,null,null,null,null,null,null,null,""]
[null,null,null,null,null,null,null,null,null,null,null,null,null,null,null,null,null,null,null,null,null,null,null,null,null,""]
[null,null,null,null,null,null,null,null,null,null,null,null,null,null,null,null,null,null,null,null,null,null,null,null,null,""]
[null,null,null,null,null,null,null,null,null,null,null,null,null,null,null,null,null,null,null,null,null,null,null,null,null,""]
[null,null,null,null,null,null,null,null,null,null,null,null,null,null,null,null,null,null,null,null,null,null,null,null,null,""]
[null,null,null,null,null,null,null,null,null,null,null,null,null,null,null,null,null,null,null,null,null,null,null,null,null,""]
[null,null,null,null,null,null,null,null,null,null,null,null,null,null,null,null,null,null,null,null,null,null,null,null,null,""]
[null,null,null,null,null,null,null,null,null,null,null,null,null,null,null,null,null,null,null,null,null,null,null,null,null,""]
[null,null,null,null,null,null,null,null,null,null,null,null,null,null,null,null,null,null,null,null,null,null,null,null,null,""]
[null,null,null,null,null,null,null,null,null,null,null,null,null,null,null,null,null,null,null,null,null,null,null,null,null,""]
[null,null,null,null,null,null,null,null,null,null,null,null,null,null,null,null,null,null,null,null,null,null,null,null,null,""]
[null,null,null,null,null,null,null,null,null,null,null,null,null,null,null,null,null,null,null,null,null,null,null,null,null,""]
[null,null,null,null,null,null,null,null,null,null,null,null,null,null,null,null,null,null,null,null,null,null,null,null,null,""]
[null,null,null,null,null,null,null,null,null,null,null,null,null,null,null,null,null,null,null,null,null,null,null,null,null,""]
[null,null,null,null,null,null,null,null,null,null,null,null,null,null,null,null,null,null,null,null,null,null,null,null,null,""]
[null,null,null,null,null,null,null,null,null,null,null,null,null,null,null,null,null,null,null,null,null,null,null,null,null,""]
[null,null,null,null,null,null,null,null,null,null,null,null,null,null,null,null,null,null,null,null,null,null,null,null,null,""]
[null,null,null,null,null,null,null,null,null,null,null,null,null,null,null,null,null,null,null,null,null,null,null,null,null,""]
[null,null,null,null,null,null,null,null,null,null,null,null,null,null,null,null,null,null,null,null,null,null,null,null,null,""]
[null,null,null,null,null,null,null,null,null,null,null,null,null,null,null,null,null,null,null,null,null,null,null,null,null,""]
[null,null,null,null,null,null,null,null,null,null,null,null,null,null,null,null,null,null,null,null,null,null,null,null,null,""]
[null,null,null,null,null,null,null,null,null,null,null,null,null,null,null,null,null,null,null,null,null,null,null,null,null,""]
[null,null,null,null,null,null,null,null,null,null,null,null,null,null,null,null,null,null,null,null,null,null,null,null,null,""]
[null,null,null,null,null,null,null,null,null,null,null,null,null,null,null,null,null,null,null,null,null,null,null,null,null,{"$f":"SUBSTITUTE(B2186,\" \",\"_\")","v":""}]
[null,null,null,null,null,null,null,null,null,null,null,null,null,null,null,null,null,null,null,null,null,null,null,null,null,""]
[null,null,null,null,null,null,null,null,null,null,null,null,null,null,null,null,null,null,null,null,null,null,null,null,null,""]
[null,null,null,null,null,null,null,null,null,null,null,null,null,null,null,null,null,null,null,null,null,null,null,null,null,""]
[null,null,null,null,null,null,null,null,null,null,null,null,null,null,null,null,null,null,null,null,null,null,null,null,null,""]
[null,null,null,null,null,null,null,null,null,null,null,null,null,null,null,null,null,null,null,null,null,null,null,null,null,""]
[null,null,null,null,null,null,null,null,null,null,null,null,null,null,null,null,null,null,null,null,null,null,null,null,null,""]
[null,null,null,null,null,null,null,null,null,null,null,null,null,null,null,null,null,null,null,null,null,null,null,null,null,""]
[null,null,null,null,null,null,null,null,null,null,null,null,null,null,null,null,null,null,null,null,null,null,null,null,null,""]
[null,null,null,null,null,null,null,null,null,null,null,null,null,null,null,null,null,null,null,null,null,null,null,null,null,""]
[null,null,null,null,null,null,null,null,null,null,null,null,null,null,null,null,null,null,null,null,null,null,null,null,null,""]
[null,null,null,null,null,null,null,null,null,null,null,null,null,null,null,null,null,null,null,null,null,null,null,null,null,""]
[null,null,null,null,null,null,null,null,null,null,null,null,null,null,null,null,null,null,null,null,null,null,null,null,null,""]
[null,null,null,null,null,null,null,null,null,null,null,null,null,null,null,null,null,null,null,null,null,null,null,null,null,""]
[null,null,null,null,null,null,null,null,null,null,null,null,null,null,null,null,null,null,null,null,null,null,null,null,null,""]
[null,null,null,null,null,null,null,null,null,null,null,null,null,null,null,null,null,null,null,null,null,null,null,null,null,""]
[null,null,null,null,null,null,null,null,null,null,null,null,null,null,null,null,null,null,null,null,null,null,null,null,null,""]
[null,null,null,null,null,null,null,null,null,null,null,null,null,null,null,null,null,null,null,null,null,null,null,null,null,""]
[null,null,null,null,null,null,null,null,null,null,null,null,null,null,null,null,null,null,null,null,null,null,null,null,null,""]
[null,null,null,null,null,null,null,null,null,null,null,null,null,null,null,null,null,null,null,null,null,null,null,null,null,""]
[null,null,null,null,null,null,null,null,null,null,null,null,null,null,null,null,null,null,null,null,null,null,null,null,null,""]
[null,null,null,null,null,null,null,null,null,null,null,null,null,null,null,null,null,null,null,null,null,null,null,null,null,""]
[null,null,null,null,null,null,null,null,null,null,null,null,null,null,null,null,null,null,null,null,null,null,null,null,null,""]
[null,null,null,null,null,null,null,null,null,null,null,null,null,null,null,null,null,null,null,null,null,null,null,null,null,""]
[null,null,null,null,null,null,null,null,null,null,null,null,null,null,null,null,null,null,null,null,null,null,null,null,null,""]
[null,null,null,null,null,null,null,null,null,null,null,null,null,null,null,null,null,null,null,null,null,null,null,null,null,""]
[null,null,null,null,null,null,null,null,null,null,null,null,null,null,null,null,null,null,null,null,null,null,null,null,null,""]
[null,null,null,null,null,null,null,null,null,null,null,null,null,null,null,null,null,null,null,null,null,null,null,null,null,""]
[null,null,null,null,null,null,null,null,null,null,null,null,null,null,null,null,null,null,null,null,null,null,null,null,null,""]
[null,null,null,null,null,null,null,null,null,null,null,null,null,null,null,null,null,null,null,null,null,null,null,null,null,""]
[null,null,null,null,null,null,null,null,null,null,null,null,null,null,null,null,null,null,null,null,null,null,null,null,null,""]
[null,null,null,null,null,null,null,null,null,null,null,null,null,null,null,null,null,null,null,null,null,null,null,null,null,""]
[null,null,null,null,null,null,null,null,null,null,null,null,null,null,null,null,null,null,null,null,null,null,null,null,null,""]
[null,null,null,null,null,null,null,null,null,null,null,null,null,null,null,null,null,null,null,null,null,null,null,null,null,""]
[null,null,null,null,null,null,null,null,null,null,null,null,null,null,null,null,null,null,null,null,null,null,null,null,null,""]
[null,null,null,null,null,null,null,null,null,null,null,null,null,null,null,null,null,null,null,null,null,null,null,null,null,""]
[null,null,null,null,null,null,null,null,null,null,null,null,null,null,null,null,null,null,null,null,null,null,null,null,null,""]
[null,null,null,null,null,null,null,null,null,null,null,null,null,null,null,null,null,null,null,null,null,null,null,null,null,""]
[null,null,null,null,null,null,null,null,null,null,null,null,null,null,null,null,null,null,null,null,null,null,null,null,null,""]
[null,null,null,null,null,null,null,null,null,null,null,null,null,null,null,null,null,null,null,null,null,null,null,null,null,""]
[null,null,null,null,null,null,null,null,null,null,null,null,null,null,null,null,null,null,null,null,null,null,null,null,null,""]
[null,null,null,null,null,null,null,null,null,null,null,null,null,null,null,null,null,null,null,null,null,null,null,null,null,""]
[null,null,null,null,null,null,null,null,null,null,null,null,null,null,null,null,null,null,null,null,null,null,null,null,null,""]
[null,null,null,null,null,null,null,null,null,null,null,null,null,null,null,null,null,null,null,null,null,null,null,null,null,""]
[null,null,null,null,null,null,null,null,null,null,null,null,null,null,null,null,null,null,null,null,null,null,null,null,null,""]
[null,null,null,null,null,null,null,null,null,null,null,null,null,null,null,null,null,null,null,null,null,null,null,null,null,""]
[null,null,null,null,null,null,null,null,null,null,null,null,null,null,null,null,null,null,null,null,null,null,null,null,null,""]
[null,null,null,null,null,null,null,null,null,null,null,null,null,null,null,null,null,null,null,null,null,null,null,null,null,""]
[null,null,null,null,null,null,null,null,null,null,null,null,null,null,null,null,null,null,null,null,null,null,null,null,null,""]
[null,null,null,null,null,null,null,null,null,null,null,null,null,null,null,null,null,null,null,null,null,null,null,null,null,""]
[null,null,null,null,null,null,null,null,null,null,null,null,null,null,null,null,null,null,null,null,null,null,null,null,null,""]
[null,null,null,null,null,null,null,null,null,null,null,null,null,null,null,null,null,null,null,null,null,null,null,null,null,""]
[null,null,null,null,null,null,null,null,null,null,null,null,null,null,null,null,null,null,null,null,null,null,null,null,null,""]
[null,null,null,null,null,null,null,null,null,null,null,null,null,null,null,null,null,null,null,null,null,null,null,null,null,""]
[null,null,null,null,null,null,null,null,null,null,null,null,null,null,null,null,null,null,null,null,null,null,null,null,null,""]
[null,null,null,null,null,null,null,null,null,null,null,null,null,null,null,null,null,null,null,null,null,null,null,null,null,""]
[null,null,null,null,null,null,null,null,null,null,null,null,null,null,null,null,null,null,null,null,null,null,null,null,null,""]
[null,null,null,null,null,null,null,null,null,null,null,null,null,null,null,null,null,null,null,null,null,null,null,null,null,""]
[null,null,null,null,null,null,null,null,null,null,null,null,null,null,null,null,null,null,null,null,null,null,null,null,null,""]
[null,null,null,null,null,null,null,null,null,null,null,null,null,null,null,null,null,null,null,null,null,null,null,null,null,""]
[null,null,null,null,null,null,null,null,null,null,null,null,null,null,null,null,null,null,null,null,null,null,null,null,null,""]
[null,null,null,null,null,null,null,null,null,null,null,null,null,null,null,null,null,null,null,null,null,null,null,null,null,""]
[null,null,null,null,null,null,null,null,null,null,null,null,null,null,null,null,null,null,null,null,null,null,null,null,null,""]
[null,null,null,null,null,null,null,null,null,null,null,null,null,null,null,null,null,null,null,null,null,null,null,null,null,""]
[null,null,null,null,null,null,null,null,null,null,null,null,null,null,null,null,null,null,null,null,null,null,null,null,null,{"$f":"SUBSTITUTE(B2250,\" \",\"_\")","v":""}]
[null,null,null,null,null,null,null,null,null,null,null,null,null,null,null,null,null,null,null,null,null,null,null,null,null,""]
[null,null,null,null,null,null,null,null,null,null,null,null,null,null,null,null,null,null,null,null,null,null,null,null,null,""]
[null,null,null,null,null,null,null,null,null,null,null,null,null,null,null,null,null,null,null,null,null,null,null,null,null,""]
[null,null,null,null,null,null,null,null,null,null,null,null,null,null,null,null,null,null,null,null,null,null,null,null,null,""]
[null,null,null,null,null,null,null,null,null,null,null,null,null,null,null,null,null,null,null,null,null,null,null,null,null,""]
[null,null,null,null,null,null,null,null,null,null,null,null,null,null,null,null,null,null,null,null,null,null,null,null,null,""]
[null,null,null,null,null,null,null,null,null,null,null,null,null,null,null,null,null,null,null,null,null,null,null,null,null,""]
[null,null,null,null,null,null,null,null,null,null,null,null,null,null,null,null,null,null,null,null,null,null,null,null,null,""]
[null,null,null,null,null,null,null,null,null,null,null,null,null,null,null,null,null,null,null,null,null,null,null,null,null,""]
[null,null,null,null,null,null,null,null,null,null,null,null,null,null,null,null,null,null,null,null,null,null,null,null,null,""]
[null,null,null,null,null,null,null,null,null,null,null,null,null,null,null,null,null,null,null,null,null,null,null,null,null,""]
[null,null,null,null,null,null,null,null,null,null,null,null,null,null,null,null,null,null,null,null,null,null,null,null,null,""]
[null,null,null,null,null,null,null,null,null,null,null,null,null,null,null,null,null,null,null,null,null,null,null,null,null,""]
[null,null,null,null,null,null,null,null,null,null,null,null,null,null,null,null,null,null,null,null,null,null,null,null,null,""]
[null,null,null,null,null,null,null,null,null,null,null,null,null,null,null,null,null,null,null,null,null,null,null,null,null,""]
[null,null,null,null,null,null,null,null,null,null,null,null,null,null,null,null,null,null,null,null,null,null,null,null,null,""]
[null,null,null,null,null,null,null,null,null,null,null,null,null,null,null,null,null,null,null,null,null,null,null,null,null,""]
[null,null,null,null,null,null,null,null,null,null,null,null,null,null,null,null,null,null,null,null,null,null,null,null,null,""]
[null,null,null,null,null,null,null,null,null,null,null,null,null,null,null,null,null,null,null,null,null,null,null,null,null,""]
[null,null,null,null,null,null,null,null,null,null,null,null,null,null,null,null,null,null,null,null,null,null,null,null,null,""]
[null,null,null,null,null,null,null,null,null,null,null,null,null,null,null,null,null,null,null,null,null,null,null,null,null,""]
[null,null,null,null,null,null,null,null,null,null,null,null,null,null,null,null,null,null,null,null,null,null,null,null,null,""]
[null,null,null,null,null,null,null,null,null,null,null,null,null,null,null,null,null,null,null,null,null,null,null,null,null,""]
[null,null,null,null,null,null,null,null,null,null,null,null,null,null,null,null,null,null,null,null,null,null,null,null,null,""]
[null,null,null,null,null,null,null,null,null,null,null,null,null,null,null,null,null,null,null,null,null,null,null,null,null,""]
[null,null,null,null,null,null,null,null,null,null,null,null,null,null,null,null,null,null,null,null,null,null,null,null,null,""]
[null,null,null,null,null,null,null,null,null,null,null,null,null,null,null,null,null,null,null,null,null,null,null,null,null,""]
[null,null,null,null,null,null,null,null,null,null,null,null,null,null,null,null,null,null,null,null,null,null,null,null,null,""]
[null,null,null,null,null,null,null,null,null,null,null,null,null,null,null,null,null,null,null,null,null,null,null,null,null,""]
[null,null,null,null,null,null,null,null,null,null,null,null,null,null,null,null,null,null,null,null,null,null,null,null,null,""]
[null,null,null,null,null,null,null,null,null,null,null,null,null,null,null,null,null,null,null,null,null,null,null,null,null,""]
[null,null,null,null,null,null,null,null,null,null,null,null,null,null,null,null,null,null,null,null,null,null,null,null,null,""]
[null,null,null,null,null,null,null,null,null,null,null,null,null,null,null,null,null,null,null,null,null,null,null,null,null,""]
[null,null,null,null,null,null,null,null,null,null,null,null,null,null,null,null,null,null,null,null,null,null,null,null,null,""]
[null,null,null,null,null,null,null,null,null,null,null,null,null,null,null,null,null,null,null,null,null,null,null,null,null,""]
[null,null,null,null,null,null,null,null,null,null,null,null,null,null,null,null,null,null,null,null,null,null,null,null,null,""]
[null,null,null,null,null,null,null,null,null,null,null,null,null,null,null,null,null,null,null,null,null,null,null,null,null,""]
[null,null,null,null,null,null,null,null,null,null,null,null,null,null,null,null,null,null,null,null,null,null,null,null,null,""]
[null,null,null,null,null,null,null,null,null,null,null,null,null,null,null,null,null,null,null,null,null,null,null,null,null,""]
[null,null,null,null,null,null,null,null,null,null,null,null,null,null,null,null,null,null,null,null,null,null,null,null,null,""]
[null,null,null,null,null,null,null,null,null,null,null,null,null,null,null,null,null,null,null,null,null,null,null,null,null,""]
[null,null,null,null,null,null,null,null,null,null,null,null,null,null,null,null,null,null,null,null,null,null,null,null,null,""]
[null,null,null,null,null,null,null,null,null,null,null,null,null,null,null,null,null,null,null,null,null,null,null,null,null,""]
[null,null,null,null,null,null,null,null,null,null,null,null,null,null,null,null,null,null,null,null,null,null,null,null,null,""]
[null,null,null,null,null,null,null,null,null,null,null,null,null,null,null,null,null,null,null,null,null,null,null,null,null,""]
[null,null,null,null,null,null,null,null,null,null,null,null,null,null,null,null,null,null,null,null,null,null,null,null,null,""]
[null,null,null,null,null,null,null,null,null,null,null,null,null,null,null,null,null,null,null,null,null,null,null,null,null,""]
[null,null,null,null,null,null,null,null,null,null,null,null,null,null,null,null,null,null,null,null,null,null,null,null,null,""]
[null,null,null,null,null,null,null,null,null,null,null,null,null,null,null,null,null,null,null,null,null,null,null,null,null,""]
[null,null,null,null,null,null,null,null,null,null,null,null,null,null,null,null,null,null,null,null,null,null,null,null,null,""]
[null,null,null,null,null,null,null,null,null,null,null,null,null,null,null,null,null,null,null,null,null,null,null,null,null,""]
[null,null,null,null,null,null,null,null,null,null,null,null,null,null,null,null,null,null,null,null,null,null,null,null,null,""]
[null,null,null,null,null,null,null,null,null,null,null,null,null,null,null,null,null,null,null,null,null,null,null,null,null,""]
[null,null,null,null,null,null,null,null,null,null,null,null,null,null,null,null,null,null,null,null,null,null,null,null,null,""]
[null,null,null,null,null,null,null,null,null,null,null,null,null,null,null,null,null,null,null,null,null,null,null,null,null,""]
[null,null,null,null,null,null,null,null,null,null,null,null,null,null,null,null,null,null,null,null,null,null,null,null,null,""]
[null,null,null,null,null,null,null,null,null,null,null,null,null,null,null,null,null,null,null,null,null,null,null,null,null,""]
[null,null,null,null,null,null,null,null,null,null,null,null,null,null,null,null,null,null,null,null,null,null,null,null,null,""]
[null,null,null,null,null,null,null,null,null,null,null,null,null,null,null,null,null,null,null,null,null,null,null,null,null,""]
[null,null,null,null,null,null,null,null,null,null,null,null,null,null,null,null,null,null,null,null,null,null,null,null,null,""]
[null,null,null,null,null,null,null,null,null,null,null,null,null,null,null,null,null,null,null,null,null,null,null,null,null,""]
[null,null,null,null,null,null,null,null,null,null,null,null,null,null,null,null,null,null,null,null,null,null,null,null,null,""]
[null,null,null,null,null,null,null,null,null,null,null,null,null,null,null,null,null,null,null,null,null,null,null,null,null,""]
[null,null,null,null,null,null,null,null,null,null,null,null,null,null,null,null,null,null,null,null,null,null,null,null,null,{"$f":"SUBSTITUTE(B2314,\" \",\"_\")","v":""}]
[null,null,null,null,null,null,null,null,null,null,null,null,null,null,null,null,null,null,null,null,null,null,null,null,null,""]
[null,null,null,null,null,null,null,null,null,null,null,null,null,null,null,null,null,null,null,null,null,null,null,null,null,""]
[null,null,null,null,null,null,null,null,null,null,null,null,null,null,null,null,null,null,null,null,null,null,null,null,null,""]
[null,null,null,null,null,null,null,null,null,null,null,null,null,null,null,null,null,null,null,null,null,null,null,null,null,""]
[null,null,null,null,null,null,null,null,null,null,null,null,null,null,null,null,null,null,null,null,null,null,null,null,null,""]
[null,null,null,null,null,null,null,null,null,null,null,null,null,null,null,null,null,null,null,null,null,null,null,null,null,""]
[null,null,null,null,null,null,null,null,null,null,null,null,null,null,null,null,null,null,null,null,null,null,null,null,null,""]
[null,null,null,null,null,null,null,null,null,null,null,null,null,null,null,null,null,null,null,null,null,null,null,null,null,""]
[null,null,null,null,null,null,null,null,null,null,null,null,null,null,null,null,null,null,null,null,null,null,null,null,null,""]
[null,null,null,null,null,null,null,null,null,null,null,null,null,null,null,null,null,null,null,null,null,null,null,null,null,""]
[null,null,null,null,null,null,null,null,null,null,null,null,null,null,null,null,null,null,null,null,null,null,null,null,null,""]
[null,null,null,null,null,null,null,null,null,null,null,null,null,null,null,null,null,null,null,null,null,null,null,null,null,""]
[null,null,null,null,null,null,null,null,null,null,null,null,null,null,null,null,null,null,null,null,null,null,null,null,null,""]
[null,null,null,null,null,null,null,null,null,null,null,null,null,null,null,null,null,null,null,null,null,null,null,null,null,""]
[null,null,null,null,null,null,null,null,null,null,null,null,null,null,null,null,null,null,null,null,null,null,null,null,null,""]
[null,null,null,null,null,null,null,null,null,null,null,null,null,null,null,null,null,null,null,null,null,null,null,null,null,""]
[null,null,null,null,null,null,null,null,null,null,null,null,null,null,null,null,null,null,null,null,null,null,null,null,null,""]
[null,null,null,null,null,null,null,null,null,null,null,null,null,null,null,null,null,null,null,null,null,null,null,null,null,""]
[null,null,null,null,null,null,null,null,null,null,null,null,null,null,null,null,null,null,null,null,null,null,null,null,null,""]
[null,null,null,null,null,null,null,null,null,null,null,null,null,null,null,null,null,null,null,null,null,null,null,null,null,""]
[null,null,null,null,null,null,null,null,null,null,null,null,null,null,null,null,null,null,null,null,null,null,null,null,null,""]
[null,null,null,null,null,null,null,null,null,null,null,null,null,null,null,null,null,null,null,null,null,null,null,null,null,""]
[null,null,null,null,null,null,null,null,null,null,null,null,null,null,null,null,null,null,null,null,null,null,null,null,null,""]
[null,null,null,null,null,null,null,null,null,null,null,null,null,null,null,null,null,null,null,null,null,null,null,null,null,""]
[null,null,null,null,null,null,null,null,null,null,null,null,null,null,null,null,null,null,null,null,null,null,null,null,null,""]
[null,null,null,null,null,null,null,null,null,null,null,null,null,null,null,null,null,null,null,null,null,null,null,null,null,""]
[null,null,null,null,null,null,null,null,null,null,null,null,null,null,null,null,null,null,null,null,null,null,null,null,null,""]
[null,null,null,null,null,null,null,null,null,null,null,null,null,null,null,null,null,null,null,null,null,null,null,null,null,""]
[null,null,null,null,null,null,null,null,null,null,null,null,null,null,null,null,null,null,null,null,null,null,null,null,null,""]
[null,null,null,null,null,null,null,null,null,null,null,null,null,null,null,null,null,null,null,null,null,null,null,null,null,""]
[null,null,null,null,null,null,null,null,null,null,null,null,null,null,null,null,null,null,null,null,null,null,null,null,null,""]
[null,null,null,null,null,null,null,null,null,null,null,null,null,null,null,null,null,null,null,null,null,null,null,null,null,""]
[null,null,null,null,null,null,null,null,null,null,null,null,null,null,null,null,null,null,null,null,null,null,null,null,null,""]
[null,null,null,null,null,null,null,null,null,null,null,null,null,null,null,null,null,null,null,null,null,null,null,null,null,""]
[null,null,null,null,null,null,null,null,null,null,null,null,null,null,null,null,null,null,null,null,null,null,null,null,null,""]
[null,null,null,null,null,null,null,null,null,null,null,null,null,null,null,null,null,null,null,null,null,null,null,null,null,""]
[null,null,null,null,null,null,null,null,null,null,null,null,null,null,null,null,null,null,null,null,null,null,null,null,null,""]
[null,null,null,null,null,null,null,null,null,null,null,null,null,null,null,null,null,null,null,null,null,null,null,null,null,""]
[null,null,null,null,null,null,null,null,null,null,null,null,null,null,null,null,null,null,null,null,null,null,null,null,null,""]
[null,null,null,null,null,null,null,null,null,null,null,null,null,null,null,null,null,null,null,null,null,null,null,null,null,""]
[null,null,null,null,null,null,null,null,null,null,null,null,null,null,null,null,null,null,null,null,null,null,null,null,null,""]
[null,null,null,null,null,null,null,null,null,null,null,null,null,null,null,null,null,null,null,null,null,null,null,null,null,""]
[null,null,null,null,null,null,null,null,null,null,null,null,null,null,null,null,null,null,null,null,null,null,null,null,null,""]
[null,null,null,null,null,null,null,null,null,null,null,null,null,null,null,null,null,null,null,null,null,null,null,null,null,""]
[null,null,null,null,null,null,null,null,null,null,null,null,null,null,null,null,null,null,null,null,null,null,null,null,null,""]
[null,null,null,null,null,null,null,null,null,null,null,null,null,null,null,null,null,null,null,null,null,null,null,null,null,""]
[null,null,null,null,null,null,null,null,null,null,null,null,null,null,null,null,null,null,null,null,null,null,null,null,null,""]
[null,null,null,null,null,null,null,null,null,null,null,null,null,null,null,null,null,null,null,null,null,null,null,null,null,""]
[null,null,null,null,null,null,null,null,null,null,null,null,null,null,null,null,null,null,null,null,null,null,null,null,null,""]
[null,null,null,null,null,null,null,null,null,null,null,null,null,null,null,null,null,null,null,null,null,null,null,null,null,""]
[null,null,null,null,null,null,null,null,null,null,null,null,null,null,null,null,null,null,null,null,null,null,null,null,null,""]
[null,null,null,null,null,null,null,null,null,null,null,null,null,null,null,null,null,null,null,null,null,null,null,null,null,""]
[null,null,null,null,null,null,null,null,null,null,null,null,null,null,null,null,null,null,null,null,null,null,null,null,null,""]
[null,null,null,null,null,null,null,null,null,null,null,null,null,null,null,null,null,null,null,null,null,null,null,null,null,""]
[null,null,null,null,null,null,null,null,null,null,null,null,null,null,null,null,null,null,null,null,null,null,null,null,null,""]
[null,null,null,null,null,null,null,null,null,null,null,null,null,null,null,null,null,null,null,null,null,null,null,null,null,""]
[null,null,null,null,null,null,null,null,null,null,null,null,null,null,null,null,null,null,null,null,null,null,null,null,null,""]
[null,null,null,null,null,null,null,null,null,null,null,null,null,null,null,null,null,null,null,null,null,null,null,null,null,""]
[null,null,null,null,null,null,null,null,null,null,null,null,null,null,null,null,null,null,null,null,null,null,null,null,null,""]
[null,null,null,null,null,null,null,null,null,null,null,null,null,null,null,null,null,null,null,null,null,null,null,null,null,""]
[null,null,null,null,null,null,null,null,null,null,null,null,null,null,null,null,null,null,null,null,null,null,null,null,null,""]
[null,null,null,null,null,null,null,null,null,null,null,null,null,null,null,null,null,null,null,null,null,null,null,null,null,""]
[null,null,null,null,null,null,null,null,null,null,null,null,null,null,null,null,null,null,null,null,null,null,null,null,null,""]
[null,null,null,null,null,null,null,null,null,null,null,null,null,null,null,null,null,null,null,null,null,null,null,null,null,{"$f":"SUBSTITUTE(B2378,\" \",\"_\")","v":""}]
[null,null,null,null,null,null,null,null,null,null,null,null,null,null,null,null,null,null,null,null,null,null,null,null,null,""]
[null,null,null,null,null,null,null,null,null,null,null,null,null,null,null,null,null,null,null,null,null,null,null,null,null,""]
[null,null,null,null,null,null,null,null,null,null,null,null,null,null,null,null,null,null,null,null,null,null,null,null,null,""]
[null,null,null,null,null,null,null,null,null,null,null,null,null,null,null,null,null,null,null,null,null,null,null,null,null,""]
[null,null,null,null,null,null,null,null,null,null,null,null,null,null,null,null,null,null,null,null,null,null,null,null,null,""]
[null,null,null,null,null,null,null,null,null,null,null,null,null,null,null,null,null,null,null,null,null,null,null,null,null,""]
[null,null,null,null,null,null,null,null,null,null,null,null,null,null,null,null,null,null,null,null,null,null,null,null,null,""]
[null,null,null,null,null,null,null,null,null,null,null,null,null,null,null,null,null,null,null,null,null,null,null,null,null,""]
[null,null,null,null,null,null,null,null,null,null,null,null,null,null,null,null,null,null,null,null,null,null,null,null,null,""]
[null,null,null,null,null,null,null,null,null,null,null,null,null,null,null,null,null,null,null,null,null,null,null,null,null,""]
[null,null,null,null,null,null,null,null,null,null,null,null,null,null,null,null,null,null,null,null,null,null,null,null,null,""]
[null,null,null,null,null,null,null,null,null,null,null,null,null,null,null,null,null,null,null,null,null,null,null,null,null,""]
[null,null,null,null,null,null,null,null,null,null,null,null,null,null,null,null,null,null,null,null,null,null,null,null,null,""]
[null,null,null,null,null,null,null,null,null,null,null,null,null,null,null,null,null,null,null,null,null,null,null,null,null,""]
[null,null,null,null,null,null,null,null,null,null,null,null,null,null,null,null,null,null,null,null,null,null,null,null,null,""]
[null,null,null,null,null,null,null,null,null,null,null,null,null,null,null,null,null,null,null,null,null,null,null,null,null,""]
[null,null,null,null,null,null,null,null,null,null,null,null,null,null,null,null,null,null,null,null,null,null,null,null,null,""]
[null,null,null,null,null,null,null,null,null,null,null,null,null,null,null,null,null,null,null,null,null,null,null,null,null,""]
[null,null,null,null,null,null,null,null,null,null,null,null,null,null,null,null,null,null,null,null,null,null,null,null,null,""]
[null,null,null,null,null,null,null,null,null,null,null,null,null,null,null,null,null,null,null,null,null,null,null,null,null,""]
[null,null,null,null,null,null,null,null,null,null,null,null,null,null,null,null,null,null,null,null,null,null,null,null,null,""]
[null,null,null,null,null,null,null,null,null,null,null,null,null,null,null,null,null,null,null,null,null,null,null,null,null,""]
[null,null,null,null,null,null,null,null,null,null,null,null,null,null,null,null,null,null,null,null,null,null,null,null,null,""]
[null,null,null,null,null,null,null,null,null,null,null,null,null,null,null,null,null,null,null,null,null,null,null,null,null,""]
[null,null,null,null,null,null,null,null,null,null,null,null,null,null,null,null,null,null,null,null,null,null,null,null,null,""]
[null,null,null,null,null,null,null,null,null,null,null,null,null,null,null,null,null,null,null,null,null,null,null,null,null,""]
[null,null,null,null,null,null,null,null,null,null,null,null,null,null,null,null,null,null,null,null,null,null,null,null,null,""]
[null,null,null,null,null,null,null,null,null,null,null,null,null,null,null,null,null,null,null,null,null,null,null,null,null,""]
[null,null,null,null,null,null,null,null,null,null,null,null,null,null,null,null,null,null,null,null,null,null,null,null,null,""]
[null,null,null,null,null,null,null,null,null,null,null,null,null,null,null,null,null,null,null,null,null,null,null,null,null,""]
[null,null,null,null,null,null,null,null,null,null,null,null,null,null,null,null,null,null,null,null,null,null,null,null,null,""]
[null,null,null,null,null,null,null,null,null,null,null,null,null,null,null,null,null,null,null,null,null,null,null,null,null,""]
[null,null,null,null,null,null,null,null,null,null,null,null,null,null,null,null,null,null,null,null,null,null,null,null,null,""]
[null,null,null,null,null,null,null,null,null,null,null,null,null,null,null,null,null,null,null,null,null,null,null,null,null,""]
[null,null,null,null,null,null,null,null,null,null,null,null,null,null,null,null,null,null,null,null,null,null,null,null,null,""]
[null,null,null,null,null,null,null,null,null,null,null,null,null,null,null,null,null,null,null,null,null,null,null,null,null,""]
[null,null,null,null,null,null,null,null,null,null,null,null,null,null,null,null,null,null,null,null,null,null,null,null,null,""]
[null,null,null,null,null,null,null,null,null,null,null,null,null,null,null,null,null,null,null,null,null,null,null,null,null,""]
[null,null,null,null,null,null,null,null,null,null,null,null,null,null,null,null,null,null,null,null,null,null,null,null,null,""]
[null,null,null,null,null,null,null,null,null,null,null,null,null,null,null,null,null,null,null,null,null,null,null,null,null,""]
[null,null,null,null,null,null,null,null,null,null,null,null,null,null,null,null,null,null,null,null,null,null,null,null,null,""]
[null,null,null,null,null,null,null,null,null,null,null,null,null,null,null,null,null,null,null,null,null,null,null,null,null,""]
[null,null,null,null,null,null,null,null,null,null,null,null,null,null,null,null,null,null,null,null,null,null,null,null,null,""]
[null,null,null,null,null,null,null,null,null,null,null,null,null,null,null,null,null,null,null,null,null,null,null,null,null,""]
[null,null,null,null,null,null,null,null,null,null,null,null,null,null,null,null,null,null,null,null,null,null,null,null,null,""]
[null,null,null,null,null,null,null,null,null,null,null,null,null,null,null,null,null,null,null,null,null,null,null,null,null,""]
[null,null,null,null,null,null,null,null,null,null,null,null,null,null,null,null,null,null,null,null,null,null,null,null,null,""]
[null,null,null,null,null,null,null,null,null,null,null,null,null,null,null,null,null,null,null,null,null,null,null,null,null,""]
[null,null,null,null,null,null,null,null,null,null,null,null,null,null,null,null,null,null,null,null,null,null,null,null,null,""]
[null,null,null,null,null,null,null,null,null,null,null,null,null,null,null,null,null,null,null,null,null,null,null,null,null,""]
[null,null,null,null,null,null,null,null,null,null,null,null,null,null,null,null,null,null,null,null,null,null,null,null,null,""]
[null,null,null,null,null,null,null,null,null,null,null,null,null,null,null,null,null,null,null,null,null,null,null,null,null,""]
[null,null,null,null,null,null,null,null,null,null,null,null,null,null,null,null,null,null,null,null,null,null,null,null,null,""]
[null,null,null,null,null,null,null,null,null,null,null,null,null,null,null,null,null,null,null,null,null,null,null,null,null,""]
[null,null,null,null,null,null,null,null,null,null,null,null,null,null,null,null,null,null,null,null,null,null,null,null,null,""]
[null,null,null,null,null,null,null,null,null,null,null,null,null,null,null,null,null,null,null,null,null,null,null,null,null,""]
[null,null,null,null,null,null,null,null,null,null,null,null,null,null,null,null,null,null,null,null,null,null,null,null,null,""]
[null,null,null,null,null,null,null,null,null,null,null,null,null,null,null,null,null,null,null,null,null,null,null,null,null,""]
[null,null,null,null,null,null,null,null,null,null,null,null,null,null,null,null,null,null,null,null,null,null,null,null,null,""]
[null,null,null,null,null,null,null,null,null,null,null,null,null,null,null,null,null,null,null,null,null,null,null,null,null,""]
[null,null,null,null,null,null,null,null,null,null,null,null,null,null,null,null,null,null,null,null,null,null,null,null,null,""]
[null,null,null,null,null,null,null,null,null,null,null,null,null,null,null,null,null,null,null,null,null,null,null,null,null,""]
[null,null,null,null,null,null,null,null,null,null,null,null,null,null,null,null,null,null,null,null,null,null,null,null,null,""]
[null,null,null,null,null,null,null,null,null,null,null,null,null,null,null,null,null,null,null,null,null,null,null,null,null,{"$f":"SUBSTITUTE(B2442,\" \",\"_\")","v":""}]
[null,null,null,null,null,null,null,null,null,null,null,null,null,null,null,null,null,null,null,null,null,null,null,null,null,""]
[null,null,null,null,null,null,null,null,null,null,null,null,null,null,null,null,null,null,null,null,null,null,null,null,null,""]
[null,null,null,null,null,null,null,null,null,null,null,null,null,null,null,null,null,null,null,null,null,null,null,null,null,""]
[null,null,null,null,null,null,null,null,null,null,null,null,null,null,null,null,null,null,null,null,null,null,null,null,null,""]
[null,null,null,null,null,null,null,null,null,null,null,null,null,null,null,null,null,null,null,null,null,null,null,null,null,""]
[null,null,null,null,null,null,null,null,null,null,null,null,null,null,null,null,null,null,null,null,null,null,null,null,null,""]
[null,null,null,null,null,null,null,null,null,null,null,null,null,null,null,null,null,null,null,null,null,null,null,null,null,""]
[null,null,null,null,null,null,null,null,null,null,null,null,null,null,null,null,null,null,null,null,null,null,null,null,null,""]
[null,null,null,null,null,null,null,null,null,null,null,null,null,null,null,null,null,null,null,null,null,null,null,null,null,""]
[null,null,null,null,null,null,null,null,null,null,null,null,null,null,null,null,null,null,null,null,null,null,null,null,null,""]
[null,null,null,null,null,null,null,null,null,null,null,null,null,null,null,null,null,null,null,null,null,null,null,null,null,""]
[null,null,null,null,null,null,null,null,null,null,null,null,null,null,null,null,null,null,null,null,null,null,null,null,null,""]
[null,null,null,null,null,null,null,null,null,null,null,null,null,null,null,null,null,null,null,null,null,null,null,null,null,""]
[null,null,null,null,null,null,null,null,null,null,null,null,null,null,null,null,null,null,null,null,null,null,null,null,null,""]
[null,null,null,null,null,null,null,null,null,null,null,null,null,null,null,null,null,null,null,null,null,null,null,null,null,""]
[null,null,null,null,null,null,null,null,null,null,null,null,null,null,null,null,null,null,null,null,null,null,null,null,null,""]
[null,null,null,null,null,null,null,null,null,null,null,null,null,null,null,null,null,null,null,null,null,null,null,null,null,""]
[null,null,null,null,null,null,null,null,null,null,null,null,null,null,null,null,null,null,null,null,null,null,null,null,null,""]
[null,null,null,null,null,null,null,null,null,null,null,null,null,null,null,null,null,null,null,null,null,null,null,null,null,""]
[null,null,null,null,null,null,null,null,null,null,null,null,null,null,null,null,null,null,null,null,null,null,null,null,null,""]
[null,null,null,null,null,null,null,null,null,null,null,null,null,null,null,null,null,null,null,null,null,null,null,null,null,""]
[null,null,null,null,null,null,null,null,null,null,null,null,null,null,null,null,null,null,null,null,null,null,null,null,null,""]
[null,null,null,null,null,null,null,null,null,null,null,null,null,null,null,null,null,null,null,null,null,null,null,null,null,""]
[null,null,null,null,null,null,null,null,null,null,null,null,null,null,null,null,null,null,null,null,null,null,null,null,null,""]
[null,null,null,null,null,null,null,null,null,null,null,null,null,null,null,null,null,null,null,null,null,null,null,null,null,""]
[null,null,null,null,null,null,null,null,null,null,null,null,null,null,null,null,null,null,null,null,null,null,null,null,null,""]
[null,null,null,null,null,null,null,null,null,null,null,null,null,null,null,null,null,null,null,null,null,null,null,null,null,""]
[null,null,null,null,null,null,null,null,null,null,null,null,null,null,null,null,null,null,null,null,null,null,null,null,null,""]
[null,null,null,null,null,null,null,null,null,null,null,null,null,null,null,null,null,null,null,null,null,null,null,null,null,""]
[null,null,null,null,null,null,null,null,null,null,null,null,null,null,null,null,null,null,null,null,null,null,null,null,null,""]
[null,null,null,null,null,null,null,null,null,null,null,null,null,null,null,null,null,null,null,null,null,null,null,null,null,""]
[null,null,null,null,null,null,null,null,null,null,null,null,null,null,null,null,null,null,null,null,null,null,null,null,null,""]
[null,null,null,null,null,null,null,null,null,null,null,null,null,null,null,null,null,null,null,null,null,null,null,null,null,""]
[null,null,null,null,null,null,null,null,null,null,null,null,null,null,null,null,null,null,null,null,null,null,null,null,null,""]
[null,null,null,null,null,null,null,null,null,null,null,null,null,null,null,null,null,null,null,null,null,null,null,null,null,""]
[null,null,null,null,null,null,null,null,null,null,null,null,null,null,null,null,null,null,null,null,null,null,null,null,null,""]
[null,null,null,null,null,null,null,null,null,null,null,null,null,null,null,null,null,null,null,null,null,null,null,null,null,""]
[null,null,null,null,null,null,null,null,null,null,null,null,null,null,null,null,null,null,null,null,null,null,null,null,null,""]
[null,null,null,null,null,null,null,null,null,null,null,null,null,null,null,null,null,null,null,null,null,null,null,null,null,""]
[null,null,null,null,null,null,null,null,null,null,null,null,null,null,null,null,null,null,null,null,null,null,null,null,null,""]
[null,null,null,null,null,null,null,null,null,null,null,null,null,null,null,null,null,null,null,null,null,null,null,null,null,""]
[null,null,null,null,null,null,null,null,null,null,null,null,null,null,null,null,null,null,null,null,null,null,null,null,null,""]
[null,null,null,null,null,null,null,null,null,null,null,null,null,null,null,null,null,null,null,null,null,null,null,null,null,""]
[null,null,null,null,null,null,null,null,null,null,null,null,null,null,null,null,null,null,null,null,null,null,null,null,null,""]
[null,null,null,null,null,null,null,null,null,null,null,null,null,null,null,null,null,null,null,null,null,null,null,null,null,""]
[null,null,null,null,null,null,null,null,null,null,null,null,null,null,null,null,null,null,null,null,null,null,null,null,null,""]
[null,null,null,null,null,null,null,null,null,null,null,null,null,null,null,null,null,null,null,null,null,null,null,null,null,""]
[null,null,null,null,null,null,null,null,null,null,null,null,null,null,null,null,null,null,null,null,null,null,null,null,null,""]
[null,null,null,null,null,null,null,null,null,null,null,null,null,null,null,null,null,null,null,null,null,null,null,null,null,""]
[null,null,null,null,null,null,null,null,null,null,null,null,null,null,null,null,null,null,null,null,null,null,null,null,null,""]
[null,null,null,null,null,null,null,null,null,null,null,null,null,null,null,null,null,null,null,null,null,null,null,null,null,""]
[null,null,null,null,null,null,null,null,null,null,null,null,null,null,null,null,null,null,null,null,null,null,null,null,null,""]
[null,null,null,null,null,null,null,null,null,null,null,null,null,null,null,null,null,null,null,null,null,null,null,null,null,""]
[null,null,null,null,null,null,null,null,null,null,null,null,null,null,null,null,null,null,null,null,null,null,null,null,null,""]
[null,null,null,null,null,null,null,null,null,null,null,null,null,null,null,null,null,null,null,null,null,null,null,null,null,""]
[null,null,null,null,null,null,null,null,null,null,null,null,null,null,null,null,null,null,null,null,null,null,null,null,null,""]
[null,null,null,null,null,null,null,null,null,null,null,null,null,null,null,null,null,null,null,null,null,null,null,null,null,""]
[null,null,null,null,null,null,null,null,null,null,null,null,null,null,null,null,null,null,null,null,null,null,null,null,null,""]
[null,null,null,null,null,null,null,null,null,null,null,null,null,null,null,null,null,null,null,null,null,null,null,null,null,""]
[null,null,null,null,null,null,null,null,null,null,null,null,null,null,null,null,null,null,null,null,null,null,null,null,null,""]
[null,null,null,null,null,null,null,null,null,null,null,null,null,null,null,null,null,null,null,null,null,null,null,null,null,""]
[null,null,null,null,null,null,null,null,null,null,null,null,null,null,null,null,null,null,null,null,null,null,null,null,null,""]
[null,null,null,null,null,null,null,null,null,null,null,null,null,null,null,null,null,null,null,null,null,null,null,null,null,""]
[null,null,null,null,null,null,null,null,null,null,null,null,null,null,null,null,null,null,null,null,null,null,null,null,null,{"$f":"SUBSTITUTE(B2506,\" \",\"_\")","v":""}]
[null,null,null,null,null,null,null,null,null,null,null,null,null,null,null,null,null,null,null,null,null,null,null,null,null,""]
[null,null,null,null,null,null,null,null,null,null,null,null,null,null,null,null,null,null,null,null,null,null,null,null,null,""]
[null,null,null,null,null,null,null,null,null,null,null,null,null,null,null,null,null,null,null,null,null,null,null,null,null,""]
[null,null,null,null,null,null,null,null,null,null,null,null,null,null,null,null,null,null,null,null,null,null,null,null,null,""]
[null,null,null,null,null,null,null,null,null,null,null,null,null,null,null,null,null,null,null,null,null,null,null,null,null,""]
[null,null,null,null,null,null,null,null,null,null,null,null,null,null,null,null,null,null,null,null,null,null,null,null,null,""]
[null,null,null,null,null,null,null,null,null,null,null,null,null,null,null,null,null,null,null,null,null,null,null,null,null,""]
[null,null,null,null,null,null,null,null,null,null,null,null,null,null,null,null,null,null,null,null,null,null,null,null,null,""]
[null,null,null,null,null,null,null,null,null,null,null,null,null,null,null,null,null,null,null,null,null,null,null,null,null,""]
[null,null,null,null,null,null,null,null,null,null,null,null,null,null,null,null,null,null,null,null,null,null,null,null,null,""]
[null,null,null,null,null,null,null,null,null,null,null,null,null,null,null,null,null,null,null,null,null,null,null,null,null,""]
[null,null,null,null,null,null,null,null,null,null,null,null,null,null,null,null,null,null,null,null,null,null,null,null,null,""]
[null,null,null,null,null,null,null,null,null,null,null,null,null,null,null,null,null,null,null,null,null,null,null,null,null,""]
[null,null,null,null,null,null,null,null,null,null,null,null,null,null,null,null,null,null,null,null,null,null,null,null,null,""]
[null,null,null,null,null,null,null,null,null,null,null,null,null,null,null,null,null,null,null,null,null,null,null,null,null,""]
[null,null,null,null,null,null,null,null,null,null,null,null,null,null,null,null,null,null,null,null,null,null,null,null,null,""]
[null,null,null,null,null,null,null,null,null,null,null,null,null,null,null,null,null,null,null,null,null,null,null,null,null,""]
[null,null,null,null,null,null,null,null,null,null,null,null,null,null,null,null,null,null,null,null,null,null,null,null,null,""]
[null,null,null,null,null,null,null,null,null,null,null,null,null,null,null,null,null,null,null,null,null,null,null,null,null,""]
[null,null,null,null,null,null,null,null,null,null,null,null,null,null,null,null,null,null,null,null,null,null,null,null,null,""]
[null,null,null,null,null,null,null,null,null,null,null,null,null,null,null,null,null,null,null,null,null,null,null,null,null,""]
[null,null,null,null,null,null,null,null,null,null,null,null,null,null,null,null,null,null,null,null,null,null,null,null,null,""]
[null,null,null,null,null,null,null,null,null,null,null,null,null,null,null,null,null,null,null,null,null,null,null,null,null,""]
[null,null,null,null,null,null,null,null,null,null,null,null,null,null,null,null,null,null,null,null,null,null,null,null,null,""]
[null,null,null,null,null,null,null,null,null,null,null,null,null,null,null,null,null,null,null,null,null,null,null,null,null,""]
[null,null,null,null,null,null,null,null,null,null,null,null,null,null,null,null,null,null,null,null,null,null,null,null,null,""]
[null,null,null,null,null,null,null,null,null,null,null,null,null,null,null,null,null,null,null,null,null,null,null,null,null,""]
[null,null,null,null,null,null,null,null,null,null,null,null,null,null,null,null,null,null,null,null,null,null,null,null,null,""]
[null,null,null,null,null,null,null,null,null,null,null,null,null,null,null,null,null,null,null,null,null,null,null,null,null,""]
[null,null,null,null,null,null,null,null,null,null,null,null,null,null,null,null,null,null,null,null,null,null,null,null,null,""]
[null,null,null,null,null,null,null,null,null,null,null,null,null,null,null,null,null,null,null,null,null,null,null,null,null,""]
[null,null,null,null,null,null,null,null,null,null,null,null,null,null,null,null,null,null,null,null,null,null,null,null,null,""]
[null,null,null,null,null,null,null,null,null,null,null,null,null,null,null,null,null,null,null,null,null,null,null,null,null,""]
[null,null,null,null,null,null,null,null,null,null,null,null,null,null,null,null,null,null,null,null,null,null,null,null,null,""]
[null,null,null,null,null,null,null,null,null,null,null,null,null,null,null,null,null,null,null,null,null,null,null,null,null,""]
[null,null,null,null,null,null,null,null,null,null,null,null,null,null,null,null,null,null,null,null,null,null,null,null,null,""]
[null,null,null,null,null,null,null,null,null,null,null,null,null,null,null,null,null,null,null,null,null,null,null,null,null,""]
[null,null,null,null,null,null,null,null,null,null,null,null,null,null,null,null,null,null,null,null,null,null,null,null,null,""]
[null,null,null,null,null,null,null,null,null,null,null,null,null,null,null,null,null,null,null,null,null,null,null,null,null,""]
[null,null,null,null,null,null,null,null,null,null,null,null,null,null,null,null,null,null,null,null,null,null,null,null,null,""]
[null,null,null,null,null,null,null,null,null,null,null,null,null,null,null,null,null,null,null,null,null,null,null,null,null,""]
[null,null,null,null,null,null,null,null,null,null,null,null,null,null,null,null,null,null,null,null,null,null,null,null,null,""]
[null,null,null,null,null,null,null,null,null,null,null,null,null,null,null,null,null,null,null,null,null,null,null,null,null,""]
[null,null,null,null,null,null,null,null,null,null,null,null,null,null,null,null,null,null,null,null,null,null,null,null,null,""]
[null,null,null,null,null,null,null,null,null,null,null,null,null,null,null,null,null,null,null,null,null,null,null,null,null,""]
[null,null,null,null,null,null,null,null,null,null,null,null,null,null,null,null,null,null,null,null,null,null,null,null,null,""]
[null,null,null,null,null,null,null,null,null,null,null,null,null,null,null,null,null,null,null,null,null,null,null,null,null,""]
[null,null,null,null,null,null,null,null,null,null,null,null,null,null,null,null,null,null,null,null,null,null,null,null,null,""]
[null,null,null,null,null,null,null,null,null,null,null,null,null,null,null,null,null,null,null,null,null,null,null,null,null,""]
[null,null,null,null,null,null,null,null,null,null,null,null,null,null,null,null,null,null,null,null,null,null,null,null,null,""]
[null,null,null,null,null,null,null,null,null,null,null,null,null,null,null,null,null,null,null,null,null,null,null,null,null,""]
[null,null,null,null,null,null,null,null,null,null,null,null,null,null,null,null,null,null,null,null,null,null,null,null,null,""]
[null,null,null,null,null,null,null,null,null,null,null,null,null,null,null,null,null,null,null,null,null,null,null,null,null,""]
[null,null,null,null,null,null,null,null,null,null,null,null,null,null,null,null,null,null,null,null,null,null,null,null,null,""]
[null,null,null,null,null,null,null,null,null,null,null,null,null,null,null,null,null,null,null,null,null,null,null,null,null,""]
[null,null,null,null,null,null,null,null,null,null,null,null,null,null,null,null,null,null,null,null,null,null,null,null,null,""]
[null,null,null,null,null,null,null,null,null,null,null,null,null,null,null,null,null,null,null,null,null,null,null,null,null,""]
[null,null,null,null,null,null,null,null,null,null,null,null,null,null,null,null,null,null,null,null,null,null,null,null,null,""]
[null,null,null,null,null,null,null,null,null,null,null,null,null,null,null,null,null,null,null,null,null,null,null,null,null,""]
[null,null,null,null,null,null,null,null,null,null,null,null,null,null,null,null,null,null,null,null,null,null,null,null,null,""]
[null,null,null,null,null,null,null,null,null,null,null,null,null,null,null,null,null,null,null,null,null,null,null,null,null,""]
[null,null,null,null,null,null,null,null,null,null,null,null,null,null,null,null,null,null,null,null,null,null,null,null,null,""]
[null,null,null,null,null,null,null,null,null,null,null,null,null,null,null,null,null,null,null,null,null,null,null,null,null,""]
[null,null,null,null,null,null,null,null,null,null,null,null,null,null,null,null,null,null,null,null,null,null,null,null,null,{"$f":"SUBSTITUTE(B2570,\" \",\"_\")","v":""}]
[null,null,null,null,null,null,null,null,null,null,null,null,null,null,null,null,null,null,null,null,null,null,null,null,null,""]
[null,null,null,null,null,null,null,null,null,null,null,null,null,null,null,null,null,null,null,null,null,null,null,null,null,""]
[null,null,null,null,null,null,null,null,null,null,null,null,null,null,null,null,null,null,null,null,null,null,null,null,null,""]
[null,null,null,null,null,null,null,null,null,null,null,null,null,null,null,null,null,null,null,null,null,null,null,null,null,""]
[null,null,null,null,null,null,null,null,null,null,null,null,null,null,null,null,null,null,null,null,null,null,null,null,null,""]
[null,null,null,null,null,null,null,null,null,null,null,null,null,null,null,null,null,null,null,null,null,null,null,null,null,""]
[null,null,null,null,null,null,null,null,null,null,null,null,null,null,null,null,null,null,null,null,null,null,null,null,null,""]
[null,null,null,null,null,null,null,null,null,null,null,null,null,null,null,null,null,null,null,null,null,null,null,null,null,""]
[null,null,null,null,null,null,null,null,null,null,null,null,null,null,null,null,null,null,null,null,null,null,null,null,null,""]
[null,null,null,null,null,null,null,null,null,null,null,null,null,null,null,null,null,null,null,null,null,null,null,null,null,""]
[null,null,null,null,null,null,null,null,null,null,null,null,null,null,null,null,null,null,null,null,null,null,null,null,null,""]
[null,null,null,null,null,null,null,null,null,null,null,null,null,null,null,null,null,null,null,null,null,null,null,null,null,""]
[null,null,null,null,null,null,null,null,null,null,null,null,null,null,null,null,null,null,null,null,null,null,null,null,null,""]
[null,null,null,null,null,null,null,null,null,null,null,null,null,null,null,null,null,null,null,null,null,null,null,null,null,""]
[null,null,null,null,null,null,null,null,null,null,null,null,null,null,null,null,null,null,null,null,null,null,null,null,null,""]
[null,null,null,null,null,null,null,null,null,null,null,null,null,null,null,null,null,null,null,null,null,null,null,null,null,""]
[null,null,null,null,null,null,null,null,null,null,null,null,null,null,null,null,null,null,null,null,null,null,null,null,null,""]
[null,null,null,null,null,null,null,null,null,null,null,null,null,null,null,null,null,null,null,null,null,null,null,null,null,""]
[null,null,null,null,null,null,null,null,null,null,null,null,null,null,null,null,null,null,null,null,null,null,null,null,null,""]
[null,null,null,null,null,null,null,null,null,null,null,null,null,null,null,null,null,null,null,null,null,null,null,null,null,""]
[null,null,null,null,null,null,null,null,null,null,null,null,null,null,null,null,null,null,null,null,null,null,null,null,null,""]
[null,null,null,null,null,null,null,null,null,null,null,null,null,null,null,null,null,null,null,null,null,null,null,null,null,""]
[null,null,null,null,null,null,null,null,null,null,null,null,null,null,null,null,null,null,null,null,null,null,null,null,null,""]
[null,null,null,null,null,null,null,null,null,null,null,null,null,null,null,null,null,null,null,null,null,null,null,null,null,""]
[null,null,null,null,null,null,null,null,null,null,null,null,null,null,null,null,null,null,null,null,null,null,null,null,null,""]
[null,null,null,null,null,null,null,null,null,null,null,null,null,null,null,null,null,null,null,null,null,null,null,null,null,""]
[null,null,null,null,null,null,null,null,null,null,null,null,null,null,null,null,null,null,null,null,null,null,null,null,null,""]
[null,null,null,null,null,null,null,null,null,null,null,null,null,null,null,null,null,null,null,null,null,null,null,null,null,""]
[null,null,null,null,null,null,null,null,null,null,null,null,null,null,null,null,null,null,null,null,null,null,null,null,null,""]
[null,null,null,null,null,null,null,null,null,null,null,null,null,null,null,null,null,null,null,null,null,null,null,null,null,""]
[null,null,null,null,null,null,null,null,null,null,null,null,null,null,null,null,null,null,null,null,null,null,null,null,null,""]
[null,null,null,null,null,null,null,null,null,null,null,null,null,null,null,null,null,null,null,null,null,null,null,null,null,""]
[null,null,null,null,null,null,null,null,null,null,null,null,null,null,null,null,null,null,null,null,null,null,null,null,null,""]
[null,null,null,null,null,null,null,null,null,null,null,null,null,null,null,null,null,null,null,null,null,null,null,null,null,""]
[null,null,null,null,null,null,null,null,null,null,null,null,null,null,null,null,null,null,null,null,null,null,null,null,null,""]
[null,null,null,null,null,null,null,null,null,null,null,null,null,null,null,null,null,null,null,null,null,null,null,null,null,""]
[null,null,null,null,null,null,null,null,null,null,null,null,null,null,null,null,null,null,null,null,null,null,null,null,null,""]
[null,null,null,null,null,null,null,null,null,null,null,null,null,null,null,null,null,null,null,null,null,null,null,null,null,""]
[null,null,null,null,null,null,null,null,null,null,null,null,null,null,null,null,null,null,null,null,null,null,null,null,null,""]
[null,null,null,null,null,null,null,null,null,null,null,null,null,null,null,null,null,null,null,null,null,null,null,null,null,""]
[null,null,null,null,null,null,null,null,null,null,null,null,null,null,null,null,null,null,null,null,null,null,null,null,null,""]
[null,null,null,null,null,null,null,null,null,null,null,null,null,null,null,null,null,null,null,null,null,null,null,null,null,""]
[null,null,null,null,null,null,null,null,null,null,null,null,null,null,null,null,null,null,null,null,null,null,null,null,null,""]
[null,null,null,null,null,null,null,null,null,null,null,null,null,null,null,null,null,null,null,null,null,null,null,null,null,""]
[null,null,null,null,null,null,null,null,null,null,null,null,null,null,null,null,null,null,null,null,null,null,null,null,null,""]
[null,null,null,null,null,null,null,null,null,null,null,null,null,null,null,null,null,null,null,null,null,null,null,null,null,""]
[null,null,null,null,null,null,null,null,null,null,null,null,null,null,null,null,null,null,null,null,null,null,null,null,null,""]
[null,null,null,null,null,null,null,null,null,null,null,null,null,null,null,null,null,null,null,null,null,null,null,null,null,""]
[null,null,null,null,null,null,null,null,null,null,null,null,null,null,null,null,null,null,null,null,null,null,null,null,null,""]
[null,null,null,null,null,null,null,null,null,null,null,null,null,null,null,null,null,null,null,null,null,null,null,null,null,""]
[null,null,null,null,null,null,null,null,null,null,null,null,null,null,null,null,null,null,null,null,null,null,null,null,null,""]
[null,null,null,null,null,null,null,null,null,null,null,null,null,null,null,null,null,null,null,null,null,null,null,null,null,""]
[null,null,null,null,null,null,null,null,null,null,null,null,null,null,null,null,null,null,null,null,null,null,null,null,null,""]
[null,null,null,null,null,null,null,null,null,null,null,null,null,null,null,null,null,null,null,null,null,null,null,null,null,""]
[null,null,null,null,null,null,null,null,null,null,null,null,null,null,null,null,null,null,null,null,null,null,null,null,null,""]
[null,null,null,null,null,null,null,null,null,null,null,null,null,null,null,null,null,null,null,null,null,null,null,null,null,""]
[null,null,null,null,null,null,null,null,null,null,null,null,null,null,null,null,null,null,null,null,null,null,null,null,null,""]
[null,null,null,null,null,null,null,null,null,null,null,null,null,null,null,null,null,null,null,null,null,null,null,null,null,""]
[null,null,null,null,null,null,null,null,null,null,null,null,null,null,null,null,null,null,null,null,null,null,null,null,null,""]
[null,null,null,null,null,null,null,null,null,null,null,null,null,null,null,null,null,null,null,null,null,null,null,null,null,""]
[null,null,null,null,null,null,null,null,null,null,null,null,null,null,null,null,null,null,null,null,null,null,null,null,null,""]
[null,null,null,null,null,null,null,null,null,null,null,null,null,null,null,null,null,null,null,null,null,null,null,null,null,""]
[null,null,null,null,null,null,null,null,null,null,null,null,null,null,null,null,null,null,null,null,null,null,null,null,null,""]
[null,null,null,null,null,null,null,null,null,null,null,null,null,null,null,null,null,null,null,null,null,null,null,null,null,{"$f":"SUBSTITUTE(B2634,\" \",\"_\")","v":""}]
[null,null,null,null,null,null,null,null,null,null,null,null,null,null,null,null,null,null,null,null,null,null,null,null,null,""]
[null,null,null,null,null,null,null,null,null,null,null,null,null,null,null,null,null,null,null,null,null,null,null,null,null,""]
[null,null,null,null,null,null,null,null,null,null,null,null,null,null,null,null,null,null,null,null,null,null,null,null,null,""]
[null,null,null,null,null,null,null,null,null,null,null,null,null,null,null,null,null,null,null,null,null,null,null,null,null,""]
[null,null,null,null,null,null,null,null,null,null,null,null,null,null,null,null,null,null,null,null,null,null,null,null,null,""]
[null,null,null,null,null,null,null,null,null,null,null,null,null,null,null,null,null,null,null,null,null,null,null,null,null,""]
[null,null,null,null,null,null,null,null,null,null,null,null,null,null,null,null,null,null,null,null,null,null,null,null,null,""]
[null,null,null,null,null,null,null,null,null,null,null,null,null,null,null,null,null,null,null,null,null,null,null,null,null,""]
[null,null,null,null,null,null,null,null,null,null,null,null,null,null,null,null,null,null,null,null,null,null,null,null,null,""]
[null,null,null,null,null,null,null,null,null,null,null,null,null,null,null,null,null,null,null,null,null,null,null,null,null,""]
[null,null,null,null,null,null,null,null,null,null,null,null,null,null,null,null,null,null,null,null,null,null,null,null,null,""]
[null,null,null,null,null,null,null,null,null,null,null,null,null,null,null,null,null,null,null,null,null,null,null,null,null,""]
[null,null,null,null,null,null,null,null,null,null,null,null,null,null,null,null,null,null,null,null,null,null,null,null,null,""]
[null,null,null,null,null,null,null,null,null,null,null,null,null,null,null,null,null,null,null,null,null,null,null,null,null,""]
[null,null,null,null,null,null,null,null,null,null,null,null,null,null,null,null,null,null,null,null,null,null,null,null,null,""]
[null,null,null,null,null,null,null,null,null,null,null,null,null,null,null,null,null,null,null,null,null,null,null,null,null,""]
[null,null,null,null,null,null,null,null,null,null,null,null,null,null,null,null,null,null,null,null,null,null,null,null,null,""]
[null,null,null,null,null,null,null,null,null,null,null,null,null,null,null,null,null,null,null,null,null,null,null,null,null,""]
[null,null,null,null,null,null,null,null,null,null,null,null,null,null,null,null,null,null,null,null,null,null,null,null,null,""]
[null,null,null,null,null,null,null,null,null,null,null,null,null,null,null,null,null,null,null,null,null,null,null,null,null,""]
[null,null,null,null,null,null,null,null,null,null,null,null,null,null,null,null,null,null,null,null,null,null,null,null,null,""]
[null,null,null,null,null,null,null,null,null,null,null,null,null,null,null,null,null,null,null,null,null,null,null,null,null,""]
[null,null,null,null,null,null,null,null,null,null,null,null,null,null,null,null,null,null,null,null,null,null,null,null,null,""]
[null,null,null,null,null,null,null,null,null,null,null,null,null,null,null,null,null,null,null,null,null,null,null,null,null,""]
[null,null,null,null,null,null,null,null,null,null,null,null,null,null,null,null,null,null,null,null,null,null,null,null,null,""]
[null,null,null,null,null,null,null,null,null,null,null,null,null,null,null,null,null,null,null,null,null,null,null,null,null,""]
[null,null,null,null,null,null,null,null,null,null,null,null,null,null,null,null,null,null,null,null,null,null,null,null,null,""]
[null,null,null,null,null,null,null,null,null,null,null,null,null,null,null,null,null,null,null,null,null,null,null,null,null,""]
[null,null,null,null,null,null,null,null,null,null,null,null,null,null,null,null,null,null,null,null,null,null,null,null,null,""]
[null,null,null,null,null,null,null,null,null,null,null,null,null,null,null,null,null,null,null,null,null,null,null,null,null,""]
[null,null,null,null,null,null,null,null,null,null,null,null,null,null,null,null,null,null,null,null,null,null,null,null,null,""]
[null,null,null,null,null,null,null,null,null,null,null,null,null,null,null,null,null,null,null,null,null,null,null,null,null,""]
[null,null,null,null,null,null,null,null,null,null,null,null,null,null,null,null,null,null,null,null,null,null,null,null,null,""]
[null,null,null,null,null,null,null,null,null,null,null,null,null,null,null,null,null,null,null,null,null,null,null,null,null,""]
[null,null,null,null,null,null,null,null,null,null,null,null,null,null,null,null,null,null,null,null,null,null,null,null,null,""]
[null,null,null,null,null,null,null,null,null,null,null,null,null,null,null,null,null,null,null,null,null,null,null,null,null,""]
[null,null,null,null,null,null,null,null,null,null,null,null,null,null,null,null,null,null,null,null,null,null,null,null,null,""]
[null,null,null,null,null,null,null,null,null,null,null,null,null,null,null,null,null,null,null,null,null,null,null,null,null,""]
[null,null,null,null,null,null,null,null,null,null,null,null,null,null,null,null,null,null,null,null,null,null,null,null,null,""]
[null,null,null,null,null,null,null,null,null,null,null,null,null,null,null,null,null,null,null,null,null,null,null,null,null,""]
[null,null,null,null,null,null,null,null,null,null,null,null,null,null,null,null,null,null,null,null,null,null,null,null,null,""]
[null,null,null,null,null,null,null,null,null,null,null,null,null,null,null,null,null,null,null,null,null,null,null,null,null,""]
[null,null,null,null,null,null,null,null,null,null,null,null,null,null,null,null,null,null,null,null,null,null,null,null,null,""]
[null,null,null,null,null,null,null,null,null,null,null,null,null,null,null,null,null,null,null,null,null,null,null,null,null,""]
[null,null,null,null,null,null,null,null,null,null,null,null,null,null,null,null,null,null,null,null,null,null,null,null,null,""]
[null,null,null,null,null,null,null,null,null,null,null,null,null,null,null,null,null,null,null,null,null,null,null,null,null,""]
[null,null,null,null,null,null,null,null,null,null,null,null,null,null,null,null,null,null,null,null,null,null,null,null,null,""]
[null,null,null,null,null,null,null,null,null,null,null,null,null,null,null,null,null,null,null,null,null,null,null,null,null,""]
[null,null,null,null,null,null,null,null,null,null,null,null,null,null,null,null,null,null,null,null,null,null,null,null,null,""]
[null,null,null,null,null,null,null,null,null,null,null,null,null,null,null,null,null,null,null,null,null,null,null,null,null,""]
[null,null,null,null,null,null,null,null,null,null,null,null,null,null,null,null,null,null,null,null,null,null,null,null,null,""]
[null,null,null,null,null,null,null,null,null,null,null,null,null,null,null,null,null,null,null,null,null,null,null,null,null,""]
[null,null,null,null,null,null,null,null,null,null,null,null,null,null,null,null,null,null,null,null,null,null,null,null,null,""]
[null,null,null,null,null,null,null,null,null,null,null,null,null,null,null,null,null,null,null,null,null,null,null,null,null,""]
[null,null,null,null,null,null,null,null,null,null,null,null,null,null,null,null,null,null,null,null,null,null,null,null,null,""]
[null,null,null,null,null,null,null,null,null,null,null,null,null,null,null,null,null,null,null,null,null,null,null,null,null,""]
[null,null,null,null,null,null,null,null,null,null,null,null,null,null,null,null,null,null,null,null,null,null,null,null,null,""]
[null,null,null,null,null,null,null,null,null,null,null,null,null,null,null,null,null,null,null,null,null,null,null,null,null,""]
[null,null,null,null,null,null,null,null,null,null,null,null,null,null,null,null,null,null,null,null,null,null,null,null,null,""]
[null,null,null,null,null,null,null,null,null,null,null,null,null,null,null,null,null,null,null,null,null,null,null,null,null,""]
[null,null,null,null,null,null,null,null,null,null,null,null,null,null,null,null,null,null,null,null,null,null,null,null,null,""]
[null,null,null,null,null,null,null,null,null,null,null,null,null,null,null,null,null,null,null,null,null,null,null,null,null,""]
[null,null,null,null,null,null,null,null,null,null,null,null,null,null,null,null,null,null,null,null,null,null,null,null,null,""]
[null,null,null,null,null,null,null,null,null,null,null,null,null,null,null,null,null,null,null,null,null,null,null,null,null,{"$f":"SUBSTITUTE(B2698,\" \",\"_\")","v":""}]
[null,null,null,null,null,null,null,null,null,null,null,null,null,null,null,null,null,null,null,null,null,null,null,null,null,""]
[null,null,null,null,null,null,null,null,null,null,null,null,null,null,null,null,null,null,null,null,null,null,null,null,null,""]
[null,null,null,null,null,null,null,null,null,null,null,null,null,null,null,null,null,null,null,null,null,null,null,null,null,""]
[null,null,null,null,null,null,null,null,null,null,null,null,null,null,null,null,null,null,null,null,null,null,null,null,null,""]
[null,null,null,null,null,null,null,null,null,null,null,null,null,null,null,null,null,null,null,null,null,null,null,null,null,""]
[null,null,null,null,null,null,null,null,null,null,null,null,null,null,null,null,null,null,null,null,null,null,null,null,null,""]
[null,null,null,null,null,null,null,null,null,null,null,null,null,null,null,null,null,null,null,null,null,null,null,null,null,""]
[null,null,null,null,null,null,null,null,null,null,null,null,null,null,null,null,null,null,null,null,null,null,null,null,null,""]
[null,null,null,null,null,null,null,null,null,null,null,null,null,null,null,null,null,null,null,null,null,null,null,null,null,""]
[null,null,null,null,null,null,null,null,null,null,null,null,null,null,null,null,null,null,null,null,null,null,null,null,null,""]
[null,null,null,null,null,null,null,null,null,null,null,null,null,null,null,null,null,null,null,null,null,null,null,null,null,""]
[null,null,null,null,null,null,null,null,null,null,null,null,null,null,null,null,null,null,null,null,null,null,null,null,null,""]
[null,null,null,null,null,null,null,null,null,null,null,null,null,null,null,null,null,null,null,null,null,null,null,null,null,""]
[null,null,null,null,null,null,null,null,null,null,null,null,null,null,null,null,null,null,null,null,null,null,null,null,null,""]
[null,null,null,null,null,null,null,null,null,null,null,null,null,null,null,null,null,null,null,null,null,null,null,null,null,""]
[null,null,null,null,null,null,null,null,null,null,null,null,null,null,null,null,null,null,null,null,null,null,null,null,null,""]
[null,null,null,null,null,null,null,null,null,null,null,null,null,null,null,null,null,null,null,null,null,null,null,null,null,""]
[null,null,null,null,null,null,null,null,null,null,null,null,null,null,null,null,null,null,null,null,null,null,null,null,null,""]
[null,null,null,null,null,null,null,null,null,null,null,null,null,null,null,null,null,null,null,null,null,null,null,null,null,""]
[null,null,null,null,null,null,null,null,null,null,null,null,null,null,null,null,null,null,null,null,null,null,null,null,null,""]
[null,null,null,null,null,null,null,null,null,null,null,null,null,null,null,null,null,null,null,null,null,null,null,null,null,""]
[null,null,null,null,null,null,null,null,null,null,null,null,null,null,null,null,null,null,null,null,null,null,null,null,null,""]
[null,null,null,null,null,null,null,null,null,null,null,null,null,null,null,null,null,null,null,null,null,null,null,null,null,""]
[null,null,null,null,null,null,null,null,null,null,null,null,null,null,null,null,null,null,null,null,null,null,null,null,null,""]
[null,null,null,null,null,null,null,null,null,null,null,null,null,null,null,null,null,null,null,null,null,null,null,null,null,""]
[null,null,null,null,null,null,null,null,null,null,null,null,null,null,null,null,null,null,null,null,null,null,null,null,null,""]
[null,null,null,null,null,null,null,null,null,null,null,null,null,null,null,null,null,null,null,null,null,null,null,null,null,""]
[null,null,null,null,null,null,null,null,null,null,null,null,null,null,null,null,null,null,null,null,null,null,null,null,null,""]
[null,null,null,null,null,null,null,null,null,null,null,null,null,null,null,null,null,null,null,null,null,null,null,null,null,""]
[null,null,null,null,null,null,null,null,null,null,null,null,null,null,null,null,null,null,null,null,null,null,null,null,null,""]
[null,null,null,null,null,null,null,null,null,null,null,null,null,null,null,null,null,null,null,null,null,null,null,null,null,""]
[null,null,null,null,null,null,null,null,null,null,null,null,null,null,null,null,null,null,null,null,null,null,null,null,null,""]
[null,null,null,null,null,null,null,null,null,null,null,null,null,null,null,null,null,null,null,null,null,null,null,null,null,""]
[null,null,null,null,null,null,null,null,null,null,null,null,null,null,null,null,null,null,null,null,null,null,null,null,null,""]
[null,null,null,null,null,null,null,null,null,null,null,null,null,null,null,null,null,null,null,null,null,null,null,null,null,""]
[null,null,null,null,null,null,null,null,null,null,null,null,null,null,null,null,null,null,null,null,null,null,null,null,null,""]
[null,null,null,null,null,null,null,null,null,null,null,null,null,null,null,null,null,null,null,null,null,null,null,null,null,""]
[null,null,null,null,null,null,null,null,null,null,null,null,null,null,null,null,null,null,null,null,null,null,null,null,null,""]
[null,null,null,null,null,null,null,null,null,null,null,null,null,null,null,null,null,null,null,null,null,null,null,null,null,""]
[null,null,null,null,null,null,null,null,null,null,null,null,null,null,null,null,null,null,null,null,null,null,null,null,null,""]
[null,null,null,null,null,null,null,null,null,null,null,null,null,null,null,null,null,null,null,null,null,null,null,null,null,""]
[null,null,null,null,null,null,null,null,null,null,null,null,null,null,null,null,null,null,null,null,null,null,null,null,null,""]
[null,null,null,null,null,null,null,null,null,null,null,null,null,null,null,null,null,null,null,null,null,null,null,null,null,""]
[null,null,null,null,null,null,null,null,null,null,null,null,null,null,null,null,null,null,null,null,null,null,null,null,null,""]
[null,null,null,null,null,null,null,null,null,null,null,null,null,null,null,null,null,null,null,null,null,null,null,null,null,""]
[null,null,null,null,null,null,null,null,null,null,null,null,null,null,null,null,null,null,null,null,null,null,null,null,null,""]
[null,null,null,null,null,null,null,null,null,null,null,null,null,null,null,null,null,null,null,null,null,null,null,null,null,""]
[null,null,null,null,null,null,null,null,null,null,null,null,null,null,null,null,null,null,null,null,null,null,null,null,null,""]
[null,null,null,null,null,null,null,null,null,null,null,null,null,null,null,null,null,null,null,null,null,null,null,null,null,""]
[null,null,null,null,null,null,null,null,null,null,null,null,null,null,null,null,null,null,null,null,null,null,null,null,null,""]
[null,null,null,null,null,null,null,null,null,null,null,null,null,null,null,null,null,null,null,null,null,null,null,null,null,""]
[null,null,null,null,null,null,null,null,null,null,null,null,null,null,null,null,null,null,null,null,null,null,null,null,null,""]
[null,null,null,null,null,null,null,null,null,null,null,null,null,null,null,null,null,null,null,null,null,null,null,null,null,""]
[null,null,null,null,null,null,null,null,null,null,null,null,null,null,null,null,null,null,null,null,null,null,null,null,null,""]
[null,null,null,null,null,null,null,null,null,null,null,null,null,null,null,null,null,null,null,null,null,null,null,null,null,""]
[null,null,null,null,null,null,null,null,null,null,null,null,null,null,null,null,null,null,null,null,null,null,null,null,null,""]
[null,null,null,null,null,null,null,null,null,null,null,null,null,null,null,null,null,null,null,null,null,null,null,null,null,""]
[null,null,null,null,null,null,null,null,null,null,null,null,null,null,null,null,null,null,null,null,null,null,null,null,null,""]
[null,null,null,null,null,null,null,null,null,null,null,null,null,null,null,null,null,null,null,null,null,null,null,null,null,""]
[null,null,null,null,null,null,null,null,null,null,null,null,null,null,null,null,null,null,null,null,null,null,null,null,null,""]
[null,null,null,null,null,null,null,null,null,null,null,null,null,null,null,null,null,null,null,null,null,null,null,null,null,""]
[null,null,null,null,null,null,null,null,null,null,null,null,null,null,null,null,null,null,null,null,null,null,null,null,null,""]
[null,null,null,null,null,null,null,null,null,null,null,null,null,null,null,null,null,null,null,null,null,null,null,null,null,""]
[null,null,null,null,null,null,null,null,null,null,null,null,null,null,null,null,null,null,null,null,null,null,null,null,null,{"$f":"SUBSTITUTE(B2762,\" \",\"_\")","v":""}]
[null,null,null,null,null,null,null,null,null,null,null,null,null,null,null,null,null,null,null,null,null,null,null,null,null,""]
[null,null,null,null,null,null,null,null,null,null,null,null,null,null,null,null,null,null,null,null,null,null,null,null,null,""]
[null,null,null,null,null,null,null,null,null,null,null,null,null,null,null,null,null,null,null,null,null,null,null,null,null,""]
[null,null,null,null,null,null,null,null,null,null,null,null,null,null,null,null,null,null,null,null,null,null,null,null,null,""]
[null,null,null,null,null,null,null,null,null,null,null,null,null,null,null,null,null,null,null,null,null,null,null,null,null,""]
[null,null,null,null,null,null,null,null,null,null,null,null,null,null,null,null,null,null,null,null,null,null,null,null,null,""]
[null,null,null,null,null,null,null,null,null,null,null,null,null,null,null,null,null,null,null,null,null,null,null,null,null,""]
[null,null,null,null,null,null,null,null,null,null,null,null,null,null,null,null,null,null,null,null,null,null,null,null,null,""]
[null,null,null,null,null,null,null,null,null,null,null,null,null,null,null,null,null,null,null,null,null,null,null,null,null,""]
[null,null,null,null,null,null,null,null,null,null,null,null,null,null,null,null,null,null,null,null,null,null,null,null,null,""]
[null,null,null,null,null,null,null,null,null,null,null,null,null,null,null,null,null,null,null,null,null,null,null,null,null,""]
[null,null,null,null,null,null,null,null,null,null,null,null,null,null,null,null,null,null,null,null,null,null,null,null,null,""]
[null,null,null,null,null,null,null,null,null,null,null,null,null,null,null,null,null,null,null,null,null,null,null,null,null,""]
[null,null,null,null,null,null,null,null,null,null,null,null,null,null,null,null,null,null,null,null,null,null,null,null,null,""]
[null,null,null,null,null,null,null,null,null,null,null,null,null,null,null,null,null,null,null,null,null,null,null,null,null,""]
[null,null,null,null,null,null,null,null,null,null,null,null,null,null,null,null,null,null,null,null,null,null,null,null,null,""]
[null,null,null,null,null,null,null,null,null,null,null,null,null,null,null,null,null,null,null,null,null,null,null,null,null,""]
[null,null,null,null,null,null,null,null,null,null,null,null,null,null,null,null,null,null,null,null,null,null,null,null,null,""]
[null,null,null,null,null,null,null,null,null,null,null,null,null,null,null,null,null,null,null,null,null,null,null,null,null,""]
[null,null,null,null,null,null,null,null,null,null,null,null,null,null,null,null,null,null,null,null,null,null,null,null,null,""]
[null,null,null,null,null,null,null,null,null,null,null,null,null,null,null,null,null,null,null,null,null,null,null,null,null,""]
[null,null,null,null,null,null,null,null,null,null,null,null,null,null,null,null,null,null,null,null,null,null,null,null,null,""]
[null,null,null,null,null,null,null,null,null,null,null,null,null,null,null,null,null,null,null,null,null,null,null,null,null,""]
[null,null,null,null,null,null,null,null,null,null,null,null,null,null,null,null,null,null,null,null,null,null,null,null,null,""]
[null,null,null,null,null,null,null,null,null,null,null,null,null,null,null,null,null,null,null,null,null,null,null,null,null,""]
[null,null,null,null,null,null,null,null,null,null,null,null,null,null,null,null,null,null,null,null,null,null,null,null,null,""]
[null,null,null,null,null,null,null,null,null,null,null,null,null,null,null,null,null,null,null,null,null,null,null,null,null,""]
[null,null,null,null,null,null,null,null,null,null,null,null,null,null,null,null,null,null,null,null,null,null,null,null,null,""]
[null,null,null,null,null,null,null,null,null,null,null,null,null,null,null,null,null,null,null,null,null,null,null,null,null,""]
[null,null,null,null,null,null,null,null,null,null,null,null,null,null,null,null,null,null,null,null,null,null,null,null,null,""]
[null,null,null,null,null,null,null,null,null,null,null,null,null,null,null,null,null,null,null,null,null,null,null,null,null,""]
[null,null,null,null,null,null,null,null,null,null,null,null,null,null,null,null,null,null,null,null,null,null,null,null,null,""]
[null,null,null,null,null,null,null,null,null,null,null,null,null,null,null,null,null,null,null,null,null,null,null,null,null,""]
[null,null,null,null,null,null,null,null,null,null,null,null,null,null,null,null,null,null,null,null,null,null,null,null,null,""]
[null,null,null,null,null,null,null,null,null,null,null,null,null,null,null,null,null,null,null,null,null,null,null,null,null,""]
[null,null,null,null,null,null,null,null,null,null,null,null,null,null,null,null,null,null,null,null,null,null,null,null,null,""]
[null,null,null,null,null,null,null,null,null,null,null,null,null,null,null,null,null,null,null,null,null,null,null,null,null,""]
[null,null,null,null,null,null,null,null,null,null,null,null,null,null,null,null,null,null,null,null,null,null,null,null,null,""]
[null,null,null,null,null,null,null,null,null,null,null,null,null,null,null,null,null,null,null,null,null,null,null,null,null,""]
[null,null,null,null,null,null,null,null,null,null,null,null,null,null,null,null,null,null,null,null,null,null,null,null,null,""]
[null,null,null,null,null,null,null,null,null,null,null,null,null,null,null,null,null,null,null,null,null,null,null,null,null,""]
[null,null,null,null,null,null,null,null,null,null,null,null,null,null,null,null,null,null,null,null,null,null,null,null,null,""]
[null,null,null,null,null,null,null,null,null,null,null,null,null,null,null,null,null,null,null,null,null,null,null,null,null,""]
[null,null,null,null,null,null,null,null,null,null,null,null,null,null,null,null,null,null,null,null,null,null,null,null,null,""]
[null,null,null,null,null,null,null,null,null,null,null,null,null,null,null,null,null,null,null,null,null,null,null,null,null,""]
[null,null,null,null,null,null,null,null,null,null,null,null,null,null,null,null,null,null,null,null,null,null,null,null,null,""]
[null,null,null,null,null,null,null,null,null,null,null,null,null,null,null,null,null,null,null,null,null,null,null,null,null,""]
[null,null,null,null,null,null,null,null,null,null,null,null,null,null,null,null,null,null,null,null,null,null,null,null,null,""]
[null,null,null,null,null,null,null,null,null,null,null,null,null,null,null,null,null,null,null,null,null,null,null,null,null,""]
[null,null,null,null,null,null,null,null,null,null,null,null,null,null,null,null,null,null,null,null,null,null,null,null,null,""]
[null,null,null,null,null,null,null,null,null,null,null,null,null,null,null,null,null,null,null,null,null,null,null,null,null,""]
[null,null,null,null,null,null,null,null,null,null,null,null,null,null,null,null,null,null,null,null,null,null,null,null,null,""]
[null,null,null,null,null,null,null,null,null,null,null,null,null,null,null,null,null,null,null,null,null,null,null,null,null,""]
[null,null,null,null,null,null,null,null,null,null,null,null,null,null,null,null,null,null,null,null,null,null,null,null,null,""]
[null,null,null,null,null,null,null,null,null,null,null,null,null,null,null,null,null,null,null,null,null,null,null,null,null,""]
[null,null,null,null,null,null,null,null,null,null,null,null,null,null,null,null,null,null,null,null,null,null,null,null,null,""]
[null,null,null,null,null,null,null,null,null,null,null,null,null,null,null,null,null,null,null,null,null,null,null,null,null,""]
[null,null,null,null,null,null,null,null,null,null,null,null,null,null,null,null,null,null,null,null,null,null,null,null,null,""]
[null,null,null,null,null,null,null,null,null,null,null,null,null,null,null,null,null,null,null,null,null,null,null,null,null,""]
[null,null,null,null,null,null,null,null,null,null,null,null,null,null,null,null,null,null,null,null,null,null,null,null,null,""]
[null,null,null,null,null,null,null,null,null,null,null,null,null,null,null,null,null,null,null,null,null,null,null,null,null,""]
[null,null,null,null,null,null,null,null,null,null,null,null,null,null,null,null,null,null,null,null,null,null,null,null,null,""]
[null,null,null,null,null,null,null,null,null,null,null,null,null,null,null,null,null,null,null,null,null,null,null,null,null,""]
[null,null,null,null,null,null,null,null,null,null,null,null,null,null,null,null,null,null,null,null,null,null,null,null,null,{"$f":"SUBSTITUTE(B2826,\" \",\"_\")","v":""}]
[null,null,null,null,null,null,null,null,null,null,null,null,null,null,null,null,null,null,null,null,null,null,null,null,null,""]
[null,null,null,null,null,null,null,null,null,null,null,null,null,null,null,null,null,null,null,null,null,null,null,null,null,""]
[null,null,null,null,null,null,null,null,null,null,null,null,null,null,null,null,null,null,null,null,null,null,null,null,null,""]
[null,null,null,null,null,null,null,null,null,null,null,null,null,null,null,null,null,null,null,null,null,null,null,null,null,""]
[null,null,null,null,null,null,null,null,null,null,null,null,null,null,null,null,null,null,null,null,null,null,null,null,null,""]
[null,null,null,null,null,null,null,null,null,null,null,null,null,null,null,null,null,null,null,null,null,null,null,null,null,""]
[null,null,null,null,null,null,null,null,null,null,null,null,null,null,null,null,null,null,null,null,null,null,null,null,null,""]
[null,null,null,null,null,null,null,null,null,null,null,null,null,null,null,null,null,null,null,null,null,null,null,null,null,""]
[null,null,null,null,null,null,null,null,null,null,null,null,null,null,null,null,null,null,null,null,null,null,null,null,null,""]
[null,null,null,null,null,null,null,null,null,null,null,null,null,null,null,null,null,null,null,null,null,null,null,null,null,""]
[null,null,null,null,null,null,null,null,null,null,null,null,null,null,null,null,null,null,null,null,null,null,null,null,null,""]
[null,null,null,null,null,null,null,null,null,null,null,null,null,null,null,null,null,null,null,null,null,null,null,null,null,""]
[null,null,null,null,null,null,null,null,null,null,null,null,null,null,null,null,null,null,null,null,null,null,null,null,null,""]
[null,null,null,null,null,null,null,null,null,null,null,null,null,null,null,null,null,null,null,null,null,null,null,null,null,""]
[null,null,null,null,null,null,null,null,null,null,null,null,null,null,null,null,null,null,null,null,null,null,null,null,null,""]
[null,null,null,null,null,null,null,null,null,null,null,null,null,null,null,null,null,null,null,null,null,null,null,null,null,""]
[null,null,null,null,null,null,null,null,null,null,null,null,null,null,null,null,null,null,null,null,null,null,null,null,null,""]
[null,null,null,null,null,null,null,null,null,null,null,null,null,null,null,null,null,null,null,null,null,null,null,null,null,""]
[null,null,null,null,null,null,null,null,null,null,null,null,null,null,null,null,null,null,null,null,null,null,null,null,null,""]
[null,null,null,null,null,null,null,null,null,null,null,null,null,null,null,null,null,null,null,null,null,null,null,null,null,""]
[null,null,null,null,null,null,null,null,null,null,null,null,null,null,null,null,null,null,null,null,null,null,null,null,null,""]
[null,null,null,null,null,null,null,null,null,null,null,null,null,null,null,null,null,null,null,null,null,null,null,null,null,""]
[null,null,null,null,null,null,null,null,null,null,null,null,null,null,null,null,null,null,null,null,null,null,null,null,null,""]
[null,null,null,null,null,null,null,null,null,null,null,null,null,null,null,null,null,null,null,null,null,null,null,null,null,""]
[null,null,null,null,null,null,null,null,null,null,null,null,null,null,null,null,null,null,null,null,null,null,null,null,null,""]
[null,null,null,null,null,null,null,null,null,null,null,null,null,null,null,null,null,null,null,null,null,null,null,null,null,""]
[null,null,null,null,null,null,null,null,null,null,null,null,null,null,null,null,null,null,null,null,null,null,null,null,null,""]
[null,null,null,null,null,null,null,null,null,null,null,null,null,null,null,null,null,null,null,null,null,null,null,null,null,""]
[null,null,null,null,null,null,null,null,null,null,null,null,null,null,null,null,null,null,null,null,null,null,null,null,null,""]
[null,null,null,null,null,null,null,null,null,null,null,null,null,null,null,null,null,null,null,null,null,null,null,null,null,""]
[null,null,null,null,null,null,null,null,null,null,null,null,null,null,null,null,null,null,null,null,null,null,null,null,null,""]
[null,null,null,null,null,null,null,null,null,null,null,null,null,null,null,null,null,null,null,null,null,null,null,null,null,""]
[null,null,null,null,null,null,null,null,null,null,null,null,null,null,null,null,null,null,null,null,null,null,null,null,null,""]
[null,null,null,null,null,null,null,null,null,null,null,null,null,null,null,null,null,null,null,null,null,null,null,null,null,""]
[null,null,null,null,null,null,null,null,null,null,null,null,null,null,null,null,null,null,null,null,null,null,null,null,null,""]
[null,null,null,null,null,null,null,null,null,null,null,null,null,null,null,null,null,null,null,null,null,null,null,null,null,""]
[null,null,null,null,null,null,null,null,null,null,null,null,null,null,null,null,null,null,null,null,null,null,null,null,null,""]
[null,null,null,null,null,null,null,null,null,null,null,null,null,null,null,null,null,null,null,null,null,null,null,null,null,""]
[null,null,null,null,null,null,null,null,null,null,null,null,null,null,null,null,null,null,null,null,null,null,null,null,null,""]
[null,null,null,null,null,null,null,null,null,null,null,null,null,null,null,null,null,null,null,null,null,null,null,null,null,""]
[null,null,null,null,null,null,null,null,null,null,null,null,null,null,null,null,null,null,null,null,null,null,null,null,null,""]
[null,null,null,null,null,null,null,null,null,null,null,null,null,null,null,null,null,null,null,null,null,null,null,null,null,""]
[null,null,null,null,null,null,null,null,null,null,null,null,null,null,null,null,null,null,null,null,null,null,null,null,null,""]
[null,null,null,null,null,null,null,null,null,null,null,null,null,null,null,null,null,null,null,null,null,null,null,null,null,""]
[null,null,null,null,null,null,null,null,null,null,null,null,null,null,null,null,null,null,null,null,null,null,null,null,null,""]
[null,null,null,null,null,null,null,null,null,null,null,null,null,null,null,null,null,null,null,null,null,null,null,null,null,""]
[null,null,null,null,null,null,null,null,null,null,null,null,null,null,null,null,null,null,null,null,null,null,null,null,null,""]
[null,null,null,null,null,null,null,null,null,null,null,null,null,null,null,null,null,null,null,null,null,null,null,null,null,""]
[null,null,null,null,null,null,null,null,null,null,null,null,null,null,null,null,null,null,null,null,null,null,null,null,null,""]
[null,null,null,null,null,null,null,null,null,null,null,null,null,null,null,null,null,null,null,null,null,null,null,null,null,""]
[null,null,null,null,null,null,null,null,null,null,null,null,null,null,null,null,null,null,null,null,null,null,null,null,null,""]
[null,null,null,null,null,null,null,null,null,null,null,null,null,null,null,null,null,null,null,null,null,null,null,null,null,""]
[null,null,null,null,null,null,null,null,null,null,null,null,null,null,null,null,null,null,null,null,null,null,null,null,null,""]
[null,null,null,null,null,null,null,null,null,null,null,null,null,null,null,null,null,null,null,null,null,null,null,null,null,""]
[null,null,null,null,null,null,null,null,null,null,null,null,null,null,null,null,null,null,null,null,null,null,null,null,null,""]
[null,null,null,null,null,null,null,null,null,null,null,null,null,null,null,null,null,null,null,null,null,null,null,null,null,""]
[null,null,null,null,null,null,null,null,null,null,null,null,null,null,null,null,null,null,null,null,null,null,null,null,null,""]
[null,null,null,null,null,null,null,null,null,null,null,null,null,null,null,null,null,null,null,null,null,null,null,null,null,""]
[null,null,null,null,null,null,null,null,null,null,null,null,null,null,null,null,null,null,null,null,null,null,null,null,null,""]
[null,null,null,null,null,null,null,null,null,null,null,null,null,null,null,null,null,null,null,null,null,null,null,null,null,""]
[null,null,null,null,null,null,null,null,null,null,null,null,null,null,null,null,null,null,null,null,null,null,null,null,null,""]
[null,null,null,null,null,null,null,null,null,null,null,null,null,null,null,null,null,null,null,null,null,null,null,null,null,""]
[null,null,null,null,null,null,null,null,null,null,null,null,null,null,null,null,null,null,null,null,null,null,null,null,null,""]
[null,null,null,null,null,null,null,null,null,null,null,null,null,null,null,null,null,null,null,null,null,null,null,null,null,{"$f":"SUBSTITUTE(B2890,\" \",\"_\")","v":""}]
[null,null,null,null,null,null,null,null,null,null,null,null,null,null,null,null,null,null,null,null,null,null,null,null,null,""]
[null,null,null,null,null,null,null,null,null,null,null,null,null,null,null,null,null,null,null,null,null,null,null,null,null,""]
[null,null,null,null,null,null,null,null,null,null,null,null,null,null,null,null,null,null,null,null,null,null,null,null,null,""]
[null,null,null,null,null,null,null,null,null,null,null,null,null,null,null,null,null,null,null,null,null,null,null,null,null,""]
[null,null,null,null,null,null,null,null,null,null,null,null,null,null,null,null,null,null,null,null,null,null,null,null,null,""]
[null,null,null,null,null,null,null,null,null,null,null,null,null,null,null,null,null,null,null,null,null,null,null,null,null,""]
[null,null,null,null,null,null,null,null,null,null,null,null,null,null,null,null,null,null,null,null,null,null,null,null,null,""]
[null,null,null,null,null,null,null,null,null,null,null,null,null,null,null,null,null,null,null,null,null,null,null,null,null,""]
[null,null,null,null,null,null,null,null,null,null,null,null,null,null,null,null,null,null,null,null,null,null,null,null,null,""]
[null,null,null,null,null,null,null,null,null,null,null,null,null,null,null,null,null,null,null,null,null,null,null,null,null,""]
[null,null,null,null,null,null,null,null,null,null,null,null,null,null,null,null,null,null,null,null,null,null,null,null,null,""]
[null,null,null,null,null,null,null,null,null,null,null,null,null,null,null,null,null,null,null,null,null,null,null,null,null,""]
[null,null,null,null,null,null,null,null,null,null,null,null,null,null,null,null,null,null,null,null,null,null,null,null,null,""]
[null,null,null,null,null,null,null,null,null,null,null,null,null,null,null,null,null,null,null,null,null,null,null,null,null,""]
[null,null,null,null,null,null,null,null,null,null,null,null,null,null,null,null,null,null,null,null,null,null,null,null,null,""]
[null,null,null,null,null,null,null,null,null,null,null,null,null,null,null,null,null,null,null,null,null,null,null,null,null,""]
[null,null,null,null,null,null,null,null,null,null,null,null,null,null,null,null,null,null,null,null,null,null,null,null,null,""]
[null,null,null,null,null,null,null,null,null,null,null,null,null,null,null,null,null,null,null,null,null,null,null,null,null,""]
[null,null,null,null,null,null,null,null,null,null,null,null,null,null,null,null,null,null,null,null,null,null,null,null,null,""]
[null,null,null,null,null,null,null,null,null,null,null,null,null,null,null,null,null,null,null,null,null,null,null,null,null,""]
[null,null,null,null,null,null,null,null,null,null,null,null,null,null,null,null,null,null,null,null,null,null,null,null,null,""]
[null,null,null,null,null,null,null,null,null,null,null,null,null,null,null,null,null,null,null,null,null,null,null,null,null,""]
[null,null,null,null,null,null,null,null,null,null,null,null,null,null,null,null,null,null,null,null,null,null,null,null,null,""]
[null,null,null,null,null,null,null,null,null,null,null,null,null,null,null,null,null,null,null,null,null,null,null,null,null,""]
[null,null,null,null,null,null,null,null,null,null,null,null,null,null,null,null,null,null,null,null,null,null,null,null,null,""]
[null,null,null,null,null,null,null,null,null,null,null,null,null,null,null,null,null,null,null,null,null,null,null,null,null,""]
[null,null,null,null,null,null,null,null,null,null,null,null,null,null,null,null,null,null,null,null,null,null,null,null,null,""]
[null,null,null,null,null,null,null,null,null,null,null,null,null,null,null,null,null,null,null,null,null,null,null,null,null,""]
[null,null,null,null,null,null,null,null,null,null,null,null,null,null,null,null,null,null,null,null,null,null,null,null,null,""]
[null,null,null,null,null,null,null,null,null,null,null,null,null,null,null,null,null,null,null,null,null,null,null,null,null,""]
[null,null,null,null,null,null,null,null,null,null,null,null,null,null,null,null,null,null,null,null,null,null,null,null,null,""]
[null,null,null,null,null,null,null,null,null,null,null,null,null,null,null,null,null,null,null,null,null,null,null,null,null,""]
[null,null,null,null,null,null,null,null,null,null,null,null,null,null,null,null,null,null,null,null,null,null,null,null,null,""]
[null,null,null,null,null,null,null,null,null,null,null,null,null,null,null,null,null,null,null,null,null,null,null,null,null,""]
[null,null,null,null,null,null,null,null,null,null,null,null,null,null,null,null,null,null,null,null,null,null,null,null,null,""]
[null,null,null,null,null,null,null,null,null,null,null,null,null,null,null,null,null,null,null,null,null,null,null,null,null,""]
[null,null,null,null,null,null,null,null,null,null,null,null,null,null,null,null,null,null,null,null,null,null,null,null,null,""]
[null,null,null,null,null,null,null,null,null,null,null,null,null,null,null,null,null,null,null,null,null,null,null,null,null,""]
[null,null,null,null,null,null,null,null,null,null,null,null,null,null,null,null,null,null,null,null,null,null,null,null,null,""]
[null,null,null,null,null,null,null,null,null,null,null,null,null,null,null,null,null,null,null,null,null,null,null,null,null,""]
[null,null,null,null,null,null,null,null,null,null,null,null,null,null,null,null,null,null,null,null,null,null,null,null,null,""]
[null,null,null,null,null,null,null,null,null,null,null,null,null,null,null,null,null,null,null,null,null,null,null,null,null,""]
[null,null,null,null,null,null,null,null,null,null,null,null,null,null,null,null,null,null,null,null,null,null,null,null,null,""]
[null,null,null,null,null,null,null,null,null,null,null,null,null,null,null,null,null,null,null,null,null,null,null,null,null,""]
[null,null,null,null,null,null,null,null,null,null,null,null,null,null,null,null,null,null,null,null,null,null,null,null,null,""]
[null,null,null,null,null,null,null,null,null,null,null,null,null,null,null,null,null,null,null,null,null,null,null,null,null,""]
[null,null,null,null,null,null,null,null,null,null,null,null,null,null,null,null,null,null,null,null,null,null,null,null,null,""]
[null,null,null,null,null,null,null,null,null,null,null,null,null,null,null,null,null,null,null,null,null,null,null,null,null,""]
[null,null,null,null,null,null,null,null,null,null,null,null,null,null,null,null,null,null,null,null,null,null,null,null,null,""]
[null,null,null,null,null,null,null,null,null,null,null,null,null,null,null,null,null,null,null,null,null,null,null,null,null,""]
[null,null,null,null,null,null,null,null,null,null,null,null,null,null,null,null,null,null,null,null,null,null,null,null,null,""]
[null,null,null,null,null,null,null,null,null,null,null,null,null,null,null,null,null,null,null,null,null,null,null,null,null,""]
[null,null,null,null,null,null,null,null,null,null,null,null,null,null,null,null,null,null,null,null,null,null,null,null,null,""]
[null,null,null,null,null,null,null,null,null,null,null,null,null,null,null,null,null,null,null,null,null,null,null,null,null,""]
[null,null,null,null,null,null,null,null,null,null,null,null,null,null,null,null,null,null,null,null,null,null,null,null,null,""]
[null,null,null,null,null,null,null,null,null,null,null,null,null,null,null,null,null,null,null,null,null,null,null,null,null,""]
[null,null,null,null,null,null,null,null,null,null,null,null,null,null,null,null,null,null,null,null,null,null,null,null,null,""]
[null,null,null,null,null,null,null,null,null,null,null,null,null,null,null,null,null,null,null,null,null,null,null,null,null,""]
[null,null,null,null,null,null,null,null,null,null,null,null,null,null,null,null,null,null,null,null,null,null,null,null,null,""]
[null,null,null,null,null,null,null,null,null,null,null,null,null,null,null,null,null,null,null,null,null,null,null,null,null,""]
[null,null,null,null,null,null,null,null,null,null,null,null,null,null,null,null,null,null,null,null,null,null,null,null,null,""]
[null,null,null,null,null,null,null,null,null,null,null,null,null,null,null,null,null,null,null,null,null,null,null,null,null,""]
[null,null,null,null,null,null,null,null,null,null,null,null,null,null,null,null,null,null,null,null,null,null,null,null,null,""]
[null,null,null,null,null,null,null,null,null,null,null,null,null,null,null,null,null,null,null,null,null,null,null,null,null,{"$f":"SUBSTITUTE(B2954,\" \",\"_\")","v":""}]
[null,null,null,null,null,null,null,null,null,null,null,null,null,null,null,null,null,null,null,null,null,null,null,null,null,""]
[null,null,null,null,null,null,null,null,null,null,null,null,null,null,null,null,null,null,null,null,null,null,null,null,null,""]
[null,null,null,null,null,null,null,null,null,null,null,null,null,null,null,null,null,null,null,null,null,null,null,null,null,""]
[null,null,null,null,null,null,null,null,null,null,null,null,null,null,null,null,null,null,null,null,null,null,null,null,null,""]
[null,null,null,null,null,null,null,null,null,null,null,null,null,null,null,null,null,null,null,null,null,null,null,null,null,""]
[null,null,null,null,null,null,null,null,null,null,null,null,null,null,null,null,null,null,null,null,null,null,null,null,null,""]
[null,null,null,null,null,null,null,null,null,null,null,null,null,null,null,null,null,null,null,null,null,null,null,null,null,""]
[null,null,null,null,null,null,null,null,null,null,null,null,null,null,null,null,null,null,null,null,null,null,null,null,null,""]
[null,null,null,null,null,null,null,null,null,null,null,null,null,null,null,null,null,null,null,null,null,null,null,null,null,""]
[null,null,null,null,null,null,null,null,null,null,null,null,null,null,null,null,null,null,null,null,null,null,null,null,null,""]
[null,null,null,null,null,null,null,null,null,null,null,null,null,null,null,null,null,null,null,null,null,null,null,null,null,""]
[null,null,null,null,null,null,null,null,null,null,null,null,null,null,null,null,null,null,null,null,null,null,null,null,null,""]
[null,null,null,null,null,null,null,null,null,null,null,null,null,null,null,null,null,null,null,null,null,null,null,null,null,""]
[null,null,null,null,null,null,null,null,null,null,null,null,null,null,null,null,null,null,null,null,null,null,null,null,null,""]
[null,null,null,null,null,null,null,null,null,null,null,null,null,null,null,null,null,null,null,null,null,null,null,null,null,""]
[null,null,null,null,null,null,null,null,null,null,null,null,null,null,null,null,null,null,null,null,null,null,null,null,null,""]
[null,null,null,null,null,null,null,null,null,null,null,null,null,null,null,null,null,null,null,null,null,null,null,null,null,""]
[null,null,null,null,null,null,null,null,null,null,null,null,null,null,null,null,null,null,null,null,null,null,null,null,null,""]
[null,null,null,null,null,null,null,null,null,null,null,null,null,null,null,null,null,null,null,null,null,null,null,null,null,""]
[null,null,null,null,null,null,null,null,null,null,null,null,null,null,null,null,null,null,null,null,null,null,null,null,null,""]
[null,null,null,null,null,null,null,null,null,null,null,null,null,null,null,null,null,null,null,null,null,null,null,null,null,""]
[null,null,null,null,null,null,null,null,null,null,null,null,null,null,null,null,null,null,null,null,null,null,null,null,null,""]
[null,null,null,null,null,null,null,null,null,null,null,null,null,null,null,null,null,null,null,null,null,null,null,null,null,""]
[null,null,null,null,null,null,null,null,null,null,null,null,null,null,null,null,null,null,null,null,null,null,null,null,null,""]
[null,null,null,null,null,null,null,null,null,null,null,null,null,null,null,null,null,null,null,null,null,null,null,null,null,""]
[null,null,null,null,null,null,null,null,null,null,null,null,null,null,null,null,null,null,null,null,null,null,null,null,null,""]
[null,null,null,null,null,null,null,null,null,null,null,null,null,null,null,null,null,null,null,null,null,null,null,null,null,""]
[null,null,null,null,null,null,null,null,null,null,null,null,null,null,null,null,null,null,null,null,null,null,null,null,null,""]
[null,null,null,null,null,null,null,null,null,null,null,null,null,null,null,null,null,null,null,null,null,null,null,null,null,""]
[null,null,null,null,null,null,null,null,null,null,null,null,null,null,null,null,null,null,null,null,null,null,null,null,null,""]
[null,null,null,null,null,null,null,null,null,null,null,null,null,null,null,null,null,null,null,null,null,null,null,null,null,""]
[null,null,null,null,null,null,null,null,null,null,null,null,null,null,null,null,null,null,null,null,null,null,null,null,null,""]
[null,null,null,null,null,null,null,null,null,null,null,null,null,null,null,null,null,null,null,null,null,null,null,null,null,""]
[null,null,null,null,null,null,null,null,null,null,null,null,null,null,null,null,null,null,null,null,null,null,null,null,null,""]
[null,null,null,null,null,null,null,null,null,null,null,null,null,null,null,null,null,null,null,null,null,null,null,null,null,""]
[null,null,null,null,null,null,null,null,null,null,null,null,null,null,null,null,null,null,null,null,null,null,null,null,null,""]
[null,null,null,null,null,null,null,null,null,null,null,null,null,null,null,null,null,null,null,null,null,null,null,null,null,""]
[null,null,null,null,null,null,null,null,null,null,null,null,null,null,null,null,null,null,null,null,null,null,null,null,null,""]
[null,null,null,null,null,null,null,null,null,null,null,null,null,null,null,null,null,null,null,null,null,null,null,null,null,""]
[null,null,null,null,null,null,null,null,null,null,null,null,null,null,null,null,null,null,null,null,null,null,null,null,null,""]
[null,null,null,null,null,null,null,null,null,null,null,null,null,null,null,null,null,null,null,null,null,null,null,null,null,""]
[null,null,null,null,null,null,null,null,null,null,null,null,null,null,null,null,null,null,null,null,null,null,null,null,null,""]
[null,null,null,null,null,null,null,null,null,null,null,null,null,null,null,null,null,null,null,null,null,null,null,null,null,""]
[null,null,null,null,null,null,null,null,null,null,null,null,null,null,null,null,null,null,null,null,null,null,null,null,null,""]
[null,null,null,null,null,null,null,null,null,null,null,null,null,null,null,null,null,null,null,null,null,null,null,null,null,""]
[null,null,null,null,null,null,null,null,null,null,null,null,null,null,null,null,null,null,null,null,null,null,null,null,null,""]
[null,null,null,null,null,null,null,null,null,null,null,null,null,null,null,null,null,null,null,null,null,null,null,null,null,""]

{"sheet":"Lista de Grupos-Classes aberta","index":8,"n_rows":788,"n_cols":2,"rows_kept":788,"cut":false,"hidden":false,"merged":[[0,0,1,0],[0,1,1,1]]}
["GRUPO DE MATERIAL OU SERVIÇO","CLASSE DE MATERIAL OU SERVIÇO "]
[]
["ACESSORIOS DE MOTORES","ACESSORIOS DIVERSOS DE MOTORES DE AERONAVES"]
[null,"ACESSORIOS DIVERSOS DE MOTORES EXCETO DE AERONAVES"]
[null,"COMPONENTES DE SISTEMA DE ARREFECIMENTO DE MOTORES EXCETO  DE AERONAVES"]
[null,"COMPONENTES DE SISTEMA DE COMBUSTIVEL DE MOTORES EXCETO DE  AERONAVES"]
[null,"COMPONENTES DO SISTEMA DE COMBUSTIVEL DE MOTORES DE AERONAVES"]
[null,"COMPONENTES DO SISTEMA ELETRICO DE MOTORES EXCETO DE AERONAVES"]
[null,"PURIFICADORES E FILTROS DE AR E DE OLEO DE MOTORES DE AERONAVES"]
[null,"PURIFICADORES E FILTROS DE MOTORES EXCETO DE AERONAVES"]
["DESPESAS DE PESSOAL","ENCARGOS FINANCEIROS POR SERVICOS PRESTADOS POR PESSOA FISICA OU JURIDICA"]
[null,"ENCARGOS PREVIDENCIARIOS POR SERVICOS PRESTADOS  POR  PESSOAFISICA OU JURIDICA"]
[null,"SERVICOS DE ENCARGOS E INDENIZACOES"]
[null,"SERVICOS PRESTADOS POR ESTAGIARIOS MONITORES E MEDICOS RESIDENTES"]
[null,"BENEFICIOS"]
["ADMINISTRACAO GERAL","AQUISICAO E ASSINATURAS DE PERIODICOS"]
[null,"OUTROS SERVICOS DE PESSOA JURIDICA"]
[null,"SERV.ESPECIALIZADOS AREAS MEDICA ODONTOLOGICA REABILITACAOHOSPITALAR E DE LABORATORIO (EXAME-ANALISE-ENSAIO-PESQUISA)"]
[null,"SERVICO DE PUBLICIDADE PUBLICACAO IMPRESSAO REPRODUCAO E ENCADERNACAO"]
[null,"SERVICOS DE APOIO ADMINISTRATIVO  CONSERVACAO  E LIMPEZA DE BENS MOVEIS E IMOVEIS E INSTALACOES"]
[null,"SERVICOS DE HIGIENIZACAO E LIMPEZA"]
[null,"SERVICOS DE HOSPEDAGENS CURSOS PROMOCOES E EVENTOS"]
[null,"SERVICOS DE TECNOLOGIA DA INFORMACAO"]
[null,"SERVICOS DE TELECOMUNICACOES"]
[null,"SERVICOS DE TREINAMENTO E APERFEICOAMENTO PROFISSIONAL"]
[null,"SERVICOS ESPECIALIZADOS DE AUDITORIA CONSULTORIA E  ASSESSORIA"]
[null,"SERVICOS EVENTUAIS PRESTADOS POR PESSOA FISICA"]
[null,"SERVICOS PESSOA FISICA CONFORME CLASSIFICACAO              BRASILEIRA DE OCUPACOES"]
[null,"SERVICOS TECNICOS E SERVICOS ESPECIALIZADOS"]
[null,"SOFTWARES"]
["AERONAVES E COMPONENTES ESTRUTURAIS","AERONAVES"]
[null,"COMPONENTES ESTRUTURAIS DE AERONAVES -"]
["ANIMAIS VIVOS E MATERIAIS GENETICOS","ANIMAIS DE TRACAO POLICIAMENTO REPRODUCAO ESTUDOS"]
[null,"ANIMAIS VIVOS DE CORTE E DE ABATE"]
[null,"MATERIAIS GENETICOS"]
["APARELHOS E MEIOS AUXILIARES PARA TREINAMENTO","APARELHAGEM DE INSTRUCAO DE ARMAMENTO"]
[null,"APARELHAGEM PARA TREINAMENTO E INSTRUCAO"]
[null,"EQUIPAMENTOS E MEIOS AUXILIARES DIDATICOS/PEDAGOGICOS"]
[null,"MEIOS AUXILIARES PARA TESTES DE SELECAO E TREINAMENTO"]
["APARELHOS E UTENSILIOS PARA MEDICAO E INSPECAO","APARELHOS E UTENSILIOS DE MEDICAO"]
[null,"CALIBRES DE INSPECAO"]
[null,"EQUIPAMENTO PARA INSPECAO"]
[null,"JOGOS E ESTOJOS DE APARELHOS E UTENSILIOS PARA MEDICAO E INSPECAO"]
["ARAMES LAMINADOS PLANOS E PERFILADOS METALICOS","ARAMES DE ACO"]
[null,"BARRAS DE ACO/FERRO"]
[null,"BARRAS/PERFIS/VERGALHOES DE METAIS NAO FERROSOS"]
[null,"FOLHAS CHAPAS E TIRAS DE ACO/FERRO"]
[null,"FOLHAS CHAPAS E TIRAS DE METAIS NAO FERROSOS"]
[null,"PERFIS ESTRUTURAIS DE ACO/FERRO"]
[null,"PERFIS ESTRUTURAIS DE METAIS NAO FERROSOS"]
["ARTIGOS DE ESCRITORIO","ARTIGOS DE ESCRITORIO"]
[null,"COMPONENTES E PECAS PARA UTENSILIOS DE ESCRITORIO"]
[null,"FORMULARIOS (MODELOS) PADROES"]
[null,"PAPELARIA E FORMULARIOS EXCETO FORMULARIOS PADRONIZADOS"]
[null,"UTENSILIOS DE ESCRITORIO"]
["ARTIGOS DOMESTICOS E COMERCIAIS","CORTINAS TOLDOS PERSIANAS E COMPONENTES"]
[null,"EQUIPAMENTOS E ARTIGOS DOMESTICOS E COMERCIAIS DIVERSOS"]
[null,"GUARNICOES DE USO DOMESTICO (ROUPAS DE CAMA MESA BANHO    ETC)"]
[null,"RECIPIENTES DE USO DOMESTICO E COMERCIAL"]
[null,"REVESTIMENTOS PARA PISOS"]
["ARTIGOS PARA TOUCADOR E HIGIENE PESSOAL","PRODUTOS PARA HIGIENE PESSOAL"]
["BOMBAS E COMPRESSORES","BOMBAS MANUAIS MECANICAS ELETRONICAS E MOTO-BOMBAS"]
[null,"CENTRIFUGAS SEPARADORES E FILTROS A PRESSAO E A VACUO"]
[null,"COMPONENTES E ACESSORIOS PARA BOMBAS E COMPRESSORES         PARA CONTRATOS DE MANUTENCAO PREVENTIVA/CORRETIVA"]
[null,"COMPONENTES E PECAS PARA BOMBAS E COMPRESSORES"]
[null,"COMPRESSOR BOMBA DE VACUO E RESERVATORIO -"]
["CABO FIBRA OPTICA","ACESSORIOS E ARTIGOS PARA FIBRA OPTICA"]
[null,"CABO PARA FIBRA OPTICA -"]
[null,"COMPONENTES ACESSORIOS E ARTIGOS FIBRA OPTICA"]
[null,"EQUIPAMENTOS PARA FIBRA OPTICA -"]
[null,"INSTRUMENTOS DE TESTES FIBRA OPTICA"]
["CABOS DE ACO CORDAS CORRENTES CORDOALHAS E ACESSORIOS","ACESSORIOS PARA CORDAS CABOS DE ACO E CORRENTES"]
[null,"CABOS DE ACO E CORRENTES"]
[null,"CABOS DE FIBRA CORDOALHAS E BARBANTES"]
["COMBUSTIVEIS LUBRIFICANTES OLEOS GRAXAS E CERAS","CERAS OLEOS E GORDURAS DIVERSAS"]
[null,"COMBUSTIVEIS LIQUIDOS E GASOSOS"]
[null,"COMBUSTIVEIS PROPELENTES LIQUIDOS E OXIGENADORES"]
[null,"COMBUSTIVEIS SOLIDOS"]
[null,"OLEOS COMBUSTIVEIS"]
[null,"OLEOS E GRAXAS PARA CORTE LUBRIFICACAO E SISTEMA HIDRAULICO"]
["COMPONENTES DE EQUIPAMENTOS ELETRICOS E ELETRONICOS","ANTENAS GUIAS DE ONDAS E EQUIPAMENTOS CORRELATOS"]
[null,"BOBINAS E TRANSFORMADORES"]
[null,"CAPACITORES"]
[null,"CHAVES E INTERRUPTORES"]
[null,"COMPONENTES DIVERSOS ELETRICOS E ELETRONICOS"]
[null,"CONECTORES ELETRICOS"]
[null,"CONJUNTOS ELETRICOS E ELETRONICOS PLACAS CARTOES E  CORRELATOS"]
[null,"DISJUNTORES"]
[null,"DISPOSITIVOS A SEMICONDUTOR E PLACAS ASSOCIADAS (FOTOCELULA)"]
[null,"DISPOSITIVOS COM CIRCUITOS MICROELETRONICOS"]
[null,"DISPOSITIVOS OPTRONICOS E ITENS CORRELATOS"]
[null,"ESCOVA DE CONTATO ELETRICO E ELETRODOS"]
[null,"FERRAGENS E ACESSORIOS ELETRICOS"]
[null,"FILTROS E MALHAS DE FILTRO"]
[null,"FONES MONOFONES MICROFONES E ALTO-FALANTES"]
[null,"FUSIVEIS E PARA-RAIOS"]
[null,"ISOLANTES ELETRICOS E MATERIAL ISOLANTE"]
[null,"MODULOS ELETRONICOS"]
[null,"RELES CONTACTORES E SOLENOIDES"]
[null,"RESISTORES"]
[null,"TERMINAIS TIPO ORELHA JOGO DE TERMINAIS"]
[null,"VALVULAS ELETRONICAS E FERRAGENS ASSOCIADAS"]
["COMPONENTES PARA VEICULOS","COMPONENTES DE RODAS E ESTEIRAS DE VEICULOS"]
[null,"COMPONENTES DIVERSOS E ACESSORIOS DE VEICULOS"]
[null,"COMPONENTES DO SISTEMA DE CAPOTARIA DE VEICULOS"]
[null,"COMPONENTES DO SISTEMA DE DIRECAO DE VEICULOS"]
[null,"COMPONENTES DO SISTEMA DE FREIO DE VEICULOS"]
[null,"COMPONENTES DO SISTEMA DE SUSPENSAO DE VEICULOS"]
[null,"COMPONENTES DO SISTEMA DE TRANSMISSAO DE FORCA DE VEICULOS"]
[null,"COMPONENTES DO SISTEMA ELETRICO DE VEICULOS"]
[null,"COMPONENTES E ACESSORIOS DE VEICULOS PARA CONTRATACAO MEDIANTE FORNECIMENTO PARCELADO"]
[null,"COMPONENTES ESTRUTURAIS (CHASSIS CARROCERIA E CABINES E COMPONENTES) DE VEICULOS"]
[null,"COMPONENTES PARA VEICULOS ESPECIAIS"]
[null,"MATERIAL DE FIXACAO VEDACAO E LUBRIFICACAO PARA  USO  VEICULAR"]
[null,"MOTORES AUTOMOTIVOS E COMPONENTES"]
[null,"PECAS E COMPONENTES VEICULARES"]
[null,"SISTEMA DE EIXO DE VEICULOS E COMPONENTES"]
[null,"TINTAS VERNIZES E PRODUTOS CORRELATOS USO AUTOMOTIVO"]
["EMBARCACOES PONTOES E DIQUES FLUTUANTES","EMBARCACOES PARA TRANSPORTE DE PASSAGEIROS"]
[null,"PEQUENAS EMBARCACOES"]
["EQUIPAMENTOS COMERCIAIS E DE SERVICOS","COMPONENTES E ACESSORIOS PARA EQUIPAMENTOS DE LAVANDERIA    PARA CONTRATOS DE MANUTENCAO CORRETIVA/PREVENTIVA"]
[null,"COMPONENTES E PECAS PARA EQUIPAMENTOS COMERCIAIS E DE       SERVICOS"]
[null,"EQUIPAMENTOS DE LAVANDERIA"]
[null,"EQUIPAMENTOS DIVERSOS COMERCIAIS E DE SERVICOS"]
[null,"EQUIPAMENTOS E COMPONENTES PARA AUTOMACAO E CONTROLE"]
[null,"EQUIPAMENTOS PARA ACONDICIONAMENTO E EMBALAGEM"]
[null,"EQUIPAMENTOS PARA MANUFATURA E CONSERTO DE CALCADOS"]
[null,"MAQUINAS E EQUIPAMENTOS INDUSTRIAIS DE COSTURA"]
["EQUIPAMENTOS DE CALEFACAO AQUECIMENTO E INSTALACOES SANITARIAS","APARELHOS HIDRAULICOS-SANITARIOS E ACESSORIOS"]
[null,"EQUIPAMENTOS DIVERSOS HIDRAULICOS SANITARIOS E DE CALEFACAO"]
[null,"EQUIPAMENTOS P/ CALEFACAO DE AMBIENTES/AQUECEDORES DE AGUA DOMESTICOS"]
[null,"EQUIPAMENTOS PARA QUEIMA DE COMBUSTIVEL"]
[null,"TANQUES E RESERVATORIOS DE AGUA E COMPONENTES"]
["EQUIPAMENTOS DE COMUNICACOES","EQUIPAMENTO DE RADIACAO EMITIDAREFLETIDA E VISAO NOTURNA"]
[null,"EQUIPAMENTOS DE COMUNICACAO DE RADIO E DE TELEVISAO"]
[null,"EQUIPAMENTOS DE COMUNICACAOSEGURANCA E COMPONENTES -"]
[null,"EQUIPAMENTOS DE RADAR EXCETO OS AEROTRANSPORTAVEIS"]
[null,"EQUIPAMENTOS DIVERSOS DE COMUNICACOES"]
[null,"EQUIPAMENTOS INTERCOMUNICADORES/SISTEMA ALTO-FALANTESEXCETO AEROTRANSPORTAVEL"]
[null,"EQUIPAMENTOS PARA GRAVACAO E REPRODUCAO DE SOM"]
[null,"EQUIPAMENTOS PARA GRAVACAO E REPRODUCAO DE VIDEO"]
[null,"EQUIPAMENTOS TELEFONICOS E TELEGRAFICOS"]
[null,"PECAACESSORIO E COMPONENTE P/EQUIPAMENTO DE COMUNICACAO    - EXCETO INFORMATICA"]
[null,"TELEIMPRESSORAS E EQUIPAMENTOS FAC-SIMILES"]
["EQUIPAMENTOS DE LABORATORIO E INSTRUMENTOS DE MEDICAO","CAMARAS AMBIENTAIS E EQUIPAMENTOS CORRELATOS"]
[null,"COMPONENTES E ACESSORIOS PARA EQUIPAMENTOS DE LABORATORIO   PARA CONTRATOS DE MANUTENCAO PREVENTIVA/CORRETIVA"]
[null,"COMPONENTES E ACESSORIOS PARA ESCALAS E BALANCAS"]
[null,"EQUIPAMENTOS DE LABORATORIO"]
[null,"EQUIPAMENTOS E ACESSORIOS PARA ENSAIO E VERIFICACAO DE PRO  PRIEDADES FISICAS"]
[null,"EQUIPAMENTOS E INSTRUMENTOS PARA ANALISE QUIMICA"]
[null,"ESCALAS E BALANCAS"]
[null,"INSTRUMENTOS COMBINADOS E INSTRUMENTOS DIVERSOS"]
[null,"INSTRUMENTOS DE LABORATORIO"]
[null,"INSTRUMENTOS DE NAVEGACAO"]
[null,"INSTRUMENTOS DE VERIFICACAO ENSAIO E MEDICAO DE APARELHAGEM ELETRICA E ELETRONICA"]
[null,"INSTRUMENTOS DE VOO"]
[null,"INSTRUMENTOS E APARELHOS DE METEOROLOGIA"]
[null,"INSTRUMENTOS E APARELHOS PARA DETECCAO DE PERIGOS"]
[null,"INSTRUMENTOS OPTICOS"]
[null,"INSTRUMENTOS PARA CONTROLE E MEDICAO DE PRESSAO TEMPERATURA E UMIDADE"]
[null,"INSTRUMENTOS PARA DESENHO TOPOGRAFIA E CARTOGRAFIA"]
[null,"INSTRUMENTOS PARA MEDICAO DE TEMPO"]
[null,"INSTRUMENTOS PARA MEDICAO FLUXOS GAS/LIQUIDOS/NIVEL  E  MOVIMENTOS MECANICOS"]
[null,"PECAS E COMPONENTES P/INSTRUMENTOS DE VERIFICACAOENSAIO E MEDICAO DE ELETRICA E ELETRONICA"]
[null,"PECAS E COMPONENTES PARA CAMARAS AMBIENTAIS E EQUIPAMENTOS  CORRELATOS"]
[null,"PECAS E COMPONENTES PARA EQUIPAMENTOS DE LABORATORIO"]
[null,"PECAS E COMPONENTES PARA EQUIPAMENTOS E INSTRUMENTOS  PARA  ANALISE QUIMICA"]
[null,"PECAS E COMPONENTES PARA EQUIPAMENTOS PARA ENSAIO E VERIFICACAO DE PROPRIEDADES FISICAS"]
[null,"PECAS E COMPONENTES PARA INSTRUMENTOS COMBINADOS E INSTRUMENTOS DIVERSOS"]
[null,"PECAS E COMPONENTES PARA INSTRUMENTOS E APARELHOS DE METEREOLOGIA"]
[null,"PECAS E COMPONENTES PARA INSTRUMENTOS E APARELHOS PARA DETECCAO DE PERIGOS"]
[null,"PECAS E COMPONENTES PARA INSTRUMENTOS OPTICOS"]
[null,"PECAS E COMPONENTES PARA INSTRUMENTOS PARA CONTROLE E MEDICAO DE PRESSAO TEMPERATURA E UMIDADE"]
[null,"PECAS E COMPONENTES PARA INSTRUMENTOS PARA MEDICAO DE FLUXOS GAS/LIQUIDOS/NIVEL E MOVIMENTOS MECANICOS"]
[null,"PECAS E COMPONENTES PARA INSTRUMENTOS PARA MEDICAO DE TEMPO"]
[null,"SISTEMAS DE MONITORAMENTO CLIMATICOS"]
[null,"SUPRIMENTOS PARA LABORATORIO"]
["EQUIPAMENTOS DE REFRIGERACAO CONDICIONAMENTO DE AR E VENTI LACAO","COMPONENTES E ACES.DE UNIDADES  DE REFRIGERACAO E CONDICIONAMENTO DE AR P/ CONTRATOS DE MANUTENCAO PREVENTIVA/CORRETIVA"]
[null,"EQUIP.INDUSTRIAL DE CLIMATIZACAO VENTILACAO E CIRCULACAO -"]
[null,"PECAS ACESSORIOS E COMPONENTES PARA EQUIPAMENTOS DE REFRIGERACAO E CONDICIONAMENTO DE AR"]
[null,"UNIDADES COMPLETAS DE CONDICIONAMENTO DE AR E ACESSORIOS"]
[null,"UNIDADES COMPLETAS DE REFRIGERACAO E ACESSORIOS"]
[null,"USINAS DE CONDICIONAMENTO DE AR DE REFRIGERACAO  E COMPONENTES"]
[null,"VENTILADORCIRCULADORCLIMATIZADOR(DES)UMIDIFICADOR DE AR"]
["EQUIPAMENTOS DE SINALIZACAO E ALARME","PECAS E COMPONENTES PARA EQUIPAMENTOS DE SINALIZACAO E  ALARME"]
[null,"SISTEMA DE SINALIZACAO DE TRAFEGO E TRANSITO"]
[null,"SISTEMAS DIVERSOS DE SINALIZACAO E ALARME"]
["EQUIPAMENTOS E MAQUINARIA PARA TRABALHOS EM MADEIRA","FERRAMENTAS E IMPLEMENTOS DE MAQUINA PARA TRABALHO EM  MADEIRA"]
[null,"MAQUINARIA PARA TRABALHOS EM MADEIRA"]
[null,"PECAS E COMPONENTES PARA EQUIPAMENTOS E MAQUINARIA PARA TRABALHOS EM MADEIRA"]
[null,"SERRARIA E OFICINA DE APLAINAR"]
["EQUIPAMENTOS E MAQUINARIA PARA TRABALHOS EM METAL","ACESSORIOS PARA MAQUINAS-FERRAMENTA"]
[null,"ARTIGOS E ACESSORIOS PARA SOLDAGENS COMUM FRACA E POR CALDEAMENTO"]
[null,"DESBASTADORAS E PLAINAS-LIMADORAS"]
[null,"EQUIPAMENTOS DE SOLDA A ARCO VOLTAICO"]
[null,"EQUIPAMENTOS DE SOLDA A RESISTENCIA ELETRICA"]
[null,"EQUIPAMENTOS DE SOLDA DIVERSOS  (EM GERAL)"]
[null,"EQUIPAMENTOS PARA TRATAMENTO TERMICO DE METAIS"]
[null,"FERRAMENTAS DE CORTES PARA MAQUINAS-FERRAMENTA"]
[null,"GABARITOS PARA PRODUCAO FURACAO E COPIAS"]
[null,"MAQUINA DE FRESAR"]
[null,"MAQUINA DE FURAR METAL"]
[null,"MAQUINAS DE DOBRAR E MOLDAR"]
[null,"MAQUINAS DE ESMERILHAR E RETIFICAR"]
[null,"MAQUINAS DE PUNCIONAR E TESOURAS MECANICAS"]
[null,"MAQUINAS DE REBITAR"]
[null,"MAQUINAS SECUNDARIAS PARA FORMA E CORTE DE METAL"]
[null,"MAQUINAS-FERRAMENTA DIVERSAS"]
[null,"MATERIAIS E EQUIPAMENTOS PARA FUNDICAO EM GERAL"]
[null,"MATERIAL COMPONENTES E PECAS PARA EQUIPAMENTOS E MAQUINARIAPARA TRABALHOS EM METAL"]
[null,"PRENSA MANUAL"]
[null,"PRENSAS HIDRAULICAS/ELETRICAS/PNEUMATICAS A MOTOR"]
[null,"SERRAS E MAQUINA DE LIMAR"]
[null,"SOLDA A GAS CORTE A QUENTE E EQUIPAMENTO DE METALIZACAO"]
[null,"TORNOS"]
["EQUIPAMENTOS ESPECIALIZADOS PARA MANUTENCAO E REPAROS","EQUIPAMENTOS ESPECIALIZADOS PARA MANUTENCAO E REPAROS"]
[null,"EQUIPAMENTOS ESPECIAIS PARA MANUTENCAO E REPAROS DE VEICULOS E EQUIPAMENTOS"]
["EQUIPAMENTOS PARA  REFEITORIO COPA E COZINHA","ARTIGOS PARA SERVICOS DE MESAS"]
[null,"EQUIPAMENTOS AUXILIARES DE COZINHA"]
[null,"EQUIPAMENTOS ACESSORIOS E PECAS PARA PREPARAR ALIMENTOS"]
[null,"JOGOS E ESTOJOS DE ARTIGOS PARA REFEITORIOCOPA E COZINHA"]
[null,"TALHERES DE MESA E CUTELARIA"]
[null,"UTENSILIOS DE COZINHA MANUAIS"]
["EQUIPAMENTOS PARA CONSTRUCAO MINERACAO ESCAVACAO E  CONSERVACAO DE ESTRADAS","ACESSORIOS E COMPONENTES PARA EQUIPAMENTOS DIVERSOS PARA CONSTRUCAO"]
[null,"ACESSORIOS E COMPONENTES PARA EQUIPAMENTOS PARA MINERACAO PERFURACAO DE ROCHA TERRA E CORRELATOS"]
[null,"ACESSORIOS E COMPONENTES PARA EQUIPAMENTOS PARA MOVIMENTACAO E ESCAVACAO DE TERRA"]
[null,"ACESSORIOS E PECAS DE GUINDASTE E DE GUINDASTES-ESCAVADEIRAS"]
[null,"COMPONENTES E ACESSORIOS PARA EQUIPAMENTOS DE MOVIMENTACAO EESCAVACAO DE TERRA - CONTRATACAO MEDIANTE FORN. PARCELADO"]
[null,"EQUIPAMENTOS DIVERSOS PARA CONSTRUCAO"]
[null,"EQUIPAMENTOS PARA  MINERACAO PERFURACAO  DE  ROCHA TERRA ECORRELATOS"]
[null,"EQUIPAMENTOS PARA MOVIMENTACAO E ESCAVACAO DE TERRA"]
[null,"GUINDASTES E GUINDASTES-ESCAVADEIRAS"]
[null,"IMPLEMENTOS PARA CAMINHOES E TRATORES"]
[null,"MATERIAL DE FIXACAOVEDACAO E LUBRIFICACAO EQUIPAMENTOS CONSTRUCAO/MINERACAO/ESCAVACAO/CONSTRUCAO ESTRADAS"]
["EQUIPAMENTOS PARA PURIFICACAO  E TRATAMENTO DE AGUA  E TRATAMENTO DE ESGOTOS","EQUIPAMENTOS PARA PURIFICACAO DE AGUA E COMPONENTES"]
[null,"EQUIPAMENTOS PARA TRATAMENTO DE ESGOTOS"]
["EQUIPAMENTOS PARA SEGURANCA PESSOAL E INDUSTRIAL","EQUIP.COMPONENTES E ACESSORIOS COMBATE A INCENDIO"]
[null,"EQUIPAMENTO E ACESSORIO MARITIMO PARA MERGULHO E SALVAMENTO-"]
[null,"EQUIPAMENTOCOMPONENTE E SUPRIMENTOS PARA BUSCA E SEGURANCA"]
[null,"EQUIPAMENTOS PARA IMPREGNACAO E DESCONTAMINACAO"]
["EQUIPAMENTOS PARA TRANSMISSAO DE ENERGIA MECANICA","CORREIAS DE TRANSMISSAO E ACESSORIOS"]
[null,"EQUIPAMENTOS DIVERSOS PARA TRANSMISSAO DE FORCA"]
["EQUIPAMENTOS PERIFERICOS ACESSORIOS  E SUPRIMENTOS  DE PROCESSAMENTO DE DADOS EM GERAL","ARMAZENAMENTO - INFORMATICA -"]
[null,"ATIVOS DE REDE"]
[null,"COMPONENTES DE PROCESSAMENTO DE DADOS"]
[null,"COMPONENTES PERIFERICOS E ACESSORIOS DE INFORMATICA -"]
[null,"DISPOSITIVO DE CONTROLE PARA COMPUTADOR E MICRO"]
[null,"EQUIPAMENTOS COMBINADOS PARA INFORMATIZACAO E PROCESSAMENTO DE DADOS"]
[null,"EQUIPAMENTOS DE APOIO E MATERIAL DE CONSUMO PARA INFORMATICA"]
[null,"EQUIPAMENTOS DE INFORMATICA -"]
[null,"EQUIPAMENTOS E DISPOSITIVOS DE SEGURANCA  PARA  EQUIPAMENTOSDE INFORMATICA"]
[null,"UNIDADE CENTRAL DE  PROCESSAMENTO  ANALOGICO (CPU) COMPONENTES E PERIFERICOS"]
[null,"UNIDADE CENTRAL DE PROCESSAMENTO HIBRIDA (CPU)"]
["ESTRUTURAS E ANDAIMES PRE FABRICADOS","ABRIGOS DE PAREDE RIGIDA"]
[null,"ANDAIMES ESCADAS E FORMAS DE CONCRETO"]
[null,"EDIFICIOS PRE-FABRICADOS E PORTATEIS"]
[null,"ESTRUTURAS DE TORRES PRE-FABRICADAS"]
[null,"ESTRUTURAS DIVERSAS PRE-FABRICADAS"]
[null,"PONTES FIXAS MOVEIS E FLUTUANTES"]
[null,"TANQUES DE ARMAZENAGEM COMPONENTES E PECAS"]
["EXPLOSIVOS MUNICOES E DISPOSITIVOS DE DISPERSAO","ARTIGOS PIROTECNICOS E SINALIZADORES"]
[null,"DISPOSITOS DE DISPERSAO NAO EXPLOSIVOS"]
[null,"EXPLOSIVOS E DISPOSITIVOS DE EXPLOSAO"]
[null,"MUNICOES"]
["FERRAGENS ABRASIVOS E MATERIAIS PARA VEDACAO","ARRUELA CALCO E ESPACADOR"]
[null,"DISCOS PEDRAS E CORREIAS ABRASIVAS"]
[null,"DISPOSITIVOS DE FIXACAO"]
[null,"FERRAGENS DIVERSAS"]
[null,"MATERIAIS ABRASIVOS"]
[null,"MATERIAIS PARA VEDACAO"]
[null,"MOLAS DE FIO CHATA E ESPECIAL"]
[null,"MOSTRADORES PONTEIROS E BOTOES DE CONTROLE"]
[null,"PARAFUSOS COM FENDAS"]
[null,"PARAFUSOS SEM FENDAS"]
[null,"PORCAS E ARRUELAS PARA PARAFUSOS"]
[null,"PREGOS CHAVETAS E PINOS"]
[null,"PRISIONEIROS"]
[null,"REBITES"]
[null,"TELAS E TECIDOS METALICOS"]
["FERRAMENTAS MANUAIS E COMPONENTES","BROCAS REBAIXADORES E ESCARIADORES"]
[null,"COMPONENTES E PECAS PARA FERRAMENTAS MANUAIS MOTORIZADAS/  ELETRICAS TIPO EMPUNHAVEL"]
[null,"FERRAMENTAS ESPECIAIS MANUTENCAO E REPAROS"]
[null,"FERRAMENTAS MANUAIS MOTORIZADAS/ELETRICAS/PNEUMATICAS TIPO EMPUNHAVEL"]
[null,"FERRAMENTAS MANUAIS COM CORTE NAO MOTORIZADAS"]
[null,"FERRAMENTAS MANUAIS SEM CORTE NAO MOTORIZADAS"]
[null,"FERRAMENTAS PARA MANUTENCAO EM EQUIPAMENTOS DE INFORMATICA"]
[null,"JOGOS E CONJUNTOS DE FERRAMENTAS MANUAIS"]
[null,"MACHOS COSSINETES E COLETORES"]
[null,"RECIPIENTE PARA FERRAMENTAS"]
["FIOS CABOS TELEFONICOS CONDUITES ELETRICOS EQUIPAMENTO PARA GERACAO E DISTRIBUICAO DE ENERGIA","ACESSORIOS E REVESTIMENTOS DIVERSOS PARA BATERIAS"]
[null,"BATERIA E PILHA RECARREGAVEL E NAO-RECARREGAVEL"]
[null,"BATERIAS PRIMARIAS (PILHAS)"]
[null,"CELULA COMBUSTIVEL COMPONENTES E ACESSORIOS"]
[null,"COMPONENTES E ACESSORIOS PARA GRUPOS GERADORES PARA         CONTRATOS DE MANUTENCAO PREVENTIVA/CORRETIVA"]
[null,"CONVERSORES ELETRICOS NAO ROTATIVOS"]
[null,"CONVERSORES ELETRICOS ROTATIVOS"]
[null,"EQUIPAMENTOS PARA CONTROLE ELETRICO"]
[null,"FIOS CABOS ELETRICOS E TELEFONICOS"]
[null,"GERADORES ELETRICOS PECAS E COMPONENTES"]
[null,"MATERIAIS E EQUIPAMENTOS DIVERSOS PARA GERACAO/DISTRIBUICAO ENERGIA ELETRICA"]
[null,"MOTORES ELETRICOS E COMPONENTES"]
[null,"SISTEMAS DE ENERGIA ELETRICA SOLAR"]
["FORNOS CENTRAIS DE VAPOR E EQUIPAMENTOS PARA SECAGEM","CALDEIRAS INDUSTRIAIS"]
[null,"COMPONENTES E PECAS PARA CALDEIRASFORNOSCENTRAIS DE VAPOR E EQUIPAMENTOS DE SECAGEM"]
[null,"FORNALHAS E FORNOS INDUSTRIAIS FORNOS-TUNEIS E ESTUFAS"]
[null,"SECADORES DESIDRATADORES E ANTI-HIDRATADORES"]
["FORRAGENS FERTILIZANTES SEMENTES E MUDAS","AGROTOXICOS"]
[null,"FERTILIZANTES"]
[null,"FORRAGENS E ALIMENTOS PARA ANIMAIS"]
[null,"INOCULANTES"]
[null,"SEMENTES E VIVEIROS PARA PLANTAS"]
["GENEROS ALIMENTICIOS E BEBIDAS","ACUCAR E PRODUTOS DE CONFEITARIA"]
[null,"ALIMENTOS PREPARADOS E ALIMENTOS DIETETICOS"]
[null,"BEBIDAS ALCOOLICAS"]
[null,"BEBIDAS NAO ALCOOLICAS"]
[null,"CARNES AVES ABATIDAS E PEIXES"]
[null,"CONDIMENTOS E PRODUTOS CORRELATOS"]
[null,"DIETAS ENTERAIS SUPLEMENTOS E MODULOS NUTRICIONAIS  -"]
[null,"DOCES GELEIAS E COMPOTAS"]
[null,"FARINHAS E PRODUTOS DE PANIFICACAO"]
[null,"OLEOS E GORDURAS COMESTIVEIS"]
[null,"OVOS E LATICINIOS"]
[null,"PRODUTOS ALIMENTICIOS DE DISTRIBUICAO GRATUITA"]
[null,"PRODUTOS E PREPARADOS SOLUVEIS"]
[null,"SEMENTES E CEREAIS BENEFICIADOS FRUTAS LEGUMES E HORTALICAS"]
[null,"SOPAS E CALDOS"]
[null,"SORVETES SUCOS REFRESCOS E BEBIDAS LACTEAS"]
["INSTRUMENTOS MUSICAIS RADIOS FONOGRAFOS TELEVISOR VIDEO AUDIO SONORIZACAO E ACESSORIOS","ACESSORIOS E PARTES DE INSTRUMENTOS MUSICAIS"]
[null,"GRAVACAO FONOGRAFICACINEMATOGRAFICA E FITA VIRGEM"]
[null,"INSTRUMENTOS MUSICAIS"]
[null,"RADIOS FONOGRAFOS TELEVISORES TIPO DOMESTICO E ACESSORIOS"]
["LAMPADAS E APARELHOS DE ILUMINACAO","APARELHOS  E ARTIGOS DE ILUMINACAO ELETRICA VEICULAR"]
[null,"APARELHOS E ARTIGOS DE ILUMINACAO ELETRICA INTERNOS E EXTERNOS"]
[null,"APARELHOS E ARTIGOS DE ILUMINACAO ELETRICA PORTATEIS E MANUAIS"]
[null,"EQUIPAMENTO DE INFRAESTRUTURA PARA ILUMINACAO"]
[null,"LAMPADAS ELETRICAS"]
[null,"MATERIAIS E APARELHOS DE ILUMINACAO NAO ELETRICOS"]
[null,"REATORES(COMPENSADOS) ELEMENTOS DE PARTIDA E PORTA-LAMPADAS"]
["LIVROS MAPAS E OUTRAS PUBLICACOES","IMPRESSOS DIVERSOS"]
[null,"JORNAIS E PERIODICOS"]
[null,"LIVROS E FOLHETOS"]
[null,"LIVROS E FOLHETOS DE MUSICA"]
[null,"MAPAS ATLAS CARTAS ORTO E AEROFOTOS IMAGEM ORBITAL E GLOBOS"]
[null,"NORMAS E DESENHOS TECNICOS"]
["LOCACOES","SERVICO DE LOCACAO DE EQUIPAMENTOS MAQUINAS APARELHOS INSTRUMENTAL FERRAMENTAL MATERIAL E INSTALACOES"]
[null,"SERVICOS DE LOCACAO DE APARELHOS EQUIPAMENTOS DE TELECOMUNICACAO E LINHAS"]
[null,"SERVICOS DE LOCACAO DE IMOVEIS"]
[null,"SERVICOS DE LOCACAO DE MATERIAIS E EQUIPAMENTOS DE MIDIA"]
[null,"SERVICOS DE LOCACAO DE VEICULOS E AERONAVES"]
["MADEIRAS  ESQUADRIAS  COMPENSADOS E FOLHEADOS","COMPENSADOS FOLHEADOS  E AGLOMERADOS"]
[null,"ESQUADRIA DE MADEIRA"]
[null,"MADEIRAS E PRODUTOS DERIVADOS"]
["MAQUINARIA E EQUIPAMENTOS AGRICOLAS","COMPONENTES E PECAS PARA MAQUINA E EQUIPAMENTOS AGRICOLAS"]
[null,"EQUIPAMENTOS AGRICOLAS"]
[null,"EQUIPAMENTOS DE COLHEITA"]
[null,"EQUIPAMENTOS DE TRACAO ANIMAL"]
[null,"EQUIPAMENTOS PARA AGRO-PECUARIA"]
[null,"EQUIPAMENTOS PARA COMBATE A PRAGAS"]
[null,"FERRAMENTAS PARA JARDINAGEM E HORTICULTURA"]
[null,"MATERIAIS DIVERSOS PARA ANIMAIS"]
[null,"PECAS E COMPONENTES PARA EQUIPAMENTOS AGRICOLAS -CONTRATACAOMEDIANTE FORNECIMENTO PARCELADO"]
["MAQUINARIA EQUIPAMENTOS COMPONENTES E SUPRIMENTOS PARA A  INDUSTRIA ESPECIALIZADA","EQUIPAMENTO PARA PRODUCAO E RECICLAGEM DE GASES -"]
[null,"EQUIPAMENTOS COMPONENTES E SUPRIMENTOS PARA INDUSTRIAS DIVERSAS"]
[null,"MAQUINAS INDUSTRIAIS DE MONTAGEM"]
[null,"MAQUINAS EQUIPAMENTOS E COMPONENTES DE MANUFATURA DE  PRODUTOS QUIMICOS E FARMACEUTICOS"]
[null,"MAQUINAS EQUIPAMENTOS COMPONENTES E SUPRIMENTOS PARA INDUSTRIA DE BORRACHA PLASTICO E PRODUTOS SINTETICOS"]
[null,"MAQUINAS EQUIPAMENTOS COMPONENTES E SUPRIMENTOS PARA INDUSTRIA DE PRODUTOS ALIMENTICIOS"]
[null,"MAQUINAS EQUIPAMENTOS COMPONENTES E SUPRIMENTOS PARA INDUSTRIA DE PRODUTOS DE ARGILA E CONCRETO"]
[null,"MAQUINAS EQUIPAMENTOS COMPONENTES E SUPRIMENTOS PARA INDUSTRIA GRAFICA"]
[null,"MAQUINAS EQUIPAMENTOS COMPONENTES E SUPRIMENTOS PARA INDUSTRIAS TEXTEIS"]
[null,"MAQUINAS EQUIPAMETOS COMPONENTES E SUPRIMENTOS PARA INDUSTRIA DE POLPA E DE PAPEL"]
[null,"PECAS E COMPONENTES PARA MAQUINARIA E EQUIPAMENTOS P/INDUS  TRIA ESPECIALIZADA"]
["MAQUINAS DE ESCRITORIO E EQUIPAMENTO DE REGISTRO VISUAL","EQUIPAMENTOS DE SISTEMAS DE INFORMACAO PARA ESCRITORIO"]
[null,"MAQUINA DE DATILOGRAFIA E MAQUINA DE COMPOSICAO DE TIPOS  PARA ESCRITORIO"]
[null,"MAQUINAS CALCULADORAS E DE CONTABILIDADE"]
[null,"MAQUINAS DIVERSAS DE ESCRITORIO"]
[null,"PECASACESSORIOS E COMPONENTES PARA MAQUINAS DE ESCRITORIO E EQUIPAMENTOS DE REGISTRO VISUAL"]
["MATERIAIS DIVERSOS","ACESSORIOS E PECAS PARA ARTESANATO E BIJUTERIA"]
[null,"ARTIGOS PARA FUMANTES E PRODUTOS DE TABACO (FUMO)"]
[null,"EQUIPAMENTOS MOBILIARIOS E SUPRIMENTOS ECLESIASTICOS"]
[null,"ITENS DIVERSOS"]
[null,"LETREIROS MOSTRUARIOS DISPOSITIVOS DE AVISOS E CHAPAS DE IDENTIFICACAO"]
[null,"MATERIAIS DIVERSOS PARA ALIENACAO"]
[null,"MATERIAIS PROMOCIONAIS"]
[null,"MATERIAL PARA CONSERVACAO E RESTAURACAO"]
[null,"PATRIMONIO ANTIGO - MATERIAIS NAO CLASSIFICADOS             EM OUTROS GRUPOS"]
[null,"PECAS PARA ACERVO E OBRAS DE ARTE - ITENS COLECIONADORES"]
["MATERIAIS E EQUIPAMENTOS FOTOGRAFICOS E CINEMATOGRAFICOS","CAMERA E EQUIPAMENTOS FOTOGRAFICOS -"]
[null,"CAMERAS CINEMATOGRAFICAS E DE ESTUDIO DE TV"]
[null,"EQUIPAMENTOS PARA PROJECAO FOTOGRAFICA E CINEMATOGRAFICA"]
[null,"EQUIPAMENTOS PARA REVELACAO E ACABAMENTOS FOTOGRAFICOS"]
[null,"JOGOS E ESTOJOS DE MATERIAL FOTOGRAFICO  E CINEMATOGRAFICO"]
[null,"MATERIAIS FOTOGRAFICOS E CINEMATOGRAFICOS"]
[null,"PECAS E ACESSORIOS PARA EQUIPAMENTOS FOTOGRAFICOS CINEMATO GRAFICOS E DE PROJECAO"]
["MATERIAIS E EQUIPAMENTOS PARA EMBARCACOES","EQUIPAMENTOS COMPONENTES E ACESSORIOS PARA EMBARCACOES"]
[null,"FERRAGENS PARA EMBARCACOES E ITENS DO CASCO"]
["MATERIAIS E EQUIPAMENTOS PARA LIMPEZA","ASPIRADORES DE PO E ENCERADEIRA E SEUS COMPONENTES"]
[null,"COMPOSTOS E PREPARADOS PARA LIMPEZA E POLIMENTO"]
[null,"EQUIPAMENTOS AUXILIARES E MATERIAIS PARA LIMPEZA"]
["MATERIAIS E EQUIPAMENTOS PARA RECREACAO E DESPORTO","JOGOS E BRINQUEDOS"]
[null,"MATERIAIS E EQUIPAMENTOS PARA ATLETISMO E DESPORTO"]
[null,"MATERIAIS E EQUIPAMENTOS PARA GINASTICA E RECREACAO"]
[null,"PECAS E COMPONENTES"]
["MATERIAIS E EQUIPAMENTOS PARA USOS MEDICOS ODONTOLOGICOS  E VETERINARIOS","COMPONENTES E ACESSORIOS PARA EQUIPAMENTOS MEDICOS-HOSPITALARES PARA CONTRATOS DE MANUTENCAO PREVENTIVA/CORRETIVA"]
[null,"COMPONENTES E ACESSORIOS PARA EQUIPAMENTOS ODONTOLOGICOS    PARA CONTRATOS DE MANUTENCAO PREVENTIVA/CORRETIVA"]
[null,"COMPONENTES E PECAS DE MOBILIARIO PARA USO MEDICO HOSPITALAR E REABILITACAO"]
[null,"COSMETICOS E PRODUTOS DE TOALETES PARA PACIENTES HOSPITALIZADOS"]
[null,"DROGAS PRODUTOS BIOLOGICOS E REAGENTES OFICINAIS (PADRONIZADOS)"]
[null,"EQUIPAMENTOS E APARELHOS ODONTOLOGICOS"]
[null,"EQUIPAMENTOS E SUPRIMENTOS PARA  RAIO-X USO MEDICO/ODONTOLOGICO/VETERINARIO"]
[null,"EQUIPAMENTOS PARA TECNOLOGIA ASSISTIVA"]
[null,"EQUIPAMENTOS APARELHOS E UTENSILIOS MEDICOS-HOSPITALARES"]
[null,"EQUIPAMENTOS INSTRUMENTOS  E  SUPRIMENTOS DE OFTALMOLOGIA  (OPTOMETRIA)"]
[null,"INSTRUMENTOS E UTENSILIOS ODONTOLOGICOS"]
[null,"INSTRUMENTOS MEDICOS-HOSPITALARES"]
[null,"INSTRUMENTOS EQUIPAMENTOS E ARTIGOS VETERINARIOS"]
[null,"MATERIAIS CIRURGICOS PARA CURATIVOS"]
[null,"MOBILIARIO PARA USO MEDICO HOSPITALAR REABILITACAO E      LABORATORIO"]
[null,"PECAS E COMPONENTES DE EQUIPAMENTOS PARA USO ODONTOLOGICO"]
[null,"PECAS E COMPONENTES PARA EQUIPAMENTOS DE RAIO-X USO MEDICO ODONTOLOGICO E VETERINARIO"]
[null,"PECAS E COMPONENTES PARA EQUIPAMENTOS E INSTRUMENTOS DE OFTALMOLOGIA (OPTOMETRIA)"]
[null,"PECAS E COMPONENTES PARA EQUIPAMENTOS MEDICOS CIRURGICOS E HOSPITALARES"]
[null,"SUPRIMENTOS PARA TECNOLOGIA ASSISTIVA"]
[null,"SUPRIMENTOS PARA USO MEDICO E CIRURGICO"]
[null,"SUPRIMENTOS PARA USO ODONTOLOGICO"]
[null,"VESTUARIO DE USO MEDICO E ODONTOLOGICO NAO DESCARTAVEL"]
[null,"VESTUARIO DESCARTAVEL DE USO MEDICO ODONTOLOGICO E HOSPITA LAR"]
["MATERIAIS MANUFATURADOS NAO METALICOS","MATERIAIS DIVERSOS NAO METALICOS ACABADOS"]
[null,"PAPEL E PAPELAO"]
[null,"PRODUTOS ACABADOS DE BORRACHA"]
[null,"PRODUTOS ACABADOS DE PLASTICO"]
[null,"PRODUTOS ACABADOS DE REFRATARIOS"]
[null,"PRODUTOS ACABADOS DE VIDRO"]
["MATERIAIS PARA CONSTRUCAO","CERCADOS TELAS E PORTOES"]
[null,"MATERIAIS DIVERSOS PARA CONSTRUCAO"]
[null,"MATERIAIS PARA COBERTURAS"]
[null,"MATERIAL PARA CONSTRUCAO A GRANEL DE ORIGEM MINERAL"]
[null,"MATERIAL PARA CONSTRUCAO DIMENSIONADOS NAO METALICOS"]
[null,"MATERIAL PARA ISOLAMENTOS TERMICO E ACUSTICO E PAINEIS DIVI SORIOS"]
[null,"PRODUTOS METALICOS PARA ARQUITETURA"]
[null,"TUBOS CONDUTOS E CORRELATOS NAO METALICOS"]
["MATERIAIS PARA EXECUCAO DE OBRAS","CERCAS TELAS ARAMES E PORTOES"]
[null,"FERRAGENS E PRODUTOS METALICOS E PERFILADOS"]
[null,"MADEIRAS ESQUADRIAS E FOLHEADOS"]
[null,"MATERIAIS DIVERSOS PARA OBRAS"]
[null,"MATERIAIS PARA INSTALACOES INCORPORAVEIS A OBRAS"]
[null,"MATERIAL A GRANEL DE ORIGEM MINERAL"]
[null,"MATERIAL DIMENSIONADO NAO METALICO"]
[null,"MATERIAL PARA COBERTURA"]
[null,"TINTAS SECANTES ADESIVOS E PRODUTOS CORRELATOS"]
[null,"TUBOS CONDUTOS E CORRELATOS E CONEXOES  METALICOS E NAO METALICOS"]
["MATERIAS PRIMAS NAO METALICAS","FIBRAS VEGETAIS ANIMAIS E SINTETICAS"]
[null,"MATERIA-PRIMA DE ORIGEM MINERAL E SINTETICA"]
["MEDICAMENTO","ANABOLIZANTES PARA USO SISTEMICO"]
[null,"ANALGESICOS E ANTIPIRETICOS"]
[null,"ANESTESICOS"]
[null,"ANSIOLITICOS"]
[null,"ANTIACIDOS INIBIDORES DA SECRECAO GASTRICA E TRATAMENTO DASULCERAS"]
[null,"ANTIACNEICOS"]
[null,"ANTIASMATICOS"]
[null,"ANTIBACTERIANOS SISTEMICOS"]
[null,"ANTICOAGULANTES ANTITROMBOTICOS E TROMBOLITICOS"]
[null,"ANTICONCEPCIONAIS HORMONIOS SEXUAIS E MODULADORES DO SISTEMA GENITAL"]
[null,"ANTIDEPRESSIVOS"]
[null,"ANTIDIARREICOS ANTI-INFLAMATORIOS ANTI-INFECCIOSOS INTESTINAIS"]
[null,"ANTIDOTOS AGENTES DESINTOXICANTES E AGENTES QUELANTES"]
[null,"ANTIEMETICOS E ANTINAUSEANTES"]
[null,"ANTIEPILEPTICOS"]
[null,"ANTIESPASMODICOS ANTICOLINERGICOS E PROPULSIVOS"]
[null,"ANTIFUNGICOS SISTEMICOS"]
[null,"ANTIGOTOSOS"]
[null,"ANTI-HELMINTICOS"]
[null,"ANTI-HEMORRAGICOS FATORES DE COAGULACAO E CORRELATOS"]
[null,"ANTI-HIPERTENSIVOS"]
[null,"ANTI-HISTAMINICOS SISTEMICOS"]
[null,"ANTI-INFECCIOSOS E ANTISSEPTICOS GINECOLOGICOS"]
[null,"ANTI-INFECCIOSOS ANTIBIOTICOS E ANTI-INFLAMATORIOS TOPICOS"]
[null,"ANTI-INFLAMATORIOS E ANTIRREUMATICOS"]
[null,"ANTIMICOBACTERIANOS SISTEMICOS"]
[null,"ANTINEOPLASICOS"]
[null,"ANTIPARKINSONIANOS"]
[null,"ANTIPROTOZOARIOS"]
[null,"ANTIPRURIGINOSOS E ANTIPSORIATICOS"]
[null,"ANTIPSICICOTICOS"]
[null,"ANTISSEPTICOS E DESINFETANTES"]
[null,"ANTIVIRAIS SISTEMICOS"]
[null,"ANTROPOSOFICOS FITOTERAPICOS E HOMEOPATICOS"]
[null,"BETA-BLOQUEADORES"]
[null,"BLOQUEADORES DE CANAL DE CALCIO"]
[null,"CORTICOESTEROIDES SISTEMICOS"]
[null,"DIGESTIVOS E ENZIMAS DIGESTIVAS"]
[null,"DIURETICOS"]
[null,"EMOLIENTES HIDRATANTES PROTETORES E FILTRO SOLAR"]
[null,"EQUIPAMENTOS REAGENTES SOLVENTES E OUTROS INSUMOS FARMACEUTICOS"]
[null,"ESTIMULANTES CARDIACOS CARDIOTONICOS E GLICOSIDEOS"]
[null,"ESTIMULANTES DO APETITE"]
[null,"FORMULAS OU ASSOCIACOES MANIPULADAS"]
[null,"GASES MEDICINAIS"]
[null,"HEMODIALISES DIALISES E SOLUCOES PARA PERFUSAO E IRRIGACAO"]
[null,"HIPNOTICOS E SEDATIVOS"]
[null,"HIPOLIPEMIANTES"]
[null,"HORMONIOS HIPOFISARIOS HIPOTALAMICOS E ANALOGOS"]
[null,"HORMONIOS PANCREATICOS"]
[null,"IMUNOESTIMULANTES"]
[null,"IMUNOSOROS E IMUNOGLOBULINAS"]
[null,"IMUNOSSUPRESSORES"]
[null,"INSETICIDAS REPELENTES ESCABICIDAS E ECTOPARASITOCIDAS"]
[null,"LAXATIVOS"]
[null,"MEDICAMENTOS PARA TOSSE E RESFRIADO"]
[null,"MEDICAMENTOS RELACIONADOS A HOMEOSTASIA DO CALCIO"]
[null,"MEDICAMENTOS UROLOGICOS"]
[null,"MEDICAMENTOS UTILIZADOS NO DIABETES"]
[null,"MEDICAMENTOS VETERINARIOS"]
[null,"MEIOS DE CONTRASTE"]
[null,"NUTRICAO PARENTERAL"]
[null,"OUTROS MEDICAMENTOS PARA O SISTEMA DIGESTIVO E O METABOLISMO"]
[null,"OUTROS MEDICAMENTOS PARA O SISTEMA MUSCULO-ESQUELETICO"]
[null,"OUTROS MEDICAMENTOS PARA O SISTEMA NERVOSO"]
[null,"OUTROS MEDICAMENTOS PARA O SISTEMA RESPIRATORIO"]
[null,"OUTROS PREPARADOS DERMATOLOGICOS"]
[null,"OUTROS PREPARADOS GINECOLOGICOS"]
[null,"OUTROS PREPARADOS HEMATOLOGICOS"]
[null,"OUTROS PRODUTOS TERAPEUTICOS"]
[null,"PREPARADOS ANTIANEMICOS"]
[null,"PREPARADOS ANTIOBESIDADE"]
[null,"PREPARADOS ESTOMATOLOGICOS (BOCA E DENTES)"]
[null,"PREPARADOS PARA USO NASAL"]
[null,"PRODUTOS OFTALMOLOGICOS"]
[null,"PRODUTOS OTOLOGICOS"]
[null,"PSICOESTIMULANTES"]
[null,"PSICOLEPTICOS E PSICOANAPLETICOS EM ASSOCIACAO"]
[null,"RELAXANTES MUSCULARES"]
[null,"SISTEMA RENINA-ANGIOTENSINA"]
[null,"TERAPIAS ENDOCRINAS"]
[null,"TESTES E AGENTES DE DIAGNOSTICO"]
[null,"TONICOS E REPOSITORES HIDROELETROLITICOS ORAIS"]
[null,"TRATAMENTO BILIAR E HEPATICO"]
[null,"TRATAMENTO DA TIREOIDE"]
[null,"TRATAMENTO DE DOENCAS OSSEAS"]
[null,"TRATAMENTO DE FERIDAS E ULCERAS"]
[null,"TRATAMENTO DO ALZHEIMER E DEMENCIA"]
[null,"VACINAS"]
[null,"VASODILATADORES PERIFERICOS"]
[null,"VASOPROTETORES"]
[null,"VITAMINAS SUPLEMENTOS MINERAIS E ASSOCIACOES"]
[null,"ACAO ENDOCRINA/CORTICOSTEROIDES"]
[null,"ACAO ENDOCRINA/HIPERGLICEMIANTES"]
[null,"ACAO ENDOCRINA/HIPOGLICEMIANTES ORAIS"]
[null,"ACAO ENDOCRINA/HORMONIOS ESTROGENICOS"]
[null,"ACAO ENDOCRINA/HORMONIOS HOPIFISARIOS E AFINS"]
[null,"ACAO ENDOCRINA/HORMONIOS PROGESTAGENICOS"]
[null,"ACAO ENDOCRINA/HORMONIOS TIREOIDEANOS E INIBIDORES DA FUNCAO TIREOIDEANA"]
[null,"ACAO ENDOCRINA/INIBIDORES DA SECRECAO DE PROLACTINA"]
[null,"ACAO ENDOCRINA/INSULINA"]
[null,"AGENTES DIAGNOSTICOS/AUXILIARES DE DIAGNOSTICOS"]
[null,"AGENTES DIAGNOSTICOS/CONTRASTES RADIOLOGICOS"]
[null,"ANTIDOTOS"]
[null,"ANTIINFECCIOSOS/ANTIBIOTICOS"]
[null,"ANTIINFECCIOSOS/ANTIFUNGICOS"]
[null,"ANTIINFECCIOSOS/ANTIVIRAIS"]
[null,"ANTIINFECCIOSOS/HANSENOSTATICOS E TUBERCULOSTATICOS"]
[null,"ANTIINFECCIOSOS/NITROFURANOS QUINOLONAS E SULFONAMIDAS"]
[null,"ANTIMEOPLASICOS/PRODUTOS NATURAIS"]
[null,"ANTINEOPLASICOS/AGENTES ALQUILANTES"]
[null,"ANTINEOPLASICOS/ALCALOIDES"]
[null,"ANTINEOPLASICOS/ANTIBIOTICOS CITOTOXICOS"]
[null,"ANTINEOPLASICOS/ANTIMETABOLICOS"]
[null,"ANTINEOPLASICOS/COMPOSTOS DE PLATINA"]
[null,"ANTINEOPLASICOS/HORMONIOS INIBIDORES ENZIMATICOS E DA ACAO HORMONAL"]
[null,"ANTIPARASITARIOS"]
[null,"APARELHO DIGESTIVO/ADSORVENTES ANTIFISETICOS E ANTIFLATULENTOS"]
[null,"APARELHO DIGESTIVO/ANTIACIDOS E INIBIDORES DA SECRECAO GAS  TRICA"]
[null,"APARELHO DIGESTIVO/ANTIEMETICOS E PRO-CINETICOS"]
[null,"APARELHO DIGESTIVO/CONSTIPANTES"]
[null,"APARELHO DIGESTIVO/DIGESTIVOS E ANTIINFLAMATORIOS"]
[null,"APARELHO DIGESTIVO/LAXATIVOS"]
[null,"APARELHO GENITURINARIO/ANTICONCEPCIONAIS E ANOVULATORIOS"]
[null,"APARELHO GENITURINARIO/ANTISSEPTICOS"]
[null,"APARELHO GENITURINARIO/DIURETICOS E TERAPEUTIICA DA INCONTI NENCIA URINARIA"]
[null,"APARELHO GENITURINARIO/OXITOCITOS"]
[null,"APARELHO RESPIRATORIO/AGENTES TENSOATIVO PULMONAR"]
[null,"APARELHO RESPIRATORIO/ANTITUSSIGENOS"]
[null,"APARELHO RESPIRATORIO/BRONCODILATADORES"]
[null,"APARELHO RESPIRATORIO/EXPECTORANTES FLUIDIFICANTES E       DESCONGESTIONANTES"]
[null,"FITOTERAPICOS"]
[null,"IMUNOTERAPICOS/IMUNOGLOBULINAS"]
[null,"IMUNOTERAPICOS/IMUNOSSUPRESSORES"]
[null,"IMUNOTERAPICOS/SOROS"]
[null,"IMUNOTERAPICOS/VACINAS E TOXOIDES"]
[null,"MEDICAMENTOS DECISAO JUDICIAL DE USO EXCLUSIVO DA SES"]
[null,"METABOLISMO E NUTRICAO/AGENTES PARA REPOSICAO HIDROELETROLI TICA"]
[null,"METABOLISMO E NUTRICAO/HIPOLIPEMIANTES"]
[null,"METABOLISMO E NUTRICAO/NUTRIENTES DE USO PARENTERAL E       DIETAS ENTERAIS"]
[null,"METABOLISMO E NUTRICAO/REGULADORES DO METABOLISMO OSSEO VI TAMINAS SUPLEMENTOS MINERAIS E ENZIMATICOS"]
[null,"METABOLISMO E NUTRICAO/SUPLEMENTOS DIETETICOS"]
[null,"OFTALMICOS/AGENTES DIAGNOSTICOS E AUXILIARES CIRURGICOS"]
[null,"OFTALMICOS/ANESTESICOS"]
[null,"OFTALMICOS/ANTIINFECCIOSOS E ANTIINFLAMATORIOS"]
[null,"OFTALMICOS/MIOTICOS MEDRIATICOS CICLOPLEGICOS E ANTIGLAUCOMATOSOS"]
[null,"OFTALMICOS/UMECTANTES"]
[null,"ORGAOS HEMATOPOIETICOS E SANGUE/ANTIAGREGANTE PLAQUETARIO"]
[null,"ORGAOS HEMATOPOIETICOS E SANGUE/ANTIANEMICOS"]
[null,"ORGAOS HEMATOPOIETICOS E SANGUE/ANTICOAGULANTES"]
[null,"ORGAOS HEMATOPOIETICOS E SANGUE/ANTI-HEMORRAGICOS"]
[null,"ORGAOS HEMATOPOIETICOS E SANGUE/ESTIMULANTES E INIBIDORES"]
[null,"ORGAOS HEMATOPOIETICOS E SANGUE/EXPANSORES E PLASMATICOS"]
[null,"ORGAOS HEMATOPOIETICOS E SANGUE/FATORES E COAGULACAO E CORRELATOS"]
[null,"ORGAOS HEMATOPOIETICOS E SANGUE/FIBRINOLITICOS"]
[null,"SISTEMA CIRCULARORIO/CARDIOTONICOS"]
[null,"SISTEMA CIRCULATORIO/ANTIANGINOSOS"]
[null,"SISTEMA CIRCULATORIO/ANTIARRITMICOS"]
[null,"SISTEMA CIRCULATORIO/ANTI-HIPERTENSIVOS"]
[null,"SISTEMA CIRCULATORIO/BLOQUEADORES DOS CANAIS DE CALCIO"]
[null,"SISTEMA CIRCULATORIO/VASODILATADORES E ESCLEROSANTES"]
[null,"SISTEMA MUSCULO ESQUELETICO/ANTIGOTOSOS"]
[null,"SISTEMA MUSCULO ESQUELETICO/RELAXANTES MUSCULARES"]
[null,"SISTEMA NERVOSO AUTONOMO/ADRENERGICOS"]
[null,"SISTEMA NERVOSO AUTONOMO/ANTI-HISTAMINICOS"]
[null,"SISTEMA NERVOSO AUTONOMO/BLOQUEADORES COLINERGICOS E ANTIES PASMODICOS"]
[null,"SISTEMA NERVOSO AUTONOMO/COLINERGICOS"]
[null,"SISTEMA NERVOSO CENTRAL E PERIFERICO/ANALGESICOS ANTIINFLA MATORIOS E ANTIPIRETICOS"]
[null,"SISTEMA NERVOSO CENTRAL E PERIFERICO/ANESTESICOS GERAIS"]
[null,"SISTEMA NERVOSO CENTRAL E PERIFERICO/ANESTESICOS LOCAIS"]
[null,"SISTEMA NERVOSO CENTRAL E PERIFERICO/ANSIOLITICOS"]
[null,"SISTEMA NERVOSO CENTRAL E PERIFERICO/ANTICONVULSIVANTES"]
[null,"SISTEMA NERVOSO CENTRAL E PERIFERICO/ANTIDEPRESSIVOS E ESTA BILIZADORES DO HUMOR"]
[null,"SISTEMA NERVOSO CENTRAL E PERIFERICO/ANTIPARKINSONIANOS"]
[null,"SISTEMA NERVOSO CENTRAL E PERIFERICO/ANTIVERTIGINOSOS"]
[null,"SISTEMA NERVOSO CENTRAL E PERIFERICO/BLOQUADORES MUSCULARES"]
[null,"SISTEMA NERVOSO CENTRAL E PERIFERICO/HIPNOTICOS E SEDATIVOS"]
[null,"SISTEMA NERVOSO CENTRAL E PERIFERICO/HIPOANALGESICOS"]
[null,"SISTEMA NERVOSO CENTRAL E PERIFERICO/NEUROLEPTICOS/ANTIPSICOTICOS"]
[null,"SISTEMA NERVOSO CENTRAL E PERIFERICO/TERAPEUTICA DA DOENCA  DE ALZHEIMER"]
[null,"SOLUCOES PARA DIALISE HEMODIALISE E IRRIGACAO"]
[null,"USO EXTERNO/ANTIINFECCIOSOS ANTIINFLAMATORIOS E ANTI-HEMOR ROIDARIOS"]
[null,"USO EXTERNO/ANTIPARASITARIOS E FUNGICIDAS"]
[null,"USO EXTERNO/ANTISSEPTICOS"]
[null,"USO EXTERNO/PROTETORES E REDUTORES"]
[null,"USO TOPICO UTILIZADOS EM OTORRINOLARINGOLOGIA/ANTIINFECCIO  SOS E ANTIINFLAMATORIOS"]
[null,"USO TOPICO UTILIZADOS EM OTORRINOLARINGOLOGIA/DESCONGESTIO  NANTES"]
[null,"USO TOPICO UTILIZADOS EM OTORRINOLARINGOLOGIA/EMOLIENTES"]
[null,"VETERINARIOS"]
["MINERIOS MINERAIS E SEUS PRODUTOS PRIMARIOS SEMIACABADOS","MINERAIS NATURAIS E SINTETICOS"]
[null,"PRODUTOS PRIMARIOS E SEMIACABADOS DE FERRO E DE ACO"]
[null,"PRODUTOS PRIMARIOS E SEMIACABADOS DE METAIS NAO FERROSOS"]
[null,"SUCATA DE FERRO E DE ACO"]
[null,"SUCATA DE METAIS NAO FERROSOS"]
["MOBILIARIO","COMPONENTES E PECAS PARA MOBILIARIO"]
[null,"ESTANTES E ARMACOES PARA ALMOXARIFADOS"]
[null,"MOBILIARIO DE ESCRITORIO"]
[null,"MOBILIARIO DE USO GERAL"]
[null,"MOBILIARIO DIVERSO E ESPECIAL"]
[null,"MOBILIARIO ESCOLAR E DE AUDITORIO"]
[null,"MOBILIARIO PARA AREA DE INFORMATICA"]
["MOTORES TURBINAS E COMPONENTES","MOTORES A GASOLINA ALCOOL GAS E COMPONENTESEXCETO DE AERONAVES E COMPONENTES"]
[null,"MOTORES DIESEL E COMPONENTES"]
["OBRAS CIVIS ADAPTACOES REPAROS E MONTAGENS","AQUISICAO DE IMOVEIS NECESSARIOS A REALIZACAO DE OBRAS"]
[null,"DESAPROPRIACOES DE IMOVEIS PARA OBRAS E INSTALACOES"]
[null,"INSTALACOES INCORPORAVEIS A OBRAS"]
[null,"OUTRAS ATIVIDADES NECESSARIAS DE OBRAS E INSTALACOES POR CONTRATO"]
[null,"SERVICOS DE DEMOLICOES ADAPTACAO E REPAROS DE BENS IMOVEIS"]
[null,"SERVICOS DE EXECUCAO DE OBRAS DIRETAS"]
[null,"SERVICOS DE EXECUCAO DE OBRAS POR CONTRATO"]
["PNEUS CAMARAS DE AR E MATERIAIS CORRELATOS","MATERIAIS PARA RECONDICIONAMENTO E ACESSORIOS DE PNEUS  E CAMARAS DE AR"]
[null,"PNEUS E CAMARAS DE AR DE AERONAVES"]
[null,"PNEUS E CAMARAS DE AR EXCETO DE AERONAVES"]
["RECIPIENTES E MATERIAIS PARA ACONDICIONAMENTO E EMBALAGEM","BOLSAS E SACOS"]
[null,"CAIXAS E ENGRADADOS"]
[null,"CILINDROS PARA GASES PECAS E COMPONENTES"]
[null,"GARRAFAS E GARRAFOES"]
[null,"MATERIAIS DIVERSOS PARA ACONDICIONAMENTO E EMBALAGEM"]
[null,"RECIPIENTES PARA MUNICOES E EXPLOSIVOS"]
[null,"TAMBORES E LATAS"]
["ROLAMENTOS E MANCAIS","MANCAIS E COMPONENTES"]
[null,"ROLAMENTOS E COMPONENTES"]
["SERVICO DE MANUTENCAO REPAROS E ADAPTACOES EM EQUIPAMENTOSMAQUINAS APARELHOS FERRAMENTAS E INSTRUMENTAL","MANUTECAO E REPAROS EM EQUIPAMENTOS DE PROCESSAMENTO DE DA  DOS"]
[null,"MANUTENCAO E REPARO DE ESTRUTURA COBERTA DE LONA POLIESTER OU OUTROS MATERIAIS"]
[null,"MANUTENCAO E REPARO EM EQUIPAMENTOS FERROVIARIOS"]
[null,"MANUTENCAO E REPARO EM EQUIPAMENTOS PARA PURIFICACAO E TRATAMENTO DE AGUA E TRATAMENTO DE ESGOTOS"]
[null,"MANUTENCAO E REPARO EM FERRAMENTAS DO GRUPO DE MATERIAL     51 (FERRAMENTAS MANUAIS E COMPONENTES)"]
[null,"MANUTENCAO E REPARO EM RECIPIENTES PARA GASES E SISTEMAS CENTRALIZADOS DE GASES"]
[null,"MANUTENCAO E REPAROS EM AERONAVES COMPONENTES E ACESSORIOS"]
[null,"MANUTENCAO E REPAROS EM APARELHOS EQUIPAMENTOS E UTENSILIOSDE COPA E COZINHA"]
[null,"MANUTENCAO E REPAROS EM EQUIPAMENTOS AUDIO-VISUAIS"]
[null,"MANUTENCAO E REPAROS EM EQUIPAMENTOS DE AUTOMACAO ARMAZEM DEPOSITO"]
[null,"MANUTENCAO E REPAROS EM EQUIPAMENTOS DE COMUNICACAO E TELECOMUNICACAO"]
[null,"MANUTENCAO E REPAROS EM EQUIPAMENTOS DE LABORATORIO E EQUIPAMENTOS E INSTRUMENSTOS DE ENSAIO E MEDICAO"]
[null,"MANUTENCAO E REPAROS EM EQUIPAMENTOS DE REFRIGERACAO E CONDICIONAMENTO DE AR"]
[null,"MANUTENCAO E REPAROS EM EQUIPAMENTOS DE SEGURANCA/PROTECAO  DE EDIFICACOES INDUSTRIAL E PESSOAL"]
[null,"MANUTENCAO E REPAROS EM EQUIPAMENTOS DE SOM VIDEO FOTOGRA FICOS CINEMATOGRAFICOS E DE ILUMINACAO"]
[null,"MANUTENCAO E REPAROS EM EQUIPAMENTOS E APARELHOS DE TRANSMISSAO/CONTROLE/GERACAO DE ENERGIA"]
[null,"MANUTENCAO E REPAROS EM EQUIPAMENTOS E SISTEMAS DE SINALIZA CAO E ALARME"]
[null,"MANUTENCAO E REPAROS EM EQUIPAMENTOS E UTENSILIOS DE ESCRITORIO"]
[null,"MANUTENCAO E REPAROS EM EQUIPAMENTOS ESPECIALIZADOS PARA MA NUTECAO E REPAROS"]
[null,"MANUTENCAO E REPAROS EM EQUIPAMENTOS PARA CONSTRUCAO MINERACAO ESCAVACAO E CONSERVACAO DE ESTRADAS"]
[null,"MANUTENCAO E REPAROS EM EQUIPAMENTOS PARA LIMPEZA"]
[null,"MANUTENCAO E REPAROS EM INSTALACOES PREDIAIS"]
[null,"MANUTENCAO E REPAROS EM MAQUINARIA E EQUIPAMENTOS AGRICOLAS"]
[null,"MANUTENCAO E REPAROS EM MAQUINAS E EQUIPAMENTOS P/ INDUSTRI A ESPECIALIZADA"]
[null,"MANUTENCAO E REPAROS EM MOBILIARIO EM GERAL"]
[null,"MANUTENCAO E REPAROS EM PNEUS E CAMARAS DE AR"]
[null,"MANUTENCAO E REPAROS EM SISTEMAS/EQUIPAMENTOS COMERCIAIS INDUSTRIAIS E DE SERVICOS"]
[null,"MANUTENCAO E REPAROS EM VIATURAS EQUIPAMENTOS PARA MOVIMEN TACAO DE MATERIAL"]
[null,"MANUTENCAO ADAPTACOES E REPAROS EM EQUIPAMENTOS PARA RECRE ACAO ATLETISMO DESPORTO E CIVICO"]
[null,"MANUTENCAO REPAROS E ADAPTACOES EM EMBARCACOES COMPONENTES E ACESSORIOS"]
[null,"MANUTENCAO REPAROS E ADAPTACOES EM EQUIPAMENTOS INSTRUMEN TOS MEDICOS ODONTOLOGICOS E HOSPITALARES"]
[null,"MANUTENCAO REPAROS E ADAPTACOES EM VEICULOS AUTOMOTORES"]
[null,"MANUTENCAO REPAROS E E ADAPTACOES EM ARMAMENTOS"]
[null,"RECUPERACAO E RECONDICIONAMENTO DE PECAS DE VEICULOS        AUTOMOTORES"]
[null,"SERVICOS DE RECUPERACAO E RECONDICIONAMENTO DE PECAS DE     EQUIPAMENTOS PARA INFORMATICA"]
[null,"SERVICOS DE RECUPERACAO E RECONDICIONAMENTO DE PECAS PARA   EQUIPAMENTOS DE INDUSTRIA GRAFICA"]
["SERVICOS DE ESTUDOS E PROJETOS","SERVICOS TECNICOS ESTUDOS E PROJETOS"]
["SERVICOS DE INSTALACOES E MONTAGENS","SERVICOS DE ADMINISTRACAO DE EDIFICACOES"]
[null,"SERVICOS DE INSTALACAO E MONTAGEM  DE  EQUIPAMENTOS  ACESSORIOS COMPONENTES E BENS DE SERVICOS"]
["SERVICOS DE TECNOLOGIA DA INFORMACAO E COMUNICACAO TIC","ARMAZEM DE INFORMACAO"]
[null,"BUSINESS INTELLIGENCE"]
[null,"CERTIFICACAO DIGITAL"]
[null,"DATACENTER"]
[null,"DESENVOLVIMENTO DE SOLUCAO DE EDUCACAO A DISTANCIA"]
[null,"GESTAO DE CONTEUDO"]
[null,"SERVICOS DE INFRAESTRUTURA"]
[null,"SERVICOS DE REDE"]
[null,"SISTEMAS DE INFORMACAO"]
[null,"SOLUCOES CORPORATIVAS"]
["SERVICOS TECNICOS ESPECIALIZADOS NA AREA DE CONSTRUCAO CIVIL","ESTUDOS E PROJETOS PARA OBRAS E INSTALACOES"]
["SUBSTANCIAS E PRODUTOS QUIMICOS","COMPOSTOS QUIMICOS PRODUTOS QUIMICOS E REAGENTES PARA INDUSTRIA FARMACEUTICA"]
[null,"DESINFETANTES E AGENTES PARA COMBATE A PRAGAS"]
[null,"ESPECIALIDADES QUIMICAS"]
[null,"GASES: COMPRIMIDOS E LIQUIFEITOS"]
[null,"REAGENTES QUIMICOS"]
[null,"REAGENTES QUIMICOS CORANTES E INDICADORES"]
["TECIDOS COUROS MATERIAIS CORRELATOS E MIUDEZAS AVIAMENTOS PARA COSTURA EM GERAL","ARTIGOS PARA CALCADOS"]
[null,"BANDEIRAS E GALHARDETES"]
[null,"BARRACAS E ENCERADOS"]
[null,"COUROS"]
[null,"FIOS E LINHAS PARA COSTURA"]
[null,"MATERIAL PARA ESTOFAMENTO E ACOLCHOAMENTO"]
[null,"MIUDEZAS E AVIAMENTOS DE COSTURA"]
[null,"TECIDOS"]
["TINTAS EQUIPAMENTOS PARA PINTURA SECANTES E ADESIVOS","ADESIVOS"]
[null,"COMPOSTOS PRESERVATIVOS E SELANTES"]
[null,"EQUIPAMENTOS E UTENSILIOS PARA PINTURA"]
[null,"TINTAS VERNIZES E PRODUTOS CORRELATOS"]
["TRANSPORTE","FORNECIMENTO DE COMBUSTIVEL E LUBRIFICANTE"]
[null,"OUTROS SERVICOS COM TRANSPORTE/DESLOCAMENTOS"]
[null,"SERVICO DE FORNECIMENTO DE PASSAGEM"]
[null,"SERVICO TRANSPORTE E ACONDICIONAMENTO DE MATERIAIS E ANIMAIS"]
[null,"SERVICOS DE TRANSPORTES DE DOCUMENTOS DE BENS E DE VALORES"]
["TRATORES","ACESSORIOS E COMPONENTES PARA TRATOR DE RODA"]
[null,"TRATORES DE RODA"]
["TUBOS TUBULACOES MANGUEIRAS E CONEXOES","CONEXOES E ACESSORIOS PARA TUBOS E MANGUEIRAS"]
[null,"MANGUEIRAS E TUBULACOES FLEXIVEIS"]
[null,"TUBO RIGIDO"]
["VALVULAS E REGISTROS","COMPONENTES E PECAS PARA VALVULAS E REGISTROS"]
[null,"VALVULAS E REGISTROS"]
[null,"VALVULAS MOTORIZADAS"]
["VEICULOS PARA TRANSPORTE RODOVIARIO DE PASSAGEIROS E  DE CARGA","OUTROS VEICULOS DE 0203 OU 04 RODAS COMPONENTES E PECAS"]
[null,"REBOQUES"]
[null,"VEICULOS ESPECIAIS"]
[null,"VEICULOS MOTORIZADOS DE SERVICO PARA TRANSPORTE DE CARGA"]
[null,"VEICULOS MOTORIZADOS DE SERVICO PARA TRANSPORTE DE PASSAGEIROS"]
[null,"VEICULOS MOTORIZADOS PARA TRANSPORTE DE CARGA"]
[null,"VEICULOS MOTORIZADOS PARA TRANSPORTE DE PASSAGEIRO"]
[null,"VIATURAS"]
["VESTUARIOS E EQUIPAMENTOS INDIVIDUAIS DE USO COMUM E  ESPECIAL","ARTIGOS E ACESSORIOS PARA CRIANCA E ADOLESCENTE"]
[null,"CALCADOS PARA HOMEM"]
[null,"CALCADOS PARA MULHER"]
[null,"DISTINTIVOS E INSIGNIAS"]
[null,"EQUIPAMENTOS INDIVIDUAIS DE USOS DIVERSOS"]
[null,"FARDAMENTO BOMBEIRO MILITAR"]
[null,"FARDAMENTO POLICIAL"]
[null,"MALARIA"]
[null,"MEIAS LUVAS E COMPLEMENTOS DE VESTUARIO PARA HOMEM"]
[null,"MEIAS LUVAS E COMPLEMENTOS DE VESTUARIO PARA MULHER"]
[null,"ROUPAS DE BAIXO E DE DORMIR PARA HOMEM"]
[null,"ROUPAS DE BAIXO E DE DORMIR PARA MULHER"]
[null,"VESTUARIO ESPECIAL"]
[null,"VESTUARIOS EXTERIORES PARA HOMEM"]
[null,"VESTUARIOS EXTERIORES PARA MULHER"]
[null,"VESTUARIOS UNISSEX"]
["VIATURAS EQUIPAMENTOS PARA MOVIMENTACAO DE MATERIAL","BLOCOS MOITOES ARTICULACOES E ESTROPOSPECAS E COMPONENTES"]
[null,"COMPONENTES E ACESSORIOS DE  ELEVADORES P/ CONTRATOS DE MANUTENCAO PREVENTIVA/CORRETIVA"]
[null,"ELEVADORES E ESCADAS ROLANTES PECAS E COMPONENTES"]
[null,"EQUIPAMENTOS E ARTIGOS DIVERSOS PARA MOVIMENTACAO DE MATERIAIS PECAS E COMPONENTES"]
[null,"GUINCHOS TALHAS GUINDASTES E CABREAS PECAS E COMPONENTES"]
[null,"TRANSPORTADORES PECAS E COMPONENTES"]
[null,"VIATURAS P/MOVIMENTACAO DE MATERIAIS NAO MOTORIZADAS PECASE COMPONENTES"]
[null,"VIATURAS PARA  MOVIMENTACAO DE MATERIAIS MOTORIZADAS PECAS E COMPONENTES"]

{"sheet":"Lista","index":9,"n_rows":2007,"n_cols":9,"rows_kept":2007,"cut":false,"hidden":true,"merged":[[2006,3,2006,5],[2006,6,2007,6],[2006,7,2007,7]]}
["M1"]
["M2"]
["M3",null,null,null,null,"Despesa Mensal?"]
["M4"]
["M5",null,null,null,null,null,null,null,{"$f":"IF(SUMPRODUCT(-($A$2009:$A$3001=A5),-($I$3001:$I$3001)*($C$2009:$C$3001))<>H5,\"Errado\",\"OK\")","v":"OK"}]
["M6"]
["M7"]
["M8"]
["M9"]
["M10"]
["M11"]
["M12"]
["M13"]
["M14"]
["M15"]
["M16"]
["M17"]
["M18"]
["M19"]
["M20"]
["M21"]
["M22"]
["M23"]
["M24"]
["M25"]
["M26"]
["M27"]
["M28"]
["M29"]
["M30"]
["M31"]
["M32"]
["M33"]
["M34"]
["M35"]
["M36"]
["M37"]
["M38"]
["M39"]
["M40"]
["M41"]
["M42"]
["M43"]
["M44"]
["M45"]
["M46"]
["M47"]
["M48"]
["M49"]
["M50"]
["M51"]
["M52"]
["M53"]
["M54"]
["M55"]
["M56"]
["M57"]
["M58"]
["M59"]
["M60"]
["M61"]
["M62"]
["M63"]
["M64"]
["M65"]
["M66"]
["M67"]
["M68"]
["M69"]
["M70"]
["M71"]
["M72"]
["M73"]
["M74"]
["M75"]
["M76"]
["M77"]
["M78"]
["M79"]
["M80"]
["M81"]
["M82"]
["M83"]
["M84"]
["M85"]
["M86"]
["M87"]
["M88"]
["M89"]
["M90"]
["M91"]
["M92"]
["M93"]
["M94"]
["M95"]
["M96"]
["M97"]
["M98"]
["M99"]
["M100"]
["M101"]
["M102"]
["M103"]
["M104"]
["M105"]
["M106"]
["M107"]
["M108"]
["M109"]
["M110"]
["M111"]
["M112"]
["M113"]
["M114"]
["M115"]
["M116"]
["M117"]
["M118"]
["M119"]
["M120"]
["M121"]
["M122"]
["M123"]
["M124"]
["M125"]
["M126"]
["M127"]
["M128"]
["M129"]
["M130"]
["M131"]
["M132"]
["M133"]
["M134"]
["M135"]
["M136"]
["M137"]
["M138"]
["M139"]
["M140"]
["M141"]
["M142"]
["M143"]
["M144"]
["M145"]
["M146"]
["M147"]
["M148"]
["M149"]
["M150"]
["M151"]
["M152"]
["M153"]
["M154"]
["M155"]
["M156"]
["M157"]
["M158"]
["M159"]
["M160"]
["M161"]
["M162"]
["M163"]
["M164"]
["M165"]
["M166"]
["M167"]
["M168"]
["M169"]
["M170"]
["M171"]
["M172"]
["M173"]
["M174"]
["M175"]
["M176"]
["M177"]
["M178"]
["M179"]
["M180"]
["M181"]
["M182"]
["M183"]
["M184"]
["M185"]
["M186"]
["M187"]
["M188"]
["M189"]
["M190"]
["M191"]
["M192"]
["M193"]
["M194"]
["M195"]
["M196"]
["M197"]
["M198"]
["M199"]
["M200"]
["M201"]
["M202"]
["M203"]
["M204"]
["M205"]
["M206"]
["M207"]
["M208"]
["M209"]
["M210"]
["M211"]
["M212"]
["M213"]
["M214"]
["M215"]
["M216"]
["M217"]
["M218"]
["M219"]
["M220"]
["M221"]
["M222"]
["M223"]
["M224"]
["M225"]
["M226"]
["M227"]
["M228"]
["M229"]
["M230"]
["M231"]
["M232"]
["M233"]
["M234"]
["M235"]
["M236"]
["M237"]
["M238"]
["M239"]
["M240"]
["M241"]
["M242"]
["M243"]
["M244"]
["M245"]
["M246"]
["M247"]
["M248"]
["M249"]
["M250"]
["M251"]
["M252"]
["M253"]
["M254"]
["M255"]
["M256"]
["M257"]
["M258"]
["M259"]
["M260"]
["M261"]
["M262"]
["M263"]
["M264"]
["M265"]
["M266"]
["M267"]
["M268"]
["M269"]
["M270"]
["M271"]
["M272"]
["M273"]
["M274"]
["M275"]
["M276"]
["M277"]
["M278"]
["M279"]
["M280"]
["M281"]
["M282"]
["M283"]
["M284"]
["M285"]
["M286"]
["M287"]
["M288"]
["M289"]
["M290"]
["M291"]
["M292"]
["M293"]
["M294"]
["M295"]
["M296"]
["M297"]
["M298"]
["M299"]
["M300"]
["M301"]
["M302"]
["M303"]
["M304"]
["M305"]
["M306"]
["M307"]
["M308"]
["M309"]
["M310"]
["M311"]
["M312"]
["M313"]
["M314"]
["M315"]
["M316"]
["M317"]
["M318"]
["M319"]
["M320"]
["M321"]
["M322"]
["M323"]
["M324"]
["M325"]
["M326"]
["M327"]
["M328"]
["M329"]
["M330"]
["M331"]
["M332"]
["M333"]
["M334"]
["M335"]
["M336"]
["M337"]
["M338"]
["M339"]
["M340"]
["M341"]
["M342"]
["M343"]
["M344"]
["M345"]
["M346"]
["M347"]
["M348"]
["M349"]
["M350"]
["M351"]
["M352"]
["M353"]
["M354"]
["M355"]
["M356"]
["M357"]
["M358"]
["M359"]
["M360"]
["M361"]
["M362"]
["M363"]
["M364"]
["M365"]
["M366"]
["M367"]
["M368"]
["M369"]
["M370"]
["M371"]
["M372"]
["M373"]
["M374"]
["M375"]
["M376"]
["M377"]
["M378"]
["M379"]
["M380"]
["M381"]
["M382"]
["M383"]
["M384"]
["M385"]
["M386"]
["M387"]
["M388"]
["M389"]
["M390"]
["M391"]
["M392"]
["M393"]
["M394"]
["M395"]
["M396"]
["M397"]
["M398"]
["M399"]
["M400"]
["M401"]
["M402"]
["M403"]
["M404"]
["M405"]
["M406"]
["M407"]
["M408"]
["M409"]
["M410"]
["M411"]
["M412"]
["M413"]
["M414"]
["M415"]
["M416"]
["M417"]
["M418"]
["M419"]
["M420"]
["M421"]
["M422"]
["M423"]
["M424"]
["M425"]
["M426"]
["M427"]
["M428"]
["M429"]
["M430"]
["M431"]
["M432"]
["M433"]
["M434"]
["M435"]
["M436"]
["M437"]
["M438"]
["M439"]
["M440"]
["M441"]
["M442"]
["M443"]
["M444"]
["M445"]
["M446"]
["M447"]
["M448"]
["M449"]
["M450"]
["M451"]
["M452"]
["M453"]
["M454"]
["M455"]
["M456"]
["M457"]
["M458"]
["M459"]
["M460"]
["M461"]
["M462"]
["M463"]
["M464"]
["M465"]
["M466"]
["M467"]
["M468"]
["M469"]
["M470"]
["M471"]
["M472"]
["M473"]
["M474"]
["M475"]
["M476"]
["M477"]
["M478"]
["M479"]
["M480"]
["M481"]
["M482"]
["M483"]
["M484"]
["M485"]
["M486"]
["M487"]
["M488"]
["M489"]
["M490"]
["M491"]
["M492"]
["M493"]
["M494"]
["M495"]
["M496"]
["M497"]
["M498"]
["M499"]
["M500"]
["M501"]
["M502"]
["M503"]
["M504"]
["M505"]
["M506"]
["M507"]
["M508"]
["M509"]
["M510"]
["M511"]
["M512"]
["M513"]
["M514"]
["M515"]
["M516"]
["M517"]
["M518"]
["M519"]
["M520"]
["M521"]
["M522"]
["M523"]
["M524"]
["M525"]
["M526"]
["M527"]
["M528"]
["M529"]
["M530"]
["M531"]
["M532"]
["M533"]
["M534"]
["M535"]
["M536"]
["M537"]
["M538"]
["M539"]
["M540"]
["M541"]
["M542"]
["M543"]
["M544"]
["M545"]
["M546"]
["M547"]
["M548"]
["M549"]
["M550"]
["M551"]
["M552"]
["M553"]
["M554"]
["M555"]
["M556"]
["M557"]
["M558"]
["M559"]
["M560"]
["M561"]
["M562"]
["M563"]
["M564"]
["M565"]
["M566"]
["M567"]
["M568"]
["M569"]
["M570"]
["M571"]
["M572"]
["M573"]
["M574"]
["M575"]
["M576"]
["M577"]
["M578"]
["M579"]
["M580"]
["M581"]
["M582"]
["M583"]
["M584"]
["M585"]
["M586"]
["M587"]
["M588"]
["M589"]
["M590"]
["M591"]
["M592"]
["M593"]
["M594"]
["M595"]
["M596"]
["M597"]
["M598"]
["M599"]
["M600"]
["M601"]
["M602"]
["M603"]
["M604"]
["M605"]
["M606"]
["M607"]
["M608"]
["M609"]
["M610"]
["M611"]
["M612"]
["M613"]
["M614"]
["M615"]
["M616"]
["M617"]
["M618"]
["M619"]
["M620"]
["M621"]
["M622"]
["M623"]
["M624"]
["M625"]
["M626"]
["M627"]
["M628"]
["M629"]
["M630"]
["M631"]
["M632"]
["M633"]
["M634"]
["M635"]
["M636"]
["M637"]
["M638"]
["M639"]
["M640"]
["M641"]
["M642"]
["M643"]
["M644"]
["M645"]
["M646"]
["M647"]
["M648"]
["M649"]
["M650"]
["M651"]
["M652"]
["M653"]
["M654"]
["M655"]
["M656"]
["M657"]
["M658"]
["M659"]
["M660"]
["M661"]
["M662"]
["M663"]
["M664"]
["M665"]
["M666"]
["M667"]
["M668"]
["M669"]
["M670"]
["M671"]
["M672"]
["M673"]
["M674"]
["M675"]
["M676"]
["M677"]
["M678"]
["M679"]
["M680"]
["M681"]
["M682"]
["M683"]
["M684"]
["M685"]
["M686"]
["M687"]
["M688"]
["M689"]
["M690"]
["M691"]
["M692"]
["M693"]
["M694"]
["M695"]
["M696"]
["M697"]
["M698"]
["M699"]
["M700"]
["M701"]
["M702"]
["M703"]
["M704"]
["M705"]
["M706"]
["M707"]
["M708"]
["M709"]
["M710"]
["M711"]
["M712"]
["M713"]
["M714"]
["M715"]
["M716"]
["M717"]
["M718"]
["M719"]
["M720"]
["M721"]
["M722"]
["M723"]
["M724"]
["M725"]
["M726"]
["M727"]
["M728"]
["M729"]
["M730"]
["M731"]
["M732"]
["M733"]
["M734"]
["M735"]
["M736"]
["M737"]
["M738"]
["M739"]
["M740"]
["M741"]
["M742"]
["M743"]
["M744"]
["M745"]
["M746"]
["M747"]
["M748"]
["M749"]
["M750"]
["M751"]
["M752"]
["M753"]
["M754"]
["M755"]
["M756"]
["M757"]
["M758"]
["M759"]
["M760"]
["M761"]
["M762"]
["M763"]
["M764"]
["M765"]
["M766"]
["M767"]
["M768"]
["M769"]
["M770"]
["M771"]
["M772"]
["M773"]
["M774"]
["M775"]
["M776"]
["M777"]
["M778"]
["M779"]
["M780"]
["M781"]
["M782"]
["M783"]
["M784"]
["M785"]
["M786"]
["M787"]
["M788"]
["M789"]
["M790"]
["M791"]
["M792"]
["M793"]
["M794"]
["M795"]
["M796"]
["M797"]
["M798"]
["M799"]
["M800"]
["M801"]
["M802"]
["M803"]
["M804"]
["M805"]
["M806"]
["M807"]
["M808"]
["M809"]
["M810"]
["M811"]
["M812"]
["M813"]
["M814"]
["M815"]
["M816"]
["M817"]
["M818"]
["M819"]
["M820"]
["M821"]
["M822"]
["M823"]
["M824"]
["M825"]
["M826"]
["M827"]
["M828"]
["M829"]
["M830"]
["M831"]
["M832"]
["M833"]
["M834"]
["M835"]
["M836"]
["M837"]
["M838"]
["M839"]
["M840"]
["M841"]
["M842"]
["M843"]
["M844"]
["M845"]
["M846"]
["M847"]
["M848"]
["M849"]
["M850"]
["M851"]
["M852"]
["M853"]
["M854"]
["M855"]
["M856"]
["M857"]
["M858"]
["M859"]
["M860"]
["M861"]
["M862"]
["M863"]
["M864"]
["M865"]
["M866"]
["M867"]
["M868"]
["M869"]
["M870"]
["M871"]
["M872"]
["M873"]
["M874"]
["M875"]
["M876"]
["M877"]
["M878"]
["M879"]
["M880"]
["M881"]
["M882"]
["M883"]
["M884"]
["M885"]
["M886"]
["M887"]
["M888"]
["M889"]
["M890"]
["M891"]
["M892"]
["M893"]
["M894"]
["M895"]
["M896"]
["M897"]
["M898"]
["M899"]
["M900"]
["M901"]
["M902"]
["M903"]
["M904"]
["M905"]
["M906"]
["M907"]
["M908"]
["M909"]
["M910"]
["M911"]
["M912"]
["M913"]
["M914"]
["M915"]
["M916"]
["M917"]
["M918"]
["M919"]
["M920"]
["M921"]
["M922"]
["M923"]
["M924"]
["M925"]
["M926"]
["M927"]
["M928"]
["M929"]
["M930"]
["M931"]
["M932"]
["M933"]
["M934"]
["M935"]
["M936"]
["M937"]
["M938"]
["M939"]
["M940"]
["M941"]
["M942"]
["M943"]
["M944"]
["M945"]
["M946"]
["M947"]
["M948"]
["M949"]
["M950"]
["M951"]
["M952"]
["M953"]
["M954"]
["M955"]
["M956"]
["M957"]
["M958"]
["M959"]
["M960"]
["M961"]
["M962"]
["M963"]
["M964"]
["M965"]
["M966"]
["M967"]
["M968"]
["M969"]
["M970"]
["M971"]
["M972"]
["M973"]
["M974"]
["M975"]
["M976"]
["M977"]
["M978"]
["M979"]
["M980"]
["M981"]
["M982"]
["M983"]
["M984"]
["M985"]
["M986"]
["M987"]
["M988"]
["M989"]
["M990"]
["M991"]
["M992"]
["M993"]
["M994"]
["M995"]
["M996"]
["M997"]
["M998"]
["M999"]
["M1000"]
["S1"]
["S2"]
["S3"]
["S4"]
["S5"]
["S6"]
["S7"]
["S8"]
["S9"]
["S10"]
["S11"]
["S12"]
["S13"]
["S14"]
["S15"]
["S16"]
["S17"]
["S18"]
["S19"]
["S20"]
["S21"]
["S22"]
["S23"]
["S24"]
["S25"]
["S26"]
["S27"]
["S28"]
["S29"]
["S30"]
["S31"]
["S32"]
["S33"]
["S34"]
["S35"]
["S36"]
["S37"]
["S38"]
["S39"]
["S40"]
["S41"]
["S42"]
["S43"]
["S44"]
["S45"]
["S46"]
["S47"]
["S48"]
["S49"]
["S50"]
["S51"]
["S52"]
["S53"]
["S54"]
["S55"]
["S56"]
["S57"]
["S58"]
["S59"]
["S60"]
["S61"]
["S62"]
["S63"]
["S64"]
["S65"]
["S66"]
["S67"]
["S68"]
["S69"]
["S70"]
["S71"]
["S72"]
["S73"]
["S74"]
["S75"]
["S76"]
["S77"]
["S78"]
["S79"]
["S80"]
["S81"]
["S82"]
["S83"]
["S84"]
["S85"]
["S86"]
["S87"]
["S88"]
["S89"]
["S90"]
["S91"]
["S92"]
["S93"]
["S94"]
["S95"]
["S96"]
["S97"]
["S98"]
["S99"]
["S100"]
["S101"]
["S102"]
["S103"]
["S104"]
["S105"]
["S106"]
["S107"]
["S108"]
["S109"]
["S110"]
["S111"]
["S112"]
["S113"]
["S114"]
["S115"]
["S116"]
["S117"]
["S118"]
["S119"]
["S120"]
["S121"]
["S122"]
["S123"]
["S124"]
["S125"]
["S126"]
["S127"]
["S128"]
["S129"]
["S130"]
["S131"]
["S132"]
["S133"]
["S134"]
["S135"]
["S136"]
["S137"]
["S138"]
["S139"]
["S140"]
["S141"]
["S142"]
["S143"]
["S144"]
["S145"]
["S146"]
["S147"]
["S148"]
["S149"]
["S150"]
["S151"]
["S152"]
["S153"]
["S154"]
["S155"]
["S156"]
["S157"]
["S158"]
["S159"]
["S160"]
["S161"]
["S162"]
["S163"]
["S164"]
["S165"]
["S166"]
["S167"]
["S168"]
["S169"]
["S170"]
["S171"]
["S172"]
["S173"]
["S174"]
["S175"]
["S176"]
["S177"]
["S178"]
["S179"]
["S180"]
["S181"]
["S182"]
["S183"]
["S184"]
["S185"]
["S186"]
["S187"]
["S188"]
["S189"]
["S190"]
["S191"]
["S192"]
["S193"]
["S194"]
["S195"]
["S196"]
["S197"]
["S198"]
["S199"]
["S200"]
["S201"]
["S202"]
["S203"]
["S204"]
["S205"]
["S206"]
["S207"]
["S208"]
["S209"]
["S210"]
["S211"]
["S212"]
["S213"]
["S214"]
["S215"]
["S216"]
["S217"]
["S218"]
["S219"]
["S220"]
["S221"]
["S222"]
["S223"]
["S224"]
["S225"]
["S226"]
["S227"]
["S228"]
["S229"]
["S230"]
["S231"]
["S232"]
["S233"]
["S234"]
["S235"]
["S236"]
["S237"]
["S238"]
["S239"]
["S240"]
["S241"]
["S242"]
["S243"]
["S244"]
["S245"]
["S246"]
["S247"]
["S248"]
["S249"]
["S250"]
["S251"]
["S252"]
["S253"]
["S254"]
["S255"]
["S256"]
["S257"]
["S258"]
["S259"]
["S260"]
["S261"]
["S262"]
["S263"]
["S264"]
["S265"]
["S266"]
["S267"]
["S268"]
["S269"]
["S270"]
["S271"]
["S272"]
["S273"]
["S274"]
["S275"]
["S276"]
["S277"]
["S278"]
["S279"]
["S280"]
["S281"]
["S282"]
["S283"]
["S284"]
["S285"]
["S286"]
["S287"]
["S288"]
["S289"]
["S290"]
["S291"]
["S292"]
["S293"]
["S294"]
["S295"]
["S296"]
["S297"]
["S298"]
["S299"]
["S300"]
["S301"]
["S302"]
["S303"]
["S304"]
["S305"]
["S306"]
["S307"]
["S308"]
["S309"]
["S310"]
["S311"]
["S312"]
["S313"]
["S314"]
["S315"]
["S316"]
["S317"]
["S318"]
["S319"]
["S320"]
["S321"]
["S322"]
["S323"]
["S324"]
["S325"]
["S326"]
["S327"]
["S328"]
["S329"]
["S330"]
["S331"]
["S332"]
["S333"]
["S334"]
["S335"]
["S336"]
["S337"]
["S338"]
["S339"]
["S340"]
["S341"]
["S342"]
["S343"]
["S344"]
["S345"]
["S346"]
["S347"]
["S348"]
["S349"]
["S350"]
["S351"]
["S352"]
["S353"]
["S354"]
["S355"]
["S356"]
["S357"]
["S358"]
["S359"]
["S360"]
["S361"]
["S362"]
["S363"]
["S364"]
["S365"]
["S366"]
["S367"]
["S368"]
["S369"]
["S370"]
["S371"]
["S372"]
["S373"]
["S374"]
["S375"]
["S376"]
["S377"]
["S378"]
["S379"]
["S380"]
["S381"]
["S382"]
["S383"]
["S384"]
["S385"]
["S386"]
["S387"]
["S388"]
["S389"]
["S390"]
["S391"]
["S392"]
["S393"]
["S394"]
["S395"]
["S396"]
["S397"]
["S398"]
["S399"]
["S400"]
["S401"]
["S402"]
["S403"]
["S404"]
["S405"]
["S406"]
["S407"]
["S408"]
["S409"]
["S410"]
["S411"]
["S412"]
["S413"]
["S414"]
["S415"]
["S416"]
["S417"]
["S418"]
["S419"]
["S420"]
["S421"]
["S422"]
["S423"]
["S424"]
["S425"]
["S426"]
["S427"]
["S428"]
["S429"]
["S430"]
["S431"]
["S432"]
["S433"]
["S434"]
["S435"]
["S436"]
["S437"]
["S438"]
["S439"]
["S440"]
["S441"]
["S442"]
["S443"]
["S444"]
["S445"]
["S446"]
["S447"]
["S448"]
["S449"]
["S450"]
["S451"]
["S452"]
["S453"]
["S454"]
["S455"]
["S456"]
["S457"]
["S458"]
["S459"]
["S460"]
["S461"]
["S462"]
["S463"]
["S464"]
["S465"]
["S466"]
["S467"]
["S468"]
["S469"]
["S470"]
["S471"]
["S472"]
["S473"]
["S474"]
["S475"]
["S476"]
["S477"]
["S478"]
["S479"]
["S480"]
["S481"]
["S482"]
["S483"]
["S484"]
["S485"]
["S486"]
["S487"]
["S488"]
["S489"]
["S490"]
["S491"]
["S492"]
["S493"]
["S494"]
["S495"]
["S496"]
["S497"]
["S498"]
["S499"]
["S500"]
["S501"]
["S502"]
["S503"]
["S504"]
["S505"]
["S506"]
["S507"]
["S508"]
["S509"]
["S510"]
["S511"]
["S512"]
["S513"]
["S514"]
["S515"]
["S516"]
["S517"]
["S518"]
["S519"]
["S520"]
["S521"]
["S522"]
["S523"]
["S524"]
["S525"]
["S526"]
["S527"]
["S528"]
["S529"]
["S530"]
["S531"]
["S532"]
["S533"]
["S534"]
["S535"]
["S536"]
["S537"]
["S538"]
["S539"]
["S540"]
["S541"]
["S542"]
["S543"]
["S544"]
["S545"]
["S546"]
["S547"]
["S548"]
["S549"]
["S550"]
["S551"]
["S552"]
["S553"]
["S554"]
["S555"]
["S556"]
["S557"]
["S558"]
["S559"]
["S560"]
["S561"]
["S562"]
["S563"]
["S564"]
["S565"]
["S566"]
["S567"]
["S568"]
["S569"]
["S570"]
["S571"]
["S572"]
["S573"]
["S574"]
["S575"]
["S576"]
["S577"]
["S578"]
["S579"]
["S580"]
["S581"]
["S582"]
["S583"]
["S584"]
["S585"]
["S586"]
["S587"]
["S588"]
["S589"]
["S590"]
["S591"]
["S592"]
["S593"]
["S594"]
["S595"]
["S596"]
["S597"]
["S598"]
["S599"]
["S600"]
["S601"]
["S602"]
["S603"]
["S604"]
["S605"]
["S606"]
["S607"]
["S608"]
["S609"]
["S610"]
["S611"]
["S612"]
["S613"]
["S614"]
["S615"]
["S616"]
["S617"]
["S618"]
["S619"]
["S620"]
["S621"]
["S622"]
["S623"]
["S624"]
["S625"]
["S626"]
["S627"]
["S628"]
["S629"]
["S630"]
["S631"]
["S632"]
["S633"]
["S634"]
["S635"]
["S636"]
["S637"]
["S638"]
["S639"]
["S640"]
["S641"]
["S642"]
["S643"]
["S644"]
["S645"]
["S646"]
["S647"]
["S648"]
["S649"]
["S650"]
["S651"]
["S652"]
["S653"]
["S654"]
["S655"]
["S656"]
["S657"]
["S658"]
["S659"]
["S660"]
["S661"]
["S662"]
["S663"]
["S664"]
["S665"]
["S666"]
["S667"]
["S668"]
["S669"]
["S670"]
["S671"]
["S672"]
["S673"]
["S674"]
["S675"]
["S676"]
["S677"]
["S678"]
["S679"]
["S680"]
["S681"]
["S682"]
["S683"]
["S684"]
["S685"]
["S686"]
["S687"]
["S688"]
["S689"]
["S690"]
["S691"]
["S692"]
["S693"]
["S694"]
["S695"]
["S696"]
["S697"]
["S698"]
["S699"]
["S700"]
["S701"]
["S702"]
["S703"]
["S704"]
["S705"]
["S706"]
["S707"]
["S708"]
["S709"]
["S710"]
["S711"]
["S712"]
["S713"]
["S714"]
["S715"]
["S716"]
["S717"]
["S718"]
["S719"]
["S720"]
["S721"]
["S722"]
["S723"]
["S724"]
["S725"]
["S726"]
["S727"]
["S728"]
["S729"]
["S730"]
["S731"]
["S732"]
["S733"]
["S734"]
["S735"]
["S736"]
["S737"]
["S738"]
["S739"]
["S740"]
["S741"]
["S742"]
["S743"]
["S744"]
["S745"]
["S746"]
["S747"]
["S748"]
["S749"]
["S750"]
["S751"]
["S752"]
["S753"]
["S754"]
["S755"]
["S756"]
["S757"]
["S758"]
["S759"]
["S760"]
["S761"]
["S762"]
["S763"]
["S764"]
["S765"]
["S766"]
["S767"]
["S768"]
["S769"]
["S770"]
["S771"]
["S772"]
["S773"]
["S774"]
["S775"]
["S776"]
["S777"]
["S778"]
["S779"]
["S780"]
["S781"]
["S782"]
["S783"]
["S784"]
["S785"]
["S786"]
["S787"]
["S788"]
["S789"]
["S790"]
["S791"]
["S792"]
["S793"]
["S794"]
["S795"]
["S796"]
["S797"]
["S798"]
["S799"]
["S800"]
["S801"]
["S802"]
["S803"]
["S804"]
["S805"]
["S806"]
["S807"]
["S808"]
["S809"]
["S810"]
["S811"]
["S812"]
["S813"]
["S814"]
["S815"]
["S816"]
["S817"]
["S818"]
["S819"]
["S820"]
["S821"]
["S822"]
["S823"]
["S824"]
["S825"]
["S826"]
["S827"]
["S828"]
["S829"]
["S830"]
["S831"]
["S832"]
["S833"]
["S834"]
["S835"]
["S836"]
["S837"]
["S838"]
["S839"]
["S840"]
["S841"]
["S842"]
["S843"]
["S844"]
["S845"]
["S846"]
["S847"]
["S848"]
["S849"]
["S850"]
["S851"]
["S852"]
["S853"]
["S854"]
["S855"]
["S856"]
["S857"]
["S858"]
["S859"]
["S860"]
["S861"]
["S862"]
["S863"]
["S864"]
["S865"]
["S866"]
["S867"]
["S868"]
["S869"]
["S870"]
["S871"]
["S872"]
["S873"]
["S874"]
["S875"]
["S876"]
["S877"]
["S878"]
["S879"]
["S880"]
["S881"]
["S882"]
["S883"]
["S884"]
["S885"]
["S886"]
["S887"]
["S888"]
["S889"]
["S890"]
["S891"]
["S892"]
["S893"]
["S894"]
["S895"]
["S896"]
["S897"]
["S898"]
["S899"]
["S900"]
["S901"]
["S902"]
["S903"]
["S904"]
["S905"]
["S906"]
["S907"]
["S908"]
["S909"]
["S910"]
["S911"]
["S912"]
["S913"]
["S914"]
["S915"]
["S916"]
["S917"]
["S918"]
["S919"]
["S920"]
["S921"]
["S922"]
["S923"]
["S924"]
["S925"]
["S926"]
["S927"]
["S928"]
["S929"]
["S930"]
["S931"]
["S932"]
["S933"]
["S934"]
["S935"]
["S936"]
["S937"]
["S938"]
["S939"]
["S940"]
["S941"]
["S942"]
["S943"]
["S944"]
["S945"]
["S946"]
["S947"]
["S948"]
["S949"]
["S950"]
["S951"]
["S952"]
["S953"]
["S954"]
["S955"]
["S956"]
["S957"]
["S958"]
["S959"]
["S960"]
["S961"]
["S962"]
["S963"]
["S964"]
["S965"]
["S966"]
["S967"]
["S968"]
["S969"]
["S970"]
["S971"]
["S972"]
["S973"]
["S974"]
["S975"]
["S976"]
["S977"]
["S978"]
["S979"]
["S980"]
["S981"]
["S982"]
["S983"]
["S984"]
["S985"]
["S986"]
["S987"]
["S988"]
["S989"]
["S990"]
["S991"]
["S992"]
["S993"]
["S994"]
["S995"]
["S996"]
["S997"]
["S998"]
["S999"]
["S1000"]
[]
[]
[]
[]
[]
[]
[null,null,null,null,null,null,"Preço Unitário médio","Despesa Mensal?"]

{"sheet":"Formulas","index":10,"n_rows":2006,"n_cols":8,"rows_kept":2006,"cut":false,"hidden":true,"merged":[]}
["PLANILHA DE ITENS E CUSTOS DOS BENS E SERVIÇOS","COMPONENTES DE SISTEMA DE COMBUSTIVEL DE MOTORES, EXCETO DE  AERONAVES",null,null,null,null,{"$f":"SUBSTITUTE(A1,\" \",\"_\")","v":"PLANILHA_DE_ITENS_E_CUSTOS_DOS_BENS_E_SERVIÇOS"}]
["DESPESAS DE PESSOAL","BENEFICIOS",null,null,null,null,{"$f":"SUBSTITUTE(A2,\" \",\"_\")","v":"DESPESAS_DE_PESSOAL"}]
["ARTIGOS DE ESCRITORIO","SOFTWARES",null,null,null,null,{"$f":"SUBSTITUTE(A3,\" \",\"_\")","v":"ARTIGOS_DE_ESCRITORIO"}]
[]
[null,null,null,null,200,null,null,18]
[]
[]
[]
[]
[]
[]
[]
[]
[]
[]
[]
[]
[]
[]
[]
[]
[]
[]
[]
[]
[]
[]
[]
[]
[]
[]
[]
[]
[]
[]
[]
[]
[]
[]
[]
[]
[]
[]
[]
[]
[]
[]
[]
[]
[]
[]
[]
[]
[]
[]
[]
[]
[]
[]
[]
[]
[]
[]
[]
[]
[]
[]
[]
[]
[]
[]
[]
[]
[]
[]
[]
[]
[]
[]
[]
[]
[]
[]
[]
[]
[]
[]
[]
[]
[]
[]
[]
[]
[]
[]
[]
[]
[]
[]
[]
[]
[]
[]
[]
[]
[]
[]
[]
[]
[]
[]
[]
[]
[]
[]
[]
[]
[]
[]
[]
[]
[]
[]
[]
[]
[]
[]
[]
[]
[]
[]
[]
[]
[]
[]
[]
[]
[]
[]
[]
[]
[]
[]
[]
[]
[]
[]
[]
[]
[]
[]
[]
[]
[]
[]
[]
[]
[]
[]
[]
[]
[]
[]
[]
[]
[]
[]
[]
[]
[]
[]
[]
[]
[]
[]
[]
[]
[]
[]
[]
[]
[]
[]
[]
[]
[]
[]
[]
[]
[]
[]
[]
[]
[]
[]
[]
[]
[]
[]
[]
[]
[]
[]
[]
[]
[]
[]
[]
[]
[]
[]
[]
[]
[]
[]
[]
[]
[]
[]
[]
[]
[]
[]
[]
[]
[]
[]
[]
[]
[]
[]
[]
[]
[]
[]
[]
[]
[]
[]
[]
[]
[]
[]
[]
[]
[]
[]
[]
[]
[]
[]
[]
[]
[]
[]
[]
[]
[]
[]
[]
[]
[]
[]
[]
[]
[]
[]
[]
[]
[]
[]
[]
[]
[]
[]
[]
[]
[]
[]
[]
[]
[]
[]
[]
[]
[]
[]
[]
[]
[]
[]
[]
[]
[]
[]
[]
[]
[]
[]
[]
[]
[]
[]
[]
[]
[]
[]
[]
[]
[]
[]
[]
[]
[]
[]
[]
[]
[]
[]
[]
[]
[]
[]
[]
[]
[]
[]
[]
[]
[]
[]
[]
[]
[]
[]
[]
[]
[]
[]
[]
[]
[]
[]
[]
[]
[]
[]
[]
[]
[]
[]
[]
[]
[]
[]
[]
[]
[]
[]
[]
[]
[]
[]
[]
[]
[]
[]
[]
[]
[]
[]
[]
[]
[]
[]
[]
[]
[]
[]
[]
[]
[]
[]
[]
[]
[]
[]
[]
[]
[]
[]
[]
[]
[]
[]
[]
[]
[]
[]
[]
[]
[]
[]
[]
[]
[]
[]
[]
[]
[]
[]
[]
[]
[]
[]
[]
[]
[]
[]
[]
[]
[]
[]
[]
[]
[]
[]
[]
[]
[]
[]
[]
[]
[]
[]
[]
[]
[]
[]
[]
[]
[]
[]
[]
[]
[]
[]
[]
[]
[]
[]
[]
[]
[]
[]
[]
[]
[]
[]
[]
[]
[]
[]
[]
[]
[]
[]
[]
[]
[]
[]
[]
[]
[]
[]
[]
[]
[]
[]
[]
[]
[]
[]
[]
[]
[]
[]
[]
[]
[]
[]
[]
[]
[]
[]
[]
[]
[]
[]
[]
[]
[]
[]
[]
[]
[]
[]
[]
[]
[]
[]
[]
[]
[]
[]
[]
[]
[]
[]
[]
[]
[]
[]
[]
[]
[]
[]
[]
[]
[]
[]
[]
[]
[]
[]
[]
[]
[]
[]
[]
[]
[]
[]
[]
[]
[]
[]
[]
[]
[]
[]
[]
[]
[]
[]
[]
[]
[]
[]
[]
[]
[]
[]
[]
[]
[]
[]
[]
[]
[]
[]
[]
[]
[]
[]
[]
[]
[]
[]
[]
[]
[]
[]
[]
[]
[]
[]
[]
[]
[]
[]
[]
[]
[]
[]
[]
[]
[]
[]
[]
[]
[]
[]
[]
[]
[]
[]
[]
[]
[]
[]
[]
[]
[]
[]
[]
[]
[]
[]
[]
[]
[]
[]
[]
[]
[]
[]
[]
[]
[]
[]
[]
[]
[]
[]
[]
[]
[]
[]
[]
[]
[]
[]
[]
[]
[]
[]
[]
[]
[]
[]
[]
[]
[]
[]
[]
[]
[]
[]
[]
[]
[]
[]
[]
[]
[]
[]
[]
[]
[]
[]
[]
[]
[]
[]
[]
[]
[]
[]
[]
[]
[]
[]
[]
[]
[]
[]
[]
[]
[]
[]
[]
[]
[]
[]
[]
[]
[]
[]
[]
[]
[]
[]
[]
[]
[]
[]
[]
[]
[]
[]
[]
[]
[]
[]
[]
[]
[]
[]
[]
[]
[]
[]
[]
[]
[]
[]
[]
[]
[]
[]
[]
[]
[]
[]
[]
[]
[]
[]
[]
[]
[]
[]
[]
[]
[]
[]
[]
[]
[]
[]
[]
[]
[]
[]
[]
[]
[]
[]
[]
[]
[]
[]
[]
[]
[]
[]
[]
[]
[]
[]
[]
[]
[]
[]
[]
[]
[]
[]
[]
[]
[]
[]
[]
[]
[]
[]
[]
[]
[]
[]
[]
[]
[]
[]
[]
[]
[]
[]
[]
[]
[]
[]
[]
[]
[]
[]
[]
[]
[]
[]
[]
[]
[]
[]
[]
[]
[]
[]
[]
[]
[]
[]
[]
[]
[]
[]
[]
[]
[]
[]
[]
[]
[]
[]
[]
[]
[]
[]
[]
[]
[]
[]
[]
[]
[]
[]
[]
[]
[]
[]
[]
[]
[]
[]
[]
[]
[]
[]
[]
[]
[]
[]
[]
[]
[]
[]
[]
[]
[]
[]
[]
[]
[]
[]
[]
[]
[]
[]
[]
[]
[]
[]
[]
[]
[]
[]
[]
[]
[]
[]
[]
[]
[]
[]
[]
[]
[]
[]
[]
[]
[]
[]
[]
[]
[]
[]
[]
[]
[]
[]
[]
[]
[]
[]
[]
[]
[]
[]
[]
[]
[]
[]
[]
[]
[]
[]
[]
[]
[]
[]
[]
[]
[]
[]
[]
[]
[]
[]
[]
[]
[]
[]
[]
[]
[]
[]
[]
[]
[]
[]
[]
[]
[]
[]
[]
[]
[]
[]
[]
[]
[]
[]
[]
[]
[]
[]
[]
[]
[]
[]
[]
[]
[]
[]
[]
[]
[]
[]
[]
[]
[]
[]
[]
[]
[]
[]
[]
[]
[]
[]
[]
[]
[]
[]
[]
[]
[]
[]
[]
[]
[]
[]
[]
[]
[]
[]
[]
[]
[]
[]
[]
[]
[]
[]
[]
[]
[]
[]
[]
[]
[]
[]
[]
[]
[]
[]
[]
[]
[]
[]
[]
[]
[]
[]
[]
[]
[]
[]
[]
[]
[]
[]
[]
[]
[]
[]
[]
[]
[]
[]
[]
[]
[]
[]
[]
[]
[]
[]
[]
[]
[]
[]
[]
[]
[]
[]
[]
[]
[]
[]
[]
[]
[]
[]
[]
[]
[]
[]
[]
[]
[]
[]
[]
[]
[]
[]
[]
[]
[]
[]
[]
[]
[]
[]
[]
[]
[]
[]
[]
[]
[]
[]
[]
[]
[]
[]
[]
[]
[]
[]
[]
[]
[]
[]
[]
[]
[]
[]
[]
[]
[]
[]
[]
[]
[]
[]
[]
[]
[]
[]
[]
[]
[]
[]
[]
[]
[]
[]
[]
[]
[]
[]
[]
[]
[]
[]
[]
[]
[]
[]
[]
[]
[]
[]
[]
[]
[]
[]
[]
[]
[]
[]
[]
[]
[]
[]
[]
[]
[]
[]
[]
[]
[]
[]
[]
[]
[]
[]
[]
[]
[]
[]
[]
[]
[]
[]
[]
[]
[]
[]
[]
[]
[]
[]
[]
[]
[]
[]
[]
[]
[]
[]
[]
[]
[]
[]
[]
[]
[]
[]
[]
[]
[]
[]
[]
[]
[]
[]
[]
[]
[]
[]
[]
[]
[]
[]
[]
[]
[]
[]
[]
[]
[]
[]
[]
[]
[]
[]
[]
[]
[]
[]
[]
[]
[]
[]
[]
[]
[]
[]
[]
[]
[]
[]
[]
[]
[]
[]
[]
[]
[]
[]
[]
[]
[]
[]
[]
[]
[]
[]
[]
[]
[]
[]
[]
[]
[]
[]
[]
[]
[]
[]
[]
[]
[]
[]
[]
[]
[]
[]
[]
[]
[]
[]
[]
[]
[]
[]
[]
[]
[]
[]
[]
[]
[]
[]
[]
[]
[]
[]
[]
[]
[]
[]
[]
[]
[]
[]
[]
[]
[]
[]
[]
[]
[]
[]
[]
[]
[]
[]
[]
[]
[]
[]
[]
[]
[]
[]
[]
[]
[]
[]
[]
[]
[]
[]
[]
[]
[]
[]
[]
[]
[]
[]
[]
[]
[]
[]
[]
[]
[]
[]
[]
[]
[]
[]
[]
[]
[]
[]
[]
[]
[]
[]
[]
[]
[]
[]
[]
[]
[]
[]
[]
[]
[]
[]
[]
[]
[]
[]
[]
[]
[]
[]
[]
[]
[]
[]
[]
[]
[]
[]
[]
[]
[]
[]
[]
[]
[]
[]
[]
[]
[]
[]
[]
[]
[]
[]
[]
[]
[]
[]
[]
[]
[]
[]
[]
[]
[]
[]
[]
[]
[]
[]
[]
[]
[]
[]
[]
[]
[]
[]
[]
[]
[]
[]
[]
[]
[]
[]
[]
[]
[]
[]
[]
[]
[]
[]
[]
[]
[]
[]
[]
[]
[]
[]
[]
[]
[]
[]
[]
[]
[]
[]
[]
[]
[]
[]
[]
[]
[]
[]
[]
[]
[]
[]
[]
[]
[]
[]
[]
[]
[]
[]
[]
[]
[]
[]
[]
[]
[]
[]
[]
[]
[]
[]
[]
[]
[]
[]
[]
[]
[]
[]
[]
[]
[]
[]
[]
[]
[]
[]
[]
[]
[]
[]
[]
[]
[]
[]
[]
[]
[]
[]
[]
[]
[]
[]
[]
[]
[]
[]
[]
[]
[]
[]
[]
[]
[]
[]
[]
[]
[]
[]
[]
[]
[]
[]
[]
[]
[]
[]
[]
[]
[]
[]
[]
[]
[]
[]
[]
[]
[]
[]
[]
[]
[]
[]
[]
[]
[]
[]
[]
[]
[]
[]
[]
[]
[]
[]
[]
[]
[]
[]
[]
[]
[]
[]
[]
[]
[]
[]
[]
[]
[]
[]
[]
[]
[]
[]
[]
[]
[]
[]
[]
[]
[]
[]
[]
[]
[]
[]
[]
[]
[]
[]
[]
[]
[]
[]
[]
[]
[]
[]
[]
[]
[]
[]
[]
[]
[]
[]
[]
[]
[]
[]
[]
[]
[]
[]
[]
[]
[]
[]
[]
[]
[]
[]
[]
[]
[]
[]
[]
[]
[]
[]
[]
[]
[]
[]
[]
[]
[]
[]
[]
[]
[]
[]
[]
[]
[]
[]
[]
[]
[]
[]
[]
[]
[]
[]
[]
[]
[]
[]
[]
[]
[]
[]
[]
[]
[]
[]
[]
[]
[]
[]
[]
[]
[]
[]
[]
[]
[]
[]
[]
[]
[]
[]
[]
[]
[]
[]
[]
[]
[]
[]
[]
[]
[]
[]
[]
[]
[]
[]
[]
[]
[]
[]
[]
[]
[]
[]
[]
[]
[]
[]
[]
[]
[]
[]
[]
[]
[]
[]
[]
[]
[]
[]
[]
[]
[]
[]
[]
[]
[]
[]
[]
[]
[]
[]
[]
[]
[]
[]
[]
[]
[]
[]
[]
[]
[]
[]
[]
[]
[]
[]
[]
[]
[]
[]
[]
[]
[]
[]
[]
[]
[]
[]
[]
[]
[]
[]
[]
[]
[]
[]
[]
[]
[]
[]
[]
[]
[]
[]
[]
[]
[]
[]
[]
[]
[]
[]
[]
[]
[]
[]
[]
[]
[]
[]
[]
[]
[]
[]
[]
[]
[]
[]
[]
[]
[]
[]
[]
[]
[]
[]
[]
[]
[]
[]
[]
[]
[]
[]
[]
[]
[]
[]
[]
[]
[]
[]
[]
[]
[]
[]
[]
[]
[]
[]
[]
[]
[]
[]
[]
[]
[]
[]
[]
[]
[]
[]
[]
[]
[]
[]
[]
[]
[]
[]
[]
[]
[]
[]
[]
[]
[]
[]
[]
[]
[]
[]
[]
[]
[]
[]
[]
[]
[]
[]
[]
[]
[]
[]
[]
[]
[]
[]
[]
[]
[]
[]
[]
[]
[]
[]
[]
[]
[]
[]
[]
[]
[]
[]
[]
[]
[]
[]
[]
[]
[]
[]
[]
[]
[]
[]
[]
[]
[]
[]
[]
[]
[]
[]
[]
[]
[]
[]
[]
[]
[]
[]
[]
[]
[]
[]
[]
[]
[]
[]
[]
[]
[]
[]
[]
[]
[]
[]
[]
[]
[]
[]
[]
[]
[]
[]
[]
[]
[]
[]
[]
[]
[]
[]
[]
[]
[]
[]
[]
[]
[]
[]
[]
[]
["DETALHAMENTO DOS ITENS E CUSTOS DOS BENS E SERVIÇOS"]