{"text_format":"1","workbook":"xlsx","n_sheets":11,"sheets":["Relatório 1","Plan2","LISTA DE GRUPOS DIVIDIDA","LISTA DE GRUPOS","Plan4","CLASSES","Orientações de preenchimento","Planilha","Lista de Grupos-Classes aberta","Lista","Formulas"],"not_rendered":{"charts":0,"images":0,"macros":0,"external_links":0,"defined_names":99,"comments":0,"pivot_tables":2},"unopened":[],"bounds":{"document_bytes":16777216,"sheet_cells":100000,"rows_first":2000,"rows_last":500,"rows_between":2000,"halvings":0,"cell_chars":16384,"cell_head_chars":4096},"cells_cut":0,"cells_raw":0,"read":"whole","date_system":"1900"}

{"sheet":"Relatório 1","index":0,"n_rows":830,"n_cols":7,"rows_kept":830,"cut":false,"hidden":true,"merged":[[1,2,1,6]]}
[]
[null,null,"Consulta Armazém   CATMAS"]
[]
[null,"Tipo Material/Serviço","Código Grupo Material/Serviço   Formatado","Grupo Material/Serviço","Tipo Material/Serviço","Código Classe Material/Serviço   Formatado","Classe Material/Serviço"]
[null,"MATERIAL","10","ARMAMENTO COMPONENTES EQUIPAMENTOS E APETRECHOS DE USO    POLICIAL","MATERIAL","1005","ARMAS DE FOGO"]
[null,"MATERIAL","10","ARMAMENTO COMPONENTES EQUIPAMENTOS E APETRECHOS DE USO    POLICIAL","MATERIAL","1010","PECAS E COMPONENTES PARA ARMAS DE FOGO"]
[null,"MATERIAL","10","ARMAMENTO COMPONENTES EQUIPAMENTOS E APETRECHOS DE USO    POLICIAL","MATERIAL","1015","FERRAMENTAS PARA ARMAMENTO"]
[null,"MATERIAL","10","ARMAMENTO COMPONENTES EQUIPAMENTOS E APETRECHOS DE USO    POLICIAL","MATERIAL","1020","EQUIPAMENTOS E APETRECHOS DE USO POLICIAL"]
[null,"MATERIAL","10","ARMAMENTO COMPONENTES EQUIPAMENTOS E APETRECHOS DE USO    POLICIAL","MATERIAL","1095","ARMAS DIVERSAS"]
[null,"MATERIAL","10","ARMAMENTO COMPONENTES EQUIPAMENTOS E APETRECHOS DE USO    POLICIAL","MATERIAL","1097","PECAS E COMPONENTES PARA ARMAS DIVERSAS"]
[null,"MATERIAL","13","EXPLOSIVOS MUNICOES E DISPOSITIVOS DE DISPERSAO","MATERIAL","1305","MUNICOES"]
[null,"MATERIAL","13","EXPLOSIVOS MUNICOES E DISPOSITIVOS DE DISPERSAO","MATERIAL","1370","ARTIGOS PIROTECNICOS E SINALIZADORES"]
[null,"MATERIAL","13","EXPLOSIVOS MUNICOES E DISPOSITIVOS DE DISPERSAO","MATERIAL","1375","EXPLOSIVOS E DISPOSITIVOS DE EXPLOSAO"]
[null,"MATERIAL","13","EXPLOSIVOS MUNICOES E DISPOSITIVOS DE DISPERSAO","MATERIAL","1380","DISPOSITOS DE DISPERSAO NAO EXPLOSIVOS"]
[null,"MATERIAL","15","AERONAVES E COMPONENTES ESTRUTURAIS","MATERIAL","1510","AERONAVES"]
[null,"MATERIAL","15","AERONAVES E COMPONENTES ESTRUTURAIS","MATERIAL","1560","COMPONENTES ESTRUTURAIS DE AERONAVES  "]
[null,"MATERIAL","16","COMPONENTES E ACESSORIOS DE AERONAVES","MATERIAL","1610","HELICES DE AERONAVES E COMPONENTES"]
[null,"MATERIAL","16","COMPONENTES E ACESSORIOS DE AERONAVES","MATERIAL","1615","INSTRUMENTOS PARA AERONAVES (AVIONICOS)"]
[null,"MATERIAL","16","COMPONENTES E ACESSORIOS DE AERONAVES","MATERIAL","1620","COMPONENTES DE TREM DE POUSO"]
[null,"MATERIAL","16","COMPONENTES E ACESSORIOS DE AERONAVES","MATERIAL","1625","ROTORES DE AERONAVES E COMPONENTES  "]
{"$rows_left_out":811}
{"sheet":"Plan2","index":1,"n_rows":907,"n_cols":2,"rows_kept":907,"cut":false,"hidden":true,"merged":[]}
[]
[]
[]
["Grupo Material/Serviço","Classe Material/Serviço"]
["ACESSORIOS DE MOTORES","ACESSORIOS DIVERSOS DE MOTORES DE AERONAVES"]
[null,"ACESSORIOS DIVERSOS DE MOTORES, EXCETO DE AERONAVES"]
[null,"COMPONENTES DE SISTEMA DE ARREFECIMENTO DE MOTORES, EXCETO  DE AERONAVES"]
[null,"COMPONENTES DE SISTEMA DE COMBUSTIVEL DE MOTORES, EXCETO DE  AERONAVES"]
[null,"COMPONENTES DO SISTEMA DE COMBUSTIVEL DE MOTORES DE AERONAVES"]
[null,"COMPONENTES DO SISTEMA ELETRICO DE MOTORES, EXCETO DE AERONAVES"]
[null,"PURIFICADORES E FILTROS DE AR E DE OLEO DE MOTORES DE AERONAVES"]
[null,"PURIFICADORES E FILTROS DE MOTORES, EXCETO DE AERONAVES"]
["ACESSORIOS DE MOTORES Total"]
["ADMINISTRACAO GERAL","AQUISICAO E ASSINATURAS DE PERIODICOS"]
[null,"BENEFICIOS"]
[null,"CONTRATACAO DE PESSOAL EM SUBSTITUICAO CONFORME DETERMINA A LEI COMPLEMENTAR FEDERAL 101/2000"]
[null,"ENCARGOS FINANCEIROS POR SERVICOS PRESTADOS POR PESSOA FISI CA OU JURIDICA"]
[null,"ENCARGOS PREVIDENCIARIOS POR SERVICOS PRESTADOS  POR  PESSOAFISICA OU JURIDICA"]
[null,"OUTROS SERVICOS DE PESSOA JURIDICA"]
[null,"SERV.ESPECIALIZADOS AREAS MEDICA, ODONTOLOGICA, REABILITACAO,HOSPITALAR E DE LABORATORIO (EXAME-ANALISE-ENSAIO-PESQUISA)"]
{"$rows_left_out":888}
{"sheet":"LISTA DE GRUPOS DIVIDIDA","index":2,"n_rows":82,"n_cols":4,"rows_kept":82,"cut":false,"hidden":true,"merged":[]}
[]
["ACESSORIOS DE MOTORES","MATERIAL"]
["AERONAVES E COMPONENTES ESTRUTURAIS","MATERIAL",null,"Sim"]
["ANIMAIS VIVOS E MATERIAIS GENETICOS","MATERIAL",null,"Não"]
["APARELHOS E MEIOS AUXILIARES PARA TREINAMENTO","MATERIAL"]
["APARELHOS E UTENSILIOS PARA MEDICAO E INSPECAO","MATERIAL"]
["ARAMES LAMINADOS PLANOS E PERFILADOS METALICOS","MATERIAL"]
["ARTIGOS DE ESCRITORIO","MATERIAL"]
["ARTIGOS DOMESTICOS E COMERCIAIS","MATERIAL"]
["ARTIGOS PARA TOUCADOR E HIGIENE PESSOAL","MATERIAL"]
["BOMBAS E COMPRESSORES","MATERIAL"]
["CABO FIBRA OPTICA","MATERIAL"]
["CABOS DE ACO CORDAS CORRENTES CORDOALHAS E ACESSORIOS","MATERIAL"]
["COMBUSTIVEIS LUBRIFICANTES OLEOS GRAXAS E CERAS","MATERIAL"]
["COMPONENTES DE EQUIPAMENTOS ELETRICOS E ELETRONICOS","MATERIAL"]
["COMPONENTES PARA VEICULOS","MATERIAL"]
["EMBARCACOES PONTOES E DIQUES FLUTUANTES","MATERIAL"]
["EQUIPAMENTOS COMERCIAIS E DE SERVICOS","MATERIAL"]
["EQUIPAMENTOS DE CALEFACAO AQUECIMENTO E INSTALACOES SANITARIAS","MATERIAL"]
["EQUIPAMENTOS DE COMUNICACOES","MATERIAL"]
{"$rows_left_out":63}
{"sheet":"LISTA DE GRUPOS","index":3,"n_rows":81,"n_cols":4,"rows_kept":81,"cut":false,"hidden":true,"merged":[]}
["ACESSORIOS DE MOTORES",{"$f":"VLOOKUP('LISTA DE GRUPOS'!A1,'Relatório 1'!D5:E830,2,FALSE)","v":"MATERIAL"}]
["ADMINISTRACAO GERAL",{"$f":"VLOOKUP('LISTA DE GRUPOS'!A2,'Relatório 1'!D6:E831,2,FALSE)","v":"SERVICO"},null,"Sim"]
["AERONAVES E COMPONENTES ESTRUTURAIS",{"$f":"VLOOKUP('LISTA DE GRUPOS'!A3,'Relatório 1'!D7:E832,2,FALSE)","v":"MATERIAL"},null,"Não"]
["ANIMAIS VIVOS E MATERIAIS GENETICOS",{"$f":"VLOOKUP('LISTA DE GRUPOS'!A4,'Relatório 1'!D8:E833,2,FALSE)","v":"MATERIAL"}]
["APARELHOS E MEIOS AUXILIARES PARA TREINAMENTO",{"$f":"VLOOKUP('LISTA DE GRUPOS'!A5,'Relatório 1'!D9:E834,2,FALSE)","v":"MATERIAL"}]
["APARELHOS E UTENSILIOS PARA MEDICAO E INSPECAO",{"$f":"VLOOKUP('LISTA DE GRUPOS'!A6,'Relatório 1'!D10:E835,2,FALSE)","v":"MATERIAL"}]
["ARAMES LAMINADOS PLANOS E PERFILADOS METALICOS",{"$f":"VLOOKUP('LISTA DE GRUPOS'!A7,'Relatório 1'!D11:E836,2,FALSE)","v":"MATERIAL"}]
["ARTIGOS DE ESCRITORIO",{"$f":"VLOOKUP('LISTA DE GRUPOS'!A8,'Relatório 1'!D12:E837,2,FALSE)","v":"MATERIAL"}]
["ARTIGOS DOMESTICOS E COMERCIAIS",{"$f":"VLOOKUP('LISTA DE GRUPOS'!A9,'Relatório 1'!D13:E838,2,FALSE)","v":"MATERIAL"}]
["ARTIGOS PARA TOUCADOR E HIGIENE PESSOAL",{"$f":"VLOOKUP('LISTA DE GRUPOS'!A10,'Relatório 1'!D14:E839,2,FALSE)","v":"MATERIAL"}]
["BOMBAS E COMPRESSORES",{"$f":"VLOOKUP('LISTA DE GRUPOS'!A11,'Relatório 1'!D15:E840,2,FALSE)","v":"MATERIAL"}]
["CABO FIBRA OPTICA",{"$f":"VLOOKUP('LISTA DE GRUPOS'!A12,'Relatório 1'!D16:E841,2,FALSE)","v":"MATERIAL"}]
["CABOS DE ACO CORDAS CORRENTES CORDOALHAS E ACESSORIOS",{"$f":"VLOOKUP('LISTA DE GRUPOS'!A13,'Relatório 1'!D17:E842,2,FALSE)","v":"MATERIAL"}]
["COMBUSTIVEIS LUBRIFICANTES OLEOS GRAXAS E CERAS",{"$f":"VLOOKUP('LISTA DE GRUPOS'!A14,'Relatório 1'!D18:E843,2,FALSE)","v":"MATERIAL"}]
["COMPONENTES DE EQUIPAMENTOS ELETRICOS E ELETRONICOS",{"$f":"VLOOKUP('LISTA DE GRUPOS'!A15,'Relatório 1'!D19:E844,2,FALSE)","v":"MATERIAL"}]
["COMPONENTES PARA VEICULOS",{"$f":"VLOOKUP('LISTA DE GRUPOS'!A16,'Relatório 1'!D20:E845,2,FALSE)","v":"MATERIAL"}]
["EMBARCACOES PONTOES E DIQUES FLUTUANTES",{"$f":"VLOOKUP('LISTA DE GRUPOS'!A17,'Relatório 1'!D21:E846,2,FALSE)","v":"MATERIAL"}]
["EQUIPAMENTOS COMERCIAIS E DE SERVICOS",{"$f":"VLOOKUP('LISTA DE GRUPOS'!A18,'Relatório 1'!D22:E847,2,FALSE)","v":"MATERIAL"}]
["EQUIPAMENTOS DE CALEFACAO AQUECIMENTO E INSTALACOES SANITARIAS",{"$f":"VLOOKUP('LISTA DE GRUPOS'!A19,'Relatório 1'!D23:E848,2,FALSE)","v":"MATERIAL"}]
["EQUIPAMENTOS DE COMUNICACOES",{"$f":"VLOOKUP('LISTA DE GRUPOS'!A20,'Relatório 1'!D24:E849,2,FALSE)","v":"MATERIAL"}]
{"$rows_left_out":62}
{"sheet":"Plan4","index":4,"n_rows":89,"n_cols":1,"rows_kept":89,"cut":false,"hidden":true,"merged":[]}
[]
["Grupo Material/Serviço"]
["ACESSORIOS DE MOTORES"]
["ADMINISTRACAO GERAL"]
["AERONAVES E COMPONENTES ESTRUTURAIS"]
["ANIMAIS VIVOS E MATERIAIS GENETICOS"]
["APARELHOS E MEIOS AUXILIARES PARA TREINAMENTO"]
["APARELHOS E UTENSILIOS PARA MEDICAO E INSPECAO"]
["ARAMES, LAMINADOS PLANOS E PERFILADOS METALICOS"]
["ARMAMENTO, COMPONENTES, EQUIPAMENTOS E APETRECHOS DE USO    POLICIAL"]
["ARTIGOS DE ESCRITORIO"]
["ARTIGOS DOMESTICOS E COMERCIAIS"]
["ARTIGOS PARA TOUCADOR E HIGIENE PESSOAL"]
["BOMBAS E COMPRESSORES"]
["CABO FIBRA OPTICA"]
["CABOS DE ACO, CORDAS, CORRENTES, CORDOALHAS E ACESSORIOS"]
["COMBUSTIVEIS, LUBRIFICANTES, OLEOS, GRAXAS E CERAS"]
["COMPONENTES DE EQUIPAMENTOS ELETRICOS E ELETRONICOS"]
["COMPONENTES E ACESSORIOS DE AERONAVES"]
["COMPONENTES PARA VEICULOS"]
{"$rows_left_out":70}
{"sheet":"CLASSES","index":5,"n_rows":787,"n_cols":5,"rows_kept":787,"cut":false,"hidden":true,"merged":[]}
[null,null,"Grupo Material/Serviço","Classe Material/Serviço"]
["MATERIAL","PERMANENTE","ACESSORIOS DE MOTORES","ACESSORIOS DIVERSOS DE MOTORES DE AERONAVES","ACESSORIOS_DE_MOTORES"]
[null,null,null,"ACESSORIOS DIVERSOS DE MOTORES EXCETO DE AERONAVES",""]
[null,null,null,"COMPONENTES DE SISTEMA DE ARREFECIMENTO DE MOTORES EXCETO  DE AERONAVES",""]
[null,null,null,"COMPONENTES DE SISTEMA DE COMBUSTIVEL DE MOTORES EXCETO DE  AERONAVES",""]
[null,null,null,"COMPONENTES DO SISTEMA DE COMBUSTIVEL DE MOTORES DE AERONAVES",""]
[null,null,null,"COMPONENTES DO SISTEMA ELETRICO DE MOTORES EXCETO DE AERONAVES",""]
[null,null,null,"PURIFICADORES E FILTROS DE AR E DE OLEO DE MOTORES DE AERONAVES",""]
[null,null,null,"PURIFICADORES E FILTROS DE MOTORES EXCETO DE AERONAVES",""]
["PESSOAL",null,"DESPESAS DE PESSOAL","ENCARGOS FINANCEIROS POR SERVICOS PRESTADOS POR PESSOA FISICA OU JURIDICA","DESPESAS_DE_PESSOAL"]
[null,null,null,"ENCARGOS PREVIDENCIARIOS POR SERVICOS PRESTADOS  POR  PESSOAFISICA OU JURIDICA",""]
[null,null,null,"SERVICOS DE ENCARGOS E INDENIZACOES",""]
[null,null,null,"SERVICOS PRESTADOS POR ESTAGIARIOS MONITORES E MEDICOS RESIDENTES",""]
[null,null,null,"BENEFICIOS",""]
["SERVICO",null,"ADMINISTRACAO GERAL","AQUISICAO E ASSINATURAS DE PERIODICOS","ADMINISTRACAO_GERAL"]
[null,null,null,"OUTROS SERVICOS DE PESSOA JURIDICA",""]
[null,null,null,"SERV.ESPECIALIZADOS AREAS MEDICA ODONTOLOGICA REABILITACAOHOSPITALAR E DE LABORATORIO (EXAME-ANALISE-ENSAIO-PESQUISA)",""]
[null,null,null,"SERVICO DE PUBLICIDADE PUBLICACAO IMPRESSAO REPRODUCAO E ENCADERNACAO",""]
[null,null,null,"SERVICOS DE APOIO ADMINISTRATIVO  CONSERVACAO  E LIMPEZA DE BENS MOVEIS E IMOVEIS E INSTALACOES",""]
[null,null,null,"SERVICOS DE HIGIENIZACAO E LIMPEZA",""]
{"$rows_left_out":768}
{"sheet":"Orientações de preenchimento","index":6,"n_rows":1,"n_cols":1,"rows_kept":1,"cut":false,"hidden":false,"merged":[[0,0,0,15]]}
["Orientações de Preenchimento\nPara o preenchimento deste documento, deverão ser observados os seguintes aspectos:\n1-Esta planilha é protegida por uma senha, ou seja, só é possível preencher as células liberadas. As células que não são passíveis de edição contêm fórmulas para o melhor preenchimento dos valores. Assim sento, solicitamos que não se tente desbloquear este documento. Caso haja necessidade de alterar algum conteúdo, favor entrar em contato com a Segov, por meio do e-mail atendimento@sigconsaida.mg.gov.br e que será providenciada a correção, se for o caso.\n2 - Os itens de materiais são numerados precedidos da letra \"M\" (\"M1\", \"M2\", \"M3\", etc..) e os itens de serviços são numerados precedidos da letra \"S\" (\"S1\", \"S2\", \"S3\", etc..).\n3 - Observe que na planilha só aparece espaço para inserção de 10 itens de materiais e/ou 10 itens de serviços. Mas a planilha permite a inserção de 1000 itens de materiais e/ou 1000 itens de serviços. Para que essas linhas tornem a estar disponíveis, é necessário \"reexibir\" as linhas entre a linha 15 e 1006 (no caso de materiais) e da linha 1017 à 2008 (no caso de serviços). Após reexibir, preencha com os itens, um por linha. Caso sobrem linhas em branco tanto no preenchimento dos materiais quando no preenchimento dos serviços, é necessário que essas linhas em branco sejam ocultadas novamente antes de imprimir o documento. Isso é importante para não gerar uma impressão com várias páginas sem necessidade.\n4 - A ferramenta de \"ocultar linhas\" também deve ser usada quando o objeto do convênio contemplar APENAS materiais ou APENAS serviços. No primeiro caso, tratando-se apenas da aquisição de materiais, as linhas destinadas à descrição dos serviços (linhas 1007 a 2008) devem ser ocultadas ou excluídas. No caso de a execução do objeto se restringir à contratação de serviços, as linhas destinadas à descrição dos materiais (linhas 5 a 1006) devem ser ocultadas ou excluídas. \n5 - Nas colunas \"Grupo de Material ou Serviço\" e \"Classe de Material ou Serviço\" você perceberá que abrirá uma lista de preenchimento pre-definida. A lista de \"Classe de Material ou Serviço\" será uma para cada cada \"Grupo de Material ou Serviço\". Não é possível inserir grupo ou classe de materiais ou serviços diferente do disponível. Caso haja necessidade de acrescentar algum conteúdo distinto nessas colunas, favor entrar em contato com a Segov, por meio do e-mail atendimento@sigconsaida.mg.gov.br e que será providenciada a inclusão. A base de dados utilizada para definir os grupos e classes de materiais ou serviços é o Catálogo de Materiais e Serviços do Governo do Estado de Minas Gerais - CATMAS, uma vez que, no futuro, há a intensão de que ambos os sistemas sejam vinculados.\n6 - Ao contrário das colunas \"Grupo de Material ou Serviço\" e \"Classe de Material ou Serviço\", a coluna \"Descrição do item\" é de livre digitação e deve conter a descrição do item, a mais completa possível.\n7 - As colunas destinadas aos orçamentos coletados deverão ser preenchidas e o preço unitário médio é calculado automaticamente. Caso a despesa seja mensal, os orçamentos devem ser coletados a partir desta referência.\n8 - Se a aquisição ou contratação for recorrente, gerando pagamentos mensais de mesmo valor, deverá ser selecionada a opção \"sim\" na coluna \"Despesa mensal?\" e preenchidas SOMENTE AS COLUNAS \"Valor Mensal adotado para celebração\" e \"Número de meses de execução\". As colunas \"Preço unitário adotado para Celebração\" e \"Quantidade Total de itens\" não devem ser preenchidas se a despesa for mensal. A Coluna \"Valor Mensal adotado para celebração\" deverá conter o valor adotado para celebração, que deverá estar entre o menor orçamento apresentado e o valor médio.\n9 - Se a aquisição ou contratação não tiver periodicidade mensal, por sua natureza, deverá ser selecionada a opção \"não\" na coluna \"Despesa mensal?\" e preenchidas SOMENTE AS COLUNAS \"Preço unitário adotado para Celebração\" e \"Quantidade Total de itens\" . As colunas \"Valor Mensal adotado para celebração\" e \"Número de meses de execução\" não devem ser preenchidas se a despesa não for mensal. A coluna \"Preço unitário adotado para Celebração\" deverá conter o valor adotado para celebração, que deverá estar entre o menor orçamento apresentado e o valor médio. \n10 - A última coluna é destinada às Observações. Pode-se inserir qualquer informação complementar, como por exemplo, que fora utilizado outro valor de referência para adotar o valor de celebração, justificando-se a ausência dos 3 orçamentos.\n"]

{"sheet":"Planilha","index":7,"n_rows":3000,"n_cols":26,"rows_kept":3000,"cut":false,"hidden":false,"merged":[[4,0,4,14],[5,2,6,2],[5,3,6,3],[0,0,2,14],[3,0,3,14],[2013,0,2014,14],[5,14,6,14],[5,4,5,6],[5,7,6,7],[5,8,6,8],[5,9,6,9],[5,10,6,10],[5,11,6,11],[5,12,6,12],[5,13,6,13],[5,0,6,0],[5,1,6,1]]}
["LOGOMARCA/TIMBRE DA OSC"]
[]
[]
["PLANILHA DETALHADA DE ITENS E CUSTOS DOS BENS"]
["DETALHAMENTO DE ITENS E CUSTOS DE MATERIAIS E SERVIÇOS"]
["#","GRUPO DE MATERIAL OU SERVIÇO","CLASSE DE MATERIAL OU SERVIÇO ","Descrição do item","Orçamentos - Preço Unitário/Mensal",null,null,"Preço Unitário/ Mensal médio","Despesa Mensal?","Preço unitário adotado para Celebração","Quantidade Total de itens","Valor Mensal adotado para celebração","Número de meses de execução","Valor total","Observações",null,null,null,null,null,null,null,null,null,null,{"$f":"SUBSTITUTE(D7,\" \",\"_\")","v":""}]
[null,null,null,null,"1º orçamento","2º orçamento","3º orçamento",null,null,null,null,null,null,null,null,null,null,null,null,null,null,null,null,null,null,{"$f":"SUBSTITUTE(D8,\" \",\"_\")","v":""}]
["MATERIAIS",null,null,null,null,null,null,null,null,null,null,null,null,null,null,null,null,null,null,null,null,null,null,null,null,{"$f":"SUBSTITUTE(B9,\" \",\"_\")","v":""}]
["M1",null,null,null,null,null,null,{"$f":"(E9+F9+G9)/3","v":0},null,null,null,null,null,{"$f":"IF(I9=\"Sim\",L9*M9,K9*J9)","v":0},null,null,null,null,null,null,null,null,null,null,null,""]
["M2",null,null,null,null,null,null,{"$f":"(E10+F10+G10)/3","v":0},null,null,null,null,null,0,null,null,null,null,null,null,null,null,null,null,null,""]
["M3",null,null,null,null,null,null,0,null,null,null,null,null,0,null,null,null,null,null,null,null,null,null,null,null,""]
["M4",null,null,null,null,null,null,0,null,null,null,null,null,0,null,null,null,null,null,null,null,null,null,null,null,""]
["M5",null,null,null,null,null,null,0,null,null,null,null,null,0,null,null,null,null,null,null,null,null,null,null,null,""]
["M6",null,null,null,null,null,null,0,null,null,null,null,null,0,null,null,null,null,null,null,null,null,null,null,null,""]
["M7",null,null,null,null,null,null,0,null,null,null,null,null,0,null,null,null,null,null,null,null,null,null,null,null,""]
["M8",null,null,null,null,null,null,0,null,null,null,null,null,0,null,null,null,null,null,null,null,null,null,null,null,""]
["M9",null,null,null,null,null,null,0,null,null,null,null,null,0,null,null,null,null,null,null,null,null,null,null,null,""]
["M10",null,null,null,null,null,null,0,null,null,null,null,null,0,null,null,null,null,null,null,null,null,null,null,null,""]
["M11",null,null,null,null,null,null,0,null,null,null,null,null,0,null,null,null,null,null,null,null,null,null,null,null,""]
["M12",null,null,null,null,null,null,0,null,null,null,null,null,0,null,null,null,null,null,null,null,null,null,null,null,""]
{"$rows_left_out":2981}
{"sheet":"Lista de Grupos-Classes aberta","index":8,"n_rows":788,"n_cols":2,"rows_kept":788,"cut":false,"hidden":false,"merged":[[0,0,1,0],[0,1,1,1]]}
["GRUPO DE MATERIAL OU SERVIÇO","CLASSE DE MATERIAL OU SERVIÇO "]
[]
["ACESSORIOS DE MOTORES","ACESSORIOS DIVERSOS DE MOTORES DE AERONAVES"]
[null,"ACESSORIOS DIVERSOS DE MOTORES EXCETO DE AERONAVES"]
[null,"COMPONENTES DE SISTEMA DE ARREFECIMENTO DE MOTORES EXCETO  DE AERONAVES"]
[null,"COMPONENTES DE SISTEMA DE COMBUSTIVEL DE MOTORES EXCETO DE  AERONAVES"]
[null,"COMPONENTES DO SISTEMA DE COMBUSTIVEL DE MOTORES DE AERONAVES"]
[null,"COMPONENTES DO SISTEMA ELETRICO DE MOTORES EXCETO DE AERONAVES"]
[null,"PURIFICADORES E FILTROS DE AR E DE OLEO DE MOTORES DE AERONAVES"]
[null,"PURIFICADORES E FILTROS DE MOTORES EXCETO DE AERONAVES"]
["DESPESAS DE PESSOAL","ENCARGOS FINANCEIROS POR SERVICOS PRESTADOS POR PESSOA FISICA OU JURIDICA"]
[null,"ENCARGOS PREVIDENCIARIOS POR SERVICOS PRESTADOS  POR  PESSOAFISICA OU JURIDICA"]
[null,"SERVICOS DE ENCARGOS E INDENIZACOES"]
[null,"SERVICOS PRESTADOS POR ESTAGIARIOS MONITORES E MEDICOS RESIDENTES"]
[null,"BENEFICIOS"]
["ADMINISTRACAO GERAL","AQUISICAO E ASSINATURAS DE PERIODICOS"]
[null,"OUTROS SERVICOS DE PESSOA JURIDICA"]
[null,"SERV.ESPECIALIZADOS AREAS MEDICA ODONTOLOGICA REABILITACAOHOSPITALAR E DE LABORATORIO (EXAME-ANALISE-ENSAIO-PESQUISA)"]
[null,"SERVICO DE PUBLICIDADE PUBLICACAO IMPRESSAO REPRODUCAO E ENCADERNACAO"]
[null,"SERVICOS DE APOIO ADMINISTRATIVO  CONSERVACAO  E LIMPEZA DE BENS MOVEIS E IMOVEIS E INSTALACOES"]
{"$rows_left_out":769}
{"sheet":"Lista","index":9,"n_rows":2007,"n_cols":9,"rows_kept":2007,"cut":false,"hidden":true,"merged":[[2006,3,2006,5],[2006,6,2007,6],[2006,7,2007,7]]}
["M1"]
["M2"]
["M3",null,null,null,null,"Despesa Mensal?"]
["M4"]
["M5",null,null,null,null,null,null,null,{"$f":"IF(SUMPRODUCT(-($A$2009:$A$3001=A5),-($I$3001:$I$3001)*($C$2009:$C$3001))<>H5,\"Errado\",\"OK\")","v":"OK"}]
["M6"]
["M7"]
["M8"]
["M9"]
["M10"]
["M11"]
["M12"]
["M13"]
["M14"]
["M15"]
["M16"]
["M17"]
["M18"]
["M19"]
["M20"]
{"$rows_left_out":1988}
{"sheet":"Formulas","index":10,"n_rows":2006,"n_cols":8,"rows_kept":2006,"cut":false,"hidden":true,"merged":[]}
["PLANILHA DE ITENS E CUSTOS DOS BENS E SERVIÇOS","COMPONENTES DE SISTEMA DE COMBUSTIVEL DE MOTORES, EXCETO DE  AERONAVES",null,null,null,null,{"$f":"SUBSTITUTE(A1,\" \",\"_\")","v":"PLANILHA_DE_ITENS_E_CUSTOS_DOS_BENS_E_SERVIÇOS"}]
["DESPESAS DE PESSOAL","BENEFICIOS",null,null,null,null,{"$f":"SUBSTITUTE(A2,\" \",\"_\")","v":"DESPESAS_DE_PESSOAL"}]
["ARTIGOS DE ESCRITORIO","SOFTWARES",null,null,null,null,{"$f":"SUBSTITUTE(A3,\" \",\"_\")","v":"ARTIGOS_DE_ESCRITORIO"}]
[]
[null,null,null,null,200,null,null,18]
[]
[]
[]
[]
[]
[]
[]
[]
[]
[]
[]
[]
[]
[]
[]
{"$rows_left_out":1986}